userpoints_nc_convert_4.patch

Test status
StatusResult
Last receivedMon, 12/13/2010 - 14:11:25
Last requestedMon, 12/13/2010 - 14:12:03
Last testedMon, 12/13/2010 - 14:12:32
Test count1
Environment status
MySQLfail
File information
Fileuserpoints_nc_convert_4.patch
BranchUser points Nodes and Comments - 7.x-1.x
LinkIssue Link
SummaryFAILED: [[SimpleTest]]: [MySQL] 5 pass(es), 13 fail(s), and 6 exception(s).
Details

MySQL

  1. Setup environment
  2. Detect an invalid patch URL
  3. Detect invalid repository information
  4. Detect invalid patch format
  5. Detect a non-applicable patch
  6. Detect invalid PHP syntax
  7. Detect a Drupal installation failure
  8. Detect a test run failure
  9. Detect a failing test
    Review the test failures below then if necessary run them locally until the problem has been fixed.
  10. Complete test suite with all tests passing
5 pass(es), 13 fail(s), and 6 exception(s)

Non-pass

Test namePassFailException
ExpandUserpoints Nodes and Comments (UserpointsNodeCommentTestCase) [Userpoints]5136
MessageGroupFilenameLineFunctionStatus
Invalid permission view userpoints.Roleuserpoints_nc.test35UserpointsNodeCommentTestCase->testCreateContent()
Invalid permission view own userpoints.Roleuserpoints_nc.test35UserpointsNodeCommentTestCase->testCreateContent()
Invalid permission administer userpoints.Roleuserpoints_nc.test35UserpointsNodeCommentTestCase->testCreateContent()
Invalid permission view own userpoints.Roleuserpoints_nc.test36UserpointsNodeCommentTestCase->testCreateContent()
Argument 1 passed to DrupalWebTestCase::drupalLogin() must be an instance of stdClass, boolean given, called in /var/lib/drupaltestbot/sites/default/files/checkout/sites/default/modules/userpoints_nc/userpoints_nc.test on line 38 and definedRecoverable errordrupal_web_test_case.php1127DrupalWebTestCase->drupalLogin()
Trying to get property of non-objectNoticedrupal_web_test_case.php1133DrupalWebTestCase->drupalLogin()
Trying to get property of non-objectNoticedrupal_web_test_case.php1134DrupalWebTestCase->drupalLogin()
Failed to set field name to Otheruserpoints_nc.test38UserpointsNodeCommentTestCase->testCreateContent()
Failed to set field pass to Otheruserpoints_nc.test38UserpointsNodeCommentTestCase->testCreateContent()
Found the requested form fields at userOtheruserpoints_nc.test38UserpointsNodeCommentTestCase->testCreateContent()
Trying to get property of non-objectNoticedrupal_web_test_case.php1140DrupalWebTestCase->drupalLogin()
User successfully logged in.User loginuserpoints_nc.test38UserpointsNodeCommentTestCase->testCreateContent()
Failed to set field type to ixulgOtheruserpoints_nc.test45UserpointsNodeCommentTestCase->testCreateContent()
Failed to set field userpoints_nc_points to 5Otheruserpoints_nc.test45UserpointsNodeCommentTestCase->testCreateContent()
Found the Save content type buttonOtheruserpoints_nc.test45UserpointsNodeCommentTestCase->testCreateContent()
Found the requested form fields at admin/structure/types/addOtheruserpoints_nc.test45UserpointsNodeCommentTestCase->testCreateContent()
"The content type iBDqlaSNup has been added." foundOtheruserpoints_nc.test46UserpointsNodeCommentTestCase->testCreateContent()
Undefined index: create ixulg contentNoticeuser.module2954user_role_grant_permissions()
PDOException: SQLSTATE[23000]: Integrity constraint violation: 1048 Column 'module' cannot be null: INSERT INTO {role_permission} (rid, permission, module) VALUES (:db_insert_placeholder_0, :db_insert_placeholder_1, :db_insert_placeholder_2); Array ( [:db_insert_placeholder_0] => 4 [:db_insert_placeholder_1] => create ixulg content [:db_insert_placeholder_2] => ) in user_role_grant_permissions() (line 2956 of /var/lib/drupaltestbot/sites/default/files/checkout/modules/user/user.module).Uncaught exceptiondatabase.inc2005PDOStatement->execute()

All

Test namePassFailException
ExpandUserpoints Nodes and Comments (UserpointsNodeCommentTestCase) [Userpoints]5136
MessageGroupFilenameLineFunctionStatus
Invalid permission view userpoints.Roleuserpoints_nc.test35UserpointsNodeCommentTestCase->testCreateContent()
Invalid permission view own userpoints.Roleuserpoints_nc.test35UserpointsNodeCommentTestCase->testCreateContent()
Invalid permission administer userpoints.Roleuserpoints_nc.test35UserpointsNodeCommentTestCase->testCreateContent()
Invalid permission view own userpoints.Roleuserpoints_nc.test36UserpointsNodeCommentTestCase->testCreateContent()
Argument 1 passed to DrupalWebTestCase::drupalLogin() must be an instance of stdClass, boolean given, called in /var/lib/drupaltestbot/sites/default/files/checkout/sites/default/modules/userpoints_nc/userpoints_nc.test on line 38 and definedRecoverable errordrupal_web_test_case.php1127DrupalWebTestCase->drupalLogin()
Trying to get property of non-objectNoticedrupal_web_test_case.php1133DrupalWebTestCase->drupalLogin()
Trying to get property of non-objectNoticedrupal_web_test_case.php1134DrupalWebTestCase->drupalLogin()
Failed to set field name to Otheruserpoints_nc.test38UserpointsNodeCommentTestCase->testCreateContent()
Failed to set field pass to Otheruserpoints_nc.test38UserpointsNodeCommentTestCase->testCreateContent()
Found the requested form fields at userOtheruserpoints_nc.test38UserpointsNodeCommentTestCase->testCreateContent()
Trying to get property of non-objectNoticedrupal_web_test_case.php1140DrupalWebTestCase->drupalLogin()
User successfully logged in.User loginuserpoints_nc.test38UserpointsNodeCommentTestCase->testCreateContent()
Failed to set field type to ixulgOtheruserpoints_nc.test45UserpointsNodeCommentTestCase->testCreateContent()
Failed to set field userpoints_nc_points to 5Otheruserpoints_nc.test45UserpointsNodeCommentTestCase->testCreateContent()
Found the Save content type buttonOtheruserpoints_nc.test45UserpointsNodeCommentTestCase->testCreateContent()
Found the requested form fields at admin/structure/types/addOtheruserpoints_nc.test45UserpointsNodeCommentTestCase->testCreateContent()
"The content type iBDqlaSNup has been added." foundOtheruserpoints_nc.test46UserpointsNodeCommentTestCase->testCreateContent()
Undefined index: create ixulg contentNoticeuser.module2954user_role_grant_permissions()
PDOException: SQLSTATE[23000]: Integrity constraint violation: 1048 Column 'module' cannot be null: INSERT INTO {role_permission} (rid, permission, module) VALUES (:db_insert_placeholder_0, :db_insert_placeholder_1, :db_insert_placeholder_2); Array ( [:db_insert_placeholder_0] => 4 [:db_insert_placeholder_1] => create ixulg content [:db_insert_placeholder_2] => ) in user_role_grant_permissions() (line 2956 of /var/lib/drupaltestbot/sites/default/files/checkout/modules/user/user.module).Uncaught exceptiondatabase.inc2005PDOStatement->execute()