gmap-gmap_markers-location-2185395-15.patch

Test status
StatusResult
Last receivedFri, 09/11/2015 - 07:21:01
Last requestedFri, 09/11/2015 - 07:21:01
Last testedFri, 09/11/2015 - 07:23:44
Test count2
Environment status
MySQLfail
File information
Filegmap-gmap_markers-location-2185395-15.patch
BranchGMap Module - 7.x-2.x
LinkIssue Link
SummaryFAILED: [[SimpleTest]]: [MySQL] 127 pass(es), 0 fail(s), and 5 exception(s).
Details

MySQL

  1. Setup environment
  2. Detect an invalid patch URL
  3. Detect invalid repository information
  4. Detect invalid patch format
  5. Detect a non-applicable patch
  6. Detect invalid PHP syntax
  7. Detect a Drupal installation failure
  8. Detect a test run failure
  9. Detect a failing test
    Review the test failures below then if necessary run them locally until the problem has been fixed.
  10. Complete test suite with all tests passing
127 pass(es), 0 fail(s), and 5 exception(s)

Non-pass

Test namePassFailException
ExpandGMap legacy API defaults refactoring checks (GmapDefaultsTestCase) [GMap]001
MessageGroupFilenameLineFunctionStatus
PDOException: SQLSTATE[42S02]: Base table or view not found: 1146 Table 'drupaltestbotmysql.simpletest225648node_type' doesn't exist: SELECT nt.* FROM {node_type} nt WHERE (disabled = :db_condition_placeholder_0) ORDER BY nt.type ASC; Array ( [:db_condition_placeholder_0] => 0 ) in _node_types_build() (line 739 of /var/lib/drupaltestbot/sites/default/files/checkout/modules/node/node.module).Uncaught exceptiondatabase.inc2171PDOStatement->execute()
ExpandGMap legacy macro API defaults refactoring checks (GmapMacroToolboxTestCase) [GMap]401
MessageGroupFilenameLineFunctionStatus
PDOException: SQLSTATE[42S02]: Base table or view not found: 1146 Table 'drupaltestbotmysql.simpletest743625node_type' doesn't exist: SELECT nt.* FROM {node_type} nt WHERE (disabled = :db_condition_placeholder_0) ORDER BY nt.type ASC; Array ( [:db_condition_placeholder_0] => 0 ) in _node_types_build() (line 739 of /var/lib/drupaltestbot/sites/default/files/checkout/modules/node/node.module).Uncaught exceptiondatabase.inc2171PDOStatement->execute()
ExpandGMap Macro checks (GMapMacroTest) [GMap]003
MessageGroupFilenameLineFunctionStatus
PDOException: SQLSTATE[42S02]: Base table or view not found: 1146 Table 'drupaltestbotmysql.simpletest523104node_type' doesn't exist: SELECT nt.* FROM {node_type} nt WHERE (disabled = :db_condition_placeholder_0) ORDER BY nt.type ASC; Array ( [:db_condition_placeholder_0] => 0 ) in _node_types_build() (line 739 of /var/lib/drupaltestbot/sites/default/files/checkout/modules/node/node.module).Uncaught exceptiondatabase.inc2171PDOStatement->execute()
PDOException: SQLSTATE[42S02]: Base table or view not found: 1146 Table 'drupaltestbotmysql.simpletest905092node_type' doesn't exist: SELECT nt.* FROM {node_type} nt WHERE (disabled = :db_condition_placeholder_0) ORDER BY nt.type ASC; Array ( [:db_condition_placeholder_0] => 0 ) in _node_types_build() (line 739 of /var/lib/drupaltestbot/sites/default/files/checkout/modules/node/node.module).Uncaught exceptiondatabase.inc2171PDOStatement->execute()
PDOException: SQLSTATE[42S02]: Base table or view not found: 1146 Table 'drupaltestbotmysql.simpletest930855node_type' doesn't exist: SELECT nt.* FROM {node_type} nt WHERE (disabled = :db_condition_placeholder_0) ORDER BY nt.type ASC; Array ( [:db_condition_placeholder_0] => 0 ) in _node_types_build() (line 739 of /var/lib/drupaltestbot/sites/default/files/checkout/modules/node/node.module).Uncaught exceptiondatabase.inc2171PDOStatement->execute()

All

Test namePassFailException
LeafGMap API sanity checks (GMapSimpleAPITest) [GMap]1500
LeafGMAP Forms (testGmapFormsTestCase) [GMap]1400
ExpandGMap legacy API defaults refactoring checks (GmapDefaultsTestCase) [GMap]001
MessageGroupFilenameLineFunctionStatus
PDOException: SQLSTATE[42S02]: Base table or view not found: 1146 Table 'drupaltestbotmysql.simpletest225648node_type' doesn't exist: SELECT nt.* FROM {node_type} nt WHERE (disabled = :db_condition_placeholder_0) ORDER BY nt.type ASC; Array ( [:db_condition_placeholder_0] => 0 ) in _node_types_build() (line 739 of /var/lib/drupaltestbot/sites/default/files/checkout/modules/node/node.module).Uncaught exceptiondatabase.inc2171PDOStatement->execute()
LeafGMap legacy API refactoring checks (GmapPolylineToolboxTestCase) [GMap]1400
ExpandGMap legacy macro API defaults refactoring checks (GmapMacroToolboxTestCase) [GMap]401
MessageGroupFilenameLineFunctionStatus
PDOException: SQLSTATE[42S02]: Base table or view not found: 1146 Table 'drupaltestbotmysql.simpletest743625node_type' doesn't exist: SELECT nt.* FROM {node_type} nt WHERE (disabled = :db_condition_placeholder_0) ORDER BY nt.type ASC; Array ( [:db_condition_placeholder_0] => 0 ) in _node_types_build() (line 739 of /var/lib/drupaltestbot/sites/default/files/checkout/modules/node/node.module).Uncaught exceptiondatabase.inc2171PDOStatement->execute()
ExpandGMap Macro checks (GMapMacroTest) [GMap]003
MessageGroupFilenameLineFunctionStatus
PDOException: SQLSTATE[42S02]: Base table or view not found: 1146 Table 'drupaltestbotmysql.simpletest523104node_type' doesn't exist: SELECT nt.* FROM {node_type} nt WHERE (disabled = :db_condition_placeholder_0) ORDER BY nt.type ASC; Array ( [:db_condition_placeholder_0] => 0 ) in _node_types_build() (line 739 of /var/lib/drupaltestbot/sites/default/files/checkout/modules/node/node.module).Uncaught exceptiondatabase.inc2171PDOStatement->execute()
PDOException: SQLSTATE[42S02]: Base table or view not found: 1146 Table 'drupaltestbotmysql.simpletest905092node_type' doesn't exist: SELECT nt.* FROM {node_type} nt WHERE (disabled = :db_condition_placeholder_0) ORDER BY nt.type ASC; Array ( [:db_condition_placeholder_0] => 0 ) in _node_types_build() (line 739 of /var/lib/drupaltestbot/sites/default/files/checkout/modules/node/node.module).Uncaught exceptiondatabase.inc2171PDOStatement->execute()
PDOException: SQLSTATE[42S02]: Base table or view not found: 1146 Table 'drupaltestbotmysql.simpletest930855node_type' doesn't exist: SELECT nt.* FROM {node_type} nt WHERE (disabled = :db_condition_placeholder_0) ORDER BY nt.type ASC; Array ( [:db_condition_placeholder_0] => 0 ) in _node_types_build() (line 739 of /var/lib/drupaltestbot/sites/default/files/checkout/modules/node/node.module).Uncaught exceptiondatabase.inc2171PDOStatement->execute()
LeafGMAP Macro Forms (testGmapMacroFormsTestCase) [GMap]2600
LeafGMAP Taxonomy (testGmapTaxonomyFormsTestCase) [GMap]2200
LeafLocation Gmap Find Address button checks (LGFATestCase) [GMap]3200