loading_tokens_uri4.patch

Test status
StatusResult
Last receivedThu, 10/21/2010 - 00:02:38
Last requestedThu, 10/21/2010 - 00:16:28
Last testedThu, 10/21/2010 - 00:18:42
Test count1
Environment status
MySQLfail
File information
Fileloading_tokens_uri4.patch
BranchPrivatemsg - 7.x-1.x
LinkIssue Link
SummaryFAILED: [[SimpleTest]]: [MySQL] 1,416 pass(es), 267 fail(s), and 59 exception(s).
Details

MySQL

  1. Setup environment
  2. Detect an invalid patch URL
  3. Detect invalid repository information
  4. Detect invalid patch format
  5. Detect a non-applicable patch
  6. Detect invalid PHP syntax
  7. Detect a Drupal installation failure
  8. Detect a test run failure
  9. Detect a failing test
    Review the test failures below then if necessary run them locally until the problem has been fixed.
  10. Complete test suite with all tests passing
1,416 pass(es), 267 fail(s), and 59 exception(s)

Non-pass

Test namePassFailException
ExpandPrivatemsg API functionality. (PrivatemsgAPITestCase) [Privatemsg]2402
MessageGroupFilenameLineFunctionStatus
PDOException: SQLSTATE[HY000]: General error: 1366 Incorrect integer value: 'filtered_html' for column 'format' at row 1: INSERT INTO {pm_message} (subject, author, body, format, timestamp, has_tokens) VALUES (:db_insert_placeholder_0, :db_insert_placeholder_1, :db_insert_placeholder_2, :db_insert_placeholder_3, :db_insert_placeholder_4, :db_insert_placeholder_5); Array ( [:db_insert_placeholder_0] => normal message [:db_insert_placeholder_1] => 2 [:db_insert_placeholder_2] => Body text [:db_insert_placeholder_3] => filtered_html [:db_insert_placeholder_4] => 1287620218 [:db_insert_placeholder_5] => 0 ) in _privatemsg_send() (line 1768 of /var/www/sites/default/files/checkout/sites/default/modules/privatemsg/privatemsg.module).Uncaught exceptiondatabase.inc1970PDOStatement->execute()
PDOException: %message in _privatemsg_send() (line 1768 of /var/www/sites/default/files/checkout/sites/default/modules/privatemsg/privatemsg.module).Uncaught exceptiondatabase.inc1970PDOStatement->execute()
ExpandPrivatemsg fields. (PrivatemsgFieldsTestCase) [Privatemsg]89123
MessageGroupFilenameLineFunctionStatus
Undefined variable: url_targetNoticedrupal_web_test_case.php2324DrupalWebTestCase->clickLink()
Clicked link dJxMitee () from http://localhost/checkout/?q=messagesBrowserprivatemsg.test853PrivatemsgFieldsTestCase->testSingleField()
Message body displayed.Otherprivatemsg.test855PrivatemsgFieldsTestCase->testSingleField()
Content of new field is displayed.Otherprivatemsg.test856PrivatemsgFieldsTestCase->testSingleField()
Failed to set field body[value] to zLotJenVbCxeXZXrXgh3uwBEYFXT7rnpsKuyaSZFgiYfez7bOfOtherprivatemsg.test863PrivatemsgFieldsTestCase->testSingleField()
Failed to set field field_wj0oxpjq[und][0][value] to pa996jIBeoWog31iRXhNpj6TXMUdseR80oGP03Opy8VFqMzvuqOtherprivatemsg.test863PrivatemsgFieldsTestCase->testSingleField()
Found the Send message buttonOtherprivatemsg.test863PrivatemsgFieldsTestCase->testSingleField()
Found the requested form fields at Otherprivatemsg.test863PrivatemsgFieldsTestCase->testSingleField()
Undefined variable: url_targetNoticedrupal_web_test_case.php2324DrupalWebTestCase->clickLink()
Clicked link dJxMitee () from http://localhost/checkout/?q=messagesBrowserprivatemsg.test868PrivatemsgFieldsTestCase->testSingleField()
Message body displayed.Otherprivatemsg.test870PrivatemsgFieldsTestCase->testSingleField()
Content of new field is displayed.Otherprivatemsg.test871PrivatemsgFieldsTestCase->testSingleField()
Undefined variable: url_targetNoticedrupal_web_test_case.php2324DrupalWebTestCase->clickLink()
Clicked link szHRTysr () from http://localhost/checkout/?q=messagesBrowserprivatemsg.test911PrivatemsgFieldsTestCase->testEmptyImage()
Message body displayed.Otherprivatemsg.test913PrivatemsgFieldsTestCase->testEmptyImage()
ExpandPrivatemsg Filter functionality. (PrivatemsgFilterTestCase) [Privatemsg]85262
MessageGroupFilenameLineFunctionStatus
Message sent confirmation displayedOtherprivatemsg_filter.test39PrivatemsgFilterTestCase->testInboxSentHandling()
Thread displayed in "Sent messages" for author.Otherprivatemsg_filter.test46PrivatemsgFilterTestCase->testInboxSentHandling()
Thread displayed in "All messages" for author.Otherprivatemsg_filter.test48PrivatemsgFilterTestCase->testInboxSentHandling()
Thread displayed in inbox for recipient.Otherprivatemsg_filter.test53PrivatemsgFilterTestCase->testInboxSentHandling()
Thread displayed in "All messages." for recipient.Otherprivatemsg_filter.test57PrivatemsgFilterTestCase->testInboxSentHandling()
Undefined variable: url_targetNoticedrupal_web_test_case.php2324DrupalWebTestCase->clickLink()
Clicked link oYRDWMQz4C3S6xIqPCen () from http://localhost/checkout/?q=messages/listBrowserprivatemsg_filter.test60PrivatemsgFilterTestCase->testInboxSentHandling()
Failed to set field body[value] to qGpi2I6wDsryOqiCPDZzAhISOLVFv4PDCViSS06HPG3LFuhboFAXV9As044q1rOFo7BPymuUU2E3iOCoVBFrmlICGeohadevC32dOtherprivatemsg_filter.test64PrivatemsgFilterTestCase->testInboxSentHandling()
Found the Send message buttonOtherprivatemsg_filter.test64PrivatemsgFilterTestCase->testInboxSentHandling()
Found the requested form fields at Otherprivatemsg_filter.test64PrivatemsgFilterTestCase->testInboxSentHandling()
Message sent confirmation displayedOtherprivatemsg_filter.test65PrivatemsgFilterTestCase->testInboxSentHandling()
Thread displayed in "Sent messages" for recipient.Otherprivatemsg_filter.test68PrivatemsgFilterTestCase->testInboxSentHandling()
Thread displayed in inbox for author.Otherprivatemsg_filter.test72PrivatemsgFilterTestCase->testInboxSentHandling()
Failed to set field list[1] to 1Otherprivatemsg_filter.test79PrivatemsgFilterTestCase->testInboxSentHandling()
Found the Delete buttonOtherprivatemsg_filter.test79PrivatemsgFilterTestCase->testInboxSentHandling()
Found the requested form fields at Otherprivatemsg_filter.test79PrivatemsgFilterTestCase->testInboxSentHandling()
Undefined variable: url_targetNoticedrupal_web_test_case.php2324DrupalWebTestCase->clickLink()
Clicked link oYRDWMQz4C3S6xIqPCen () from http://localhost/checkout/?q=messagesBrowserprivatemsg_filter.test87PrivatemsgFilterTestCase->testInboxSentHandling()
Failed to set field body[value] to citynJy7wfYuPy3f2t8qCGLgvYR979OaFbPbfK0zkVhKWngqPhYLPgdDLKUfTPHAqNIp0mwbIpgeN6eJ8ArLROhfEYYlSLq6UmunOtherprivatemsg_filter.test91PrivatemsgFilterTestCase->testInboxSentHandling()
Found the Send message buttonOtherprivatemsg_filter.test91PrivatemsgFilterTestCase->testInboxSentHandling()
Found the requested form fields at Otherprivatemsg_filter.test91PrivatemsgFilterTestCase->testInboxSentHandling()
Message sent confirmation displayedOtherprivatemsg_filter.test92PrivatemsgFilterTestCase->testInboxSentHandling()
Thread displayed again in inbox for author.Otherprivatemsg_filter.test97PrivatemsgFilterTestCase->testInboxSentHandling()
Failed to set field list[1] to 1Otherprivatemsg_filter.test104PrivatemsgFilterTestCase->testInboxSentHandling()
Found the Archive buttonOtherprivatemsg_filter.test104PrivatemsgFilterTestCase->testInboxSentHandling()
Found the requested form fields at Otherprivatemsg_filter.test104PrivatemsgFilterTestCase->testInboxSentHandling()
Confirmation message displayedOtherprivatemsg_filter.test105PrivatemsgFilterTestCase->testInboxSentHandling()
Thread still displayed in "All messages" list.Otherprivatemsg_filter.test109PrivatemsgFilterTestCase->testInboxSentHandling()
ExpandPrivatemsg filter widget (PrivatemsgFilterWidgetTestCase) [Privatemsg]1701
MessageGroupFilenameLineFunctionStatus
PDOException: %message in _privatemsg_send() (line 1768 of /var/www/sites/default/files/checkout/sites/default/modules/privatemsg/privatemsg.module).Uncaught exceptiondatabase.inc1970PDOStatement->execute()
ExpandPrivatemsg functionality. (PrivatemsgTestCase) [Privatemsg]21610514
MessageGroupFilenameLineFunctionStatus
PDOException: %message in _privatemsg_send() (line 1768 of /var/www/sites/default/files/checkout/sites/default/modules/privatemsg/privatemsg.module).Uncaught exceptiondatabase.inc1970PDOStatement->execute()
PDOException: %message in _privatemsg_send() (line 1768 of /var/www/sites/default/files/checkout/sites/default/modules/privatemsg/privatemsg.module).Uncaught exceptiondatabase.inc1970PDOStatement->execute()
Invalid permission .Roleprivatemsg.test204PrivatemsgTestCase->testWriteReplyPrivatemsg()
Argument 1 passed to DrupalWebTestCase::drupalLogin() must be an instance of stdClass, boolean given, called in /var/www/sites/default/files/checkout/sites/default/modules/privatemsg/privatemsg.test on line 209 and definedRecoverable errordrupal_web_test_case.php1112DrupalWebTestCase->drupalLogin()
Trying to get property of non-objectNoticedrupal_web_test_case.php1118DrupalWebTestCase->drupalLogin()
Trying to get property of non-objectNoticedrupal_web_test_case.php1119DrupalWebTestCase->drupalLogin()
Failed to set field name to Otherprivatemsg.test209PrivatemsgTestCase->testWriteReplyPrivatemsg()
Failed to set field pass to Otherprivatemsg.test209PrivatemsgTestCase->testWriteReplyPrivatemsg()
Found the requested form fields at userOtherprivatemsg.test209PrivatemsgTestCase->testWriteReplyPrivatemsg()
Trying to get property of non-objectNoticedrupal_web_test_case.php1125DrupalWebTestCase->drupalLogin()
User successfully logged in.User loginprivatemsg.test209PrivatemsgTestCase->testWriteReplyPrivatemsg()
Failed to set field recipient to sqrDoIwP [user]Otherprivatemsg.test270PrivatemsgTestCase->testWriteReplyPrivatemsg()
Failed to set field subject to pEBMxesl4cg89FkO3wbEOtherprivatemsg.test270PrivatemsgTestCase->testWriteReplyPrivatemsg()
Failed to set field body[value] to iBrhGeIThk0e0QFUAECPqqUGD5Bur3azouX8kEcqNBwYXdyZoej4jqx3SI28js7uftetB5gUAVy9A3JnPT6tEcKEX3KW8eDTzlUGOtherprivatemsg.test270PrivatemsgTestCase->testWriteReplyPrivatemsg()
Found the Send message buttonOtherprivatemsg.test270PrivatemsgTestCase->testWriteReplyPrivatemsg()
Found the requested form fields at messages/newOtherprivatemsg.test270PrivatemsgTestCase->testWriteReplyPrivatemsg()
Message sent confirmation displayed.Otherprivatemsg.test271PrivatemsgTestCase->testWriteReplyPrivatemsg()
Failed to set field recipient to sqrDoIwP, wzEKacMgOtherprivatemsg.test273PrivatemsgTestCase->testWriteReplyPrivatemsg()
Failed to set field subject to goDYEMh6eLWQ6lAyZ1SQOtherprivatemsg.test273PrivatemsgTestCase->testWriteReplyPrivatemsg()
Failed to set field body[value] to qTByRb73vQd1sNteOhltTAuGDTsPWBevSjqnG3VznOMNpmwh7w6pcj0pHjwhrOK0PTiNp7zFJ7jvlJtuUCobqLVxd6SwSwJLOi6JOtherprivatemsg.test273PrivatemsgTestCase->testWriteReplyPrivatemsg()
Found the Send message buttonOtherprivatemsg.test273PrivatemsgTestCase->testWriteReplyPrivatemsg()
Found the requested form fields at messages/newOtherprivatemsg.test273PrivatemsgTestCase->testWriteReplyPrivatemsg()
Message sent confirmation displayed.Otherprivatemsg.test274PrivatemsgTestCase->testWriteReplyPrivatemsg()
Failed to set field recipient to Otherprivatemsg.test276PrivatemsgTestCase->testWriteReplyPrivatemsg()
Failed to set field subject to nBdxPFEeIivOWGsRmFytOtherprivatemsg.test276PrivatemsgTestCase->testWriteReplyPrivatemsg()
Failed to set field body[value] to wLmK4ZnlNURYlR5fXC8KjNeog5J6Iq4xWNiLdS8YXmxPCnopwuGGdLqCjKAdSp0yQ6vlNDyHN9XfwP8yQejiwgfe2tMHKwm7e6FkOtherprivatemsg.test276PrivatemsgTestCase->testWriteReplyPrivatemsg()
Found the Send message buttonOtherprivatemsg.test276PrivatemsgTestCase->testWriteReplyPrivatemsg()
Found the requested form fields at messages/newOtherprivatemsg.test276PrivatemsgTestCase->testWriteReplyPrivatemsg()
Message was not sent.Otherprivatemsg.test277PrivatemsgTestCase->testWriteReplyPrivatemsg()
Failed to set field recipient to q4zZZOtherprivatemsg.test279PrivatemsgTestCase->testWriteReplyPrivatemsg()
Failed to set field subject to rrv2KIuqQVse3HS5cDuROtherprivatemsg.test279PrivatemsgTestCase->testWriteReplyPrivatemsg()
Failed to set field body[value] to h2RqQB328OEpMJatQaWtqY2b9bpt5aNaUuJDKfU5kun094RMVTe5d8DBXJFVibbS0Xo5u6431tjOGxQwwu4LojGpFU2F006uhPX2Otherprivatemsg.test279PrivatemsgTestCase->testWriteReplyPrivatemsg()
Found the Send message buttonOtherprivatemsg.test279PrivatemsgTestCase->testWriteReplyPrivatemsg()
Found the requested form fields at messages/newOtherprivatemsg.test279PrivatemsgTestCase->testWriteReplyPrivatemsg()
Message was not sent.Otherprivatemsg.test280PrivatemsgTestCase->testWriteReplyPrivatemsg()
Message about non-existing user displayed.Otherprivatemsg.test281PrivatemsgTestCase->testWriteReplyPrivatemsg()
Failed to set field recipient to sqrDoIwPOtherprivatemsg.test283PrivatemsgTestCase->testWriteReplyPrivatemsg()
Failed to set field subject to aRDXAChu6E0ZgGXsVXrXOtherprivatemsg.test283PrivatemsgTestCase->testWriteReplyPrivatemsg()
Failed to set field body[value] to Otherprivatemsg.test283PrivatemsgTestCase->testWriteReplyPrivatemsg()
Found the Send message buttonOtherprivatemsg.test283PrivatemsgTestCase->testWriteReplyPrivatemsg()
Found the requested form fields at messages/newOtherprivatemsg.test283PrivatemsgTestCase->testWriteReplyPrivatemsg()
Message sent confirmation displayed.Otherprivatemsg.test284PrivatemsgTestCase->testWriteReplyPrivatemsg()
Failed to set field recipient to sqrDoIwPOtherprivatemsg.test286PrivatemsgTestCase->testWriteReplyPrivatemsg()
Failed to set field subject to Otherprivatemsg.test286PrivatemsgTestCase->testWriteReplyPrivatemsg()
Failed to set field body[value] to vGmYwEjBZlngMVMz2PxhOPxnpk8HshStWZqaqdFr5gHs6IKyGkOB4b5SaqPp5Dvi7zY3FIdh48dF6NaovEko9gTdxaWADd8JX91FOtherprivatemsg.test286PrivatemsgTestCase->testWriteReplyPrivatemsg()
Found the Send message buttonOtherprivatemsg.test286PrivatemsgTestCase->testWriteReplyPrivatemsg()
Found the requested form fields at messages/newOtherprivatemsg.test286PrivatemsgTestCase->testWriteReplyPrivatemsg()
Message sent confirmation displayed.Otherprivatemsg.test287PrivatemsgTestCase->testWriteReplyPrivatemsg()
Failed to set field recipient to sqrDoIwPOtherprivatemsg.test289PrivatemsgTestCase->testWriteReplyPrivatemsg()
Failed to set field subject to Otherprivatemsg.test289PrivatemsgTestCase->testWriteReplyPrivatemsg()
Failed to set field body[value] to Otherprivatemsg.test289PrivatemsgTestCase->testWriteReplyPrivatemsg()
Found the Send message buttonOtherprivatemsg.test289PrivatemsgTestCase->testWriteReplyPrivatemsg()
Found the requested form fields at messages/newOtherprivatemsg.test289PrivatemsgTestCase->testWriteReplyPrivatemsg()
Empty subject message displayed.Otherprivatemsg.test290PrivatemsgTestCase->testWriteReplyPrivatemsg()
Failed to set field recipient to fCFLk, sqrDoIwPOtherprivatemsg.test292PrivatemsgTestCase->testWriteReplyPrivatemsg()
Failed to set field subject to nWGi4SZsSScksfOafUCPOtherprivatemsg.test292PrivatemsgTestCase->testWriteReplyPrivatemsg()
Failed to set field body[value] to akKXWzPibMmf3yyJmSnoepUWGsWTQSvP4q6CJsrJASpEvUVruzs7STiW1bq02OR5mxVCiNUvk5zWT7nqvPqSrpKQ1noYVjoAa530Otherprivatemsg.test292PrivatemsgTestCase->testWriteReplyPrivatemsg()
Found the Send message buttonOtherprivatemsg.test292PrivatemsgTestCase->testWriteReplyPrivatemsg()
Found the requested form fields at messages/newOtherprivatemsg.test292PrivatemsgTestCase->testWriteReplyPrivatemsg()
Message sent confirmation displayed.Otherprivatemsg.test293PrivatemsgTestCase->testWriteReplyPrivatemsg()
Message about non-existing user displayed.Otherprivatemsg.test294PrivatemsgTestCase->testWriteReplyPrivatemsg()
Failed to set field recipient to wzEKacMgOtherprivatemsg.test296PrivatemsgTestCase->testWriteReplyPrivatemsg()
Failed to set field subject to dwhw3u0QtS5wyxQijL6yOtherprivatemsg.test296PrivatemsgTestCase->testWriteReplyPrivatemsg()
Failed to set field body[value] to tU4Kfrdt8XtASppf5OgnMgbiItAxpJBFVMCI0V1zTYdllD0SmCuJ9Fkep4HgmcNyzG823CGkvvoytJj6Q1mlQZY9WH19zzm151qu<b>formatted message #1</b>Otherprivatemsg.test296PrivatemsgTestCase->testWriteReplyPrivatemsg()
Failed to set field body[format] to 3Otherprivatemsg.test296PrivatemsgTestCase->testWriteReplyPrivatemsg()
Found the Send message buttonOtherprivatemsg.test296PrivatemsgTestCase->testWriteReplyPrivatemsg()
Found the requested form fields at messages/newOtherprivatemsg.test296PrivatemsgTestCase->testWriteReplyPrivatemsg()
Message sent confirmation displayed.Otherprivatemsg.test297PrivatemsgTestCase->testWriteReplyPrivatemsg()
Sent message subject found.Otherprivatemsg.test304PrivatemsgTestCase->testWriteReplyPrivatemsg()
Undefined variable: url_targetNoticedrupal_web_test_case.php2324DrupalWebTestCase->clickLink()
Clicked link goDYEMh6eLWQ6lAyZ1SQ () from http://localhost/checkout/?q=messagesBrowserprivatemsg.test305PrivatemsgTestCase->testWriteReplyPrivatemsg()
Found message body.Otherprivatemsg.test307PrivatemsgTestCase->testWriteReplyPrivatemsg()
Failed to set field body[value] to s0GeNPhINEdzsOB1rL4jPMEpQSKD6YJbctbSZhBRQQyEYbBsM3ighhvD7x5gOFbJDXq5itvnDfjFhNWZj7d7ScSEwmjht5HbWfveOtherprivatemsg.test318PrivatemsgTestCase->testWriteReplyPrivatemsg()
Found the Send message buttonOtherprivatemsg.test318PrivatemsgTestCase->testWriteReplyPrivatemsg()
Found the requested form fields at Otherprivatemsg.test318PrivatemsgTestCase->testWriteReplyPrivatemsg()
New message body displayed.Otherprivatemsg.test319PrivatemsgTestCase->testWriteReplyPrivatemsg()
Failed to set field body[value] to Otherprivatemsg.test321PrivatemsgTestCase->testWriteReplyPrivatemsg()
Found the Send message buttonOtherprivatemsg.test321PrivatemsgTestCase->testWriteReplyPrivatemsg()
Found the requested form fields at Otherprivatemsg.test321PrivatemsgTestCase->testWriteReplyPrivatemsg()
"You must include a message in your reply." foundOtherprivatemsg.test322PrivatemsgTestCase->testWriteReplyPrivatemsg()
Undefined variable: url_targetNoticedrupal_web_test_case.php2324DrupalWebTestCase->clickLink()
Clicked link dwhw3u0QtS5wyxQijL6y () from http://localhost/checkout/?q=messagesBrowserprivatemsg.test329PrivatemsgTestCase->testWriteReplyPrivatemsg()
Found formatted message body.Otherprivatemsg.test330PrivatemsgTestCase->testWriteReplyPrivatemsg()
Failed to set field body[value] to knSdF6sMzcgDEgqbR4MHk04rRtAR6mZjxY6jQIc2mLZfy83fkiVCpJhs2GGcTv5I34FDWRLHgy1q9ua2oPkmIU6dDqWTtcvIi0Z9<b>formatted message #2</b>Otherprivatemsg.test332PrivatemsgTestCase->testWriteReplyPrivatemsg()
Found the Send message buttonOtherprivatemsg.test332PrivatemsgTestCase->testWriteReplyPrivatemsg()
Found the requested form fields at Otherprivatemsg.test332PrivatemsgTestCase->testWriteReplyPrivatemsg()
New reply body displayed.Otherprivatemsg.test334PrivatemsgTestCase->testWriteReplyPrivatemsg()
Sent message subject found.Otherprivatemsg.test341PrivatemsgTestCase->testWriteReplyPrivatemsg()
Sent message subject found.Otherprivatemsg.test342PrivatemsgTestCase->testWriteReplyPrivatemsg()
Sent message subject found.Otherprivatemsg.test343PrivatemsgTestCase->testWriteReplyPrivatemsg()
Sent message subject found.Otherprivatemsg.test344PrivatemsgTestCase->testWriteReplyPrivatemsg()
Sent message subject found.Otherprivatemsg.test345PrivatemsgTestCase->testWriteReplyPrivatemsg()
Undefined variable: url_targetNoticedrupal_web_test_case.php2324DrupalWebTestCase->clickLink()
Clicked link pEBMxesl4cg89FkO3wbE () from http://localhost/checkout/?q=messagesBrowserprivatemsg.test352PrivatemsgTestCase->testWriteReplyPrivatemsg()
Found message body.Otherprivatemsg.test354PrivatemsgTestCase->testWriteReplyPrivatemsg()
Trying to get property of non-objectNoticeprivatemsg.test358PrivatemsgTestCase->testWriteReplyPrivatemsg()
"Between you and " foundOtherprivatemsg.test358PrivatemsgTestCase->testWriteReplyPrivatemsg()
Undefined variable: url_targetNoticedrupal_web_test_case.php2324DrupalWebTestCase->clickLink()
Clicked link goDYEMh6eLWQ6lAyZ1SQ () from http://localhost/checkout/?q=messagesBrowserprivatemsg.test362PrivatemsgTestCase->testWriteReplyPrivatemsg()
Found message body.Otherprivatemsg.test364PrivatemsgTestCase->testWriteReplyPrivatemsg()
Found reply body.Otherprivatemsg.test366PrivatemsgTestCase->testWriteReplyPrivatemsg()
PDOException: %message in _privatemsg_send() (line 1768 of /var/www/sites/default/files/checkout/sites/default/modules/privatemsg/privatemsg.module).Uncaught exceptiondatabase.inc1970PDOStatement->execute()
Message sent confirmation displayedOtherprivatemsg.test466PrivatemsgTestCase->testReadAllPermission()
Notice about read all mode displayed.Otherprivatemsg.test471PrivatemsgTestCase->testReadAllPermission()
Failed to set field body[value] to c0atBXxsJzJakvouipIFpihTVZXUMBabxBOaWy4eUmGbfZBjC4M6dIBidIXfA5CIWQ2rAdFXxvumK7cltJC63odzKzEXKVfyeorVOtherprivatemsg.test477PrivatemsgTestCase->testReadAllPermission()
Found the Send message buttonOtherprivatemsg.test477PrivatemsgTestCase->testReadAllPermission()
Found the requested form fields at messages/view/1Otherprivatemsg.test477PrivatemsgTestCase->testReadAllPermission()
First message body displayed.Otherprivatemsg.test484PrivatemsgTestCase->testReadAllPermission()
New message body displayed.Otherprivatemsg.test485PrivatemsgTestCase->testReadAllPermission()
Admin is listed as recipient for every message once.Otherprivatemsg.test491PrivatemsgTestCase->testReadAllPermission()
Failed to set field body[value] to okMgjmpeUDwQGDHsnbvZTiGS2XeujW7S3tDMomN8WkLcTxmgOPnnZYv3diQld1MRBSjryEImrihujvXNZqVS3QdiUEDpKyBwqVTAOtherprivatemsg.test498PrivatemsgTestCase->testReadAllPermission()
Found the Send message buttonOtherprivatemsg.test498PrivatemsgTestCase->testReadAllPermission()
Found the requested form fields at messages/view/1Otherprivatemsg.test498PrivatemsgTestCase->testReadAllPermission()
First message body displayed.Otherprivatemsg.test501PrivatemsgTestCase->testReadAllPermission()
Second response body displayed.Otherprivatemsg.test502PrivatemsgTestCase->testReadAllPermission()
Third message body displayed.Otherprivatemsg.test503PrivatemsgTestCase->testReadAllPermission()
Admin is listed as recipient for every message once.Otherprivatemsg.test509PrivatemsgTestCase->testReadAllPermission()
PDOException: %message in _privatemsg_send() (line 1768 of /var/www/sites/default/files/checkout/sites/default/modules/privatemsg/privatemsg.module).Uncaught exceptiondatabase.inc1970PDOStatement->execute()
PDOException: %message in _privatemsg_send() (line 1768 of /var/www/sites/default/files/checkout/sites/default/modules/privatemsg/privatemsg.module).Uncaught exceptiondatabase.inc1970PDOStatement->execute()
ExpandPrivatemsg links (PrivatemsgLinksTestCase) [Privatemsg]13950
MessageGroupFilenameLineFunctionStatus
"A message has been sent to cm4PAFTQ" foundOtherprivatemsg.test990PrivatemsgLinksTestCase->testAuthorLinks()
"Message regarding zDPjtJDOME" foundOtherprivatemsg.test998PrivatemsgLinksTestCase->testAuthorLinks()
Messages link including new message information displayedOtherprivatemsg.test1037PrivatemsgLinksTestCase->testMenuBlock()
Privatemsg new block title displayed.Otherprivatemsg.test1065PrivatemsgLinksTestCase->testNewBlock()
New message indication displayed.Otherprivatemsg.test1067PrivatemsgLinksTestCase->testNewBlock()
ExpandPrivatemsg Roles functionality (PrivatemsgRolesTestCase) [Privatemsg]6789931
MessageGroupFilenameLineFunctionStatus
PDOException: %message in _privatemsg_send() (line 1768 of /var/www/sites/default/files/checkout/sites/default/modules/privatemsg/privatemsg.module).Uncaught exceptiondatabase.inc1970PDOStatement->execute()
PDOException: %message in _privatemsg_send() (line 1768 of /var/www/sites/default/files/checkout/sites/default/modules/privatemsg/privatemsg.module).Uncaught exceptiondatabase.inc1970PDOStatement->execute()
"A message has been sent to eMeEdkxi (role)." foundOtherprivatemsg_roles.test122PrivatemsgRolesTestCase->testSendMessagetoRoleBatch()
Message is displayed as newOtherprivatemsg_roles.test128PrivatemsgRolesTestCase->testSendMessagetoRoleBatch()
Undefined variable: url_targetNoticedrupal_web_test_case.php2324DrupalWebTestCase->clickLink()
Clicked link q5O7GByksD () from http://localhost/checkout/?q=messagesBrowserprivatemsg_roles.test130PrivatemsgRolesTestCase->testSendMessagetoRoleBatch()
Thread starter body displayed.Otherprivatemsg_roles.test131PrivatemsgRolesTestCase->testSendMessagetoRoleBatch()
Message is displayed as newOtherprivatemsg_roles.test128PrivatemsgRolesTestCase->testSendMessagetoRoleBatch()
Undefined variable: url_targetNoticedrupal_web_test_case.php2324DrupalWebTestCase->clickLink()
Clicked link q5O7GByksD () from http://localhost/checkout/?q=messagesBrowserprivatemsg_roles.test130PrivatemsgRolesTestCase->testSendMessagetoRoleBatch()
Thread starter body displayed.Otherprivatemsg_roles.test131PrivatemsgRolesTestCase->testSendMessagetoRoleBatch()
Message is displayed as newOtherprivatemsg_roles.test128PrivatemsgRolesTestCase->testSendMessagetoRoleBatch()
Undefined variable: url_targetNoticedrupal_web_test_case.php2324DrupalWebTestCase->clickLink()
Clicked link q5O7GByksD () from http://localhost/checkout/?q=messagesBrowserprivatemsg_roles.test130PrivatemsgRolesTestCase->testSendMessagetoRoleBatch()
Thread starter body displayed.Otherprivatemsg_roles.test131PrivatemsgRolesTestCase->testSendMessagetoRoleBatch()
Message is displayed as newOtherprivatemsg_roles.test128PrivatemsgRolesTestCase->testSendMessagetoRoleBatch()
Undefined variable: url_targetNoticedrupal_web_test_case.php2324DrupalWebTestCase->clickLink()
Clicked link q5O7GByksD () from http://localhost/checkout/?q=messagesBrowserprivatemsg_roles.test130PrivatemsgRolesTestCase->testSendMessagetoRoleBatch()
Thread starter body displayed.Otherprivatemsg_roles.test131PrivatemsgRolesTestCase->testSendMessagetoRoleBatch()
Message is displayed as newOtherprivatemsg_roles.test128PrivatemsgRolesTestCase->testSendMessagetoRoleBatch()
Undefined variable: url_targetNoticedrupal_web_test_case.php2324DrupalWebTestCase->clickLink()
Clicked link q5O7GByksD () from http://localhost/checkout/?q=messagesBrowserprivatemsg_roles.test130PrivatemsgRolesTestCase->testSendMessagetoRoleBatch()
Thread starter body displayed.Otherprivatemsg_roles.test131PrivatemsgRolesTestCase->testSendMessagetoRoleBatch()
Message is displayed as newOtherprivatemsg_roles.test128PrivatemsgRolesTestCase->testSendMessagetoRoleBatch()
Undefined variable: url_targetNoticedrupal_web_test_case.php2324DrupalWebTestCase->clickLink()
Clicked link q5O7GByksD () from http://localhost/checkout/?q=messagesBrowserprivatemsg_roles.test130PrivatemsgRolesTestCase->testSendMessagetoRoleBatch()
Thread starter body displayed.Otherprivatemsg_roles.test131PrivatemsgRolesTestCase->testSendMessagetoRoleBatch()
Message is displayed as newOtherprivatemsg_roles.test128PrivatemsgRolesTestCase->testSendMessagetoRoleBatch()
Undefined variable: url_targetNoticedrupal_web_test_case.php2324DrupalWebTestCase->clickLink()
Clicked link q5O7GByksD () from http://localhost/checkout/?q=messagesBrowserprivatemsg_roles.test130PrivatemsgRolesTestCase->testSendMessagetoRoleBatch()
Thread starter body displayed.Otherprivatemsg_roles.test131PrivatemsgRolesTestCase->testSendMessagetoRoleBatch()
Message is displayed as newOtherprivatemsg_roles.test128PrivatemsgRolesTestCase->testSendMessagetoRoleBatch()
Undefined variable: url_targetNoticedrupal_web_test_case.php2324DrupalWebTestCase->clickLink()
Clicked link q5O7GByksD () from http://localhost/checkout/?q=messagesBrowserprivatemsg_roles.test130PrivatemsgRolesTestCase->testSendMessagetoRoleBatch()
Thread starter body displayed.Otherprivatemsg_roles.test131PrivatemsgRolesTestCase->testSendMessagetoRoleBatch()
Message is displayed as newOtherprivatemsg_roles.test128PrivatemsgRolesTestCase->testSendMessagetoRoleBatch()
Undefined variable: url_targetNoticedrupal_web_test_case.php2324DrupalWebTestCase->clickLink()
Clicked link q5O7GByksD () from http://localhost/checkout/?q=messagesBrowserprivatemsg_roles.test130PrivatemsgRolesTestCase->testSendMessagetoRoleBatch()
Thread starter body displayed.Otherprivatemsg_roles.test131PrivatemsgRolesTestCase->testSendMessagetoRoleBatch()
Message is displayed as newOtherprivatemsg_roles.test128PrivatemsgRolesTestCase->testSendMessagetoRoleBatch()
Undefined variable: url_targetNoticedrupal_web_test_case.php2324DrupalWebTestCase->clickLink()
Clicked link q5O7GByksD () from http://localhost/checkout/?q=messagesBrowserprivatemsg_roles.test130PrivatemsgRolesTestCase->testSendMessagetoRoleBatch()
Thread starter body displayed.Otherprivatemsg_roles.test131PrivatemsgRolesTestCase->testSendMessagetoRoleBatch()
Message is displayed as newOtherprivatemsg_roles.test128PrivatemsgRolesTestCase->testSendMessagetoRoleBatch()
Undefined variable: url_targetNoticedrupal_web_test_case.php2324DrupalWebTestCase->clickLink()
Clicked link q5O7GByksD () from http://localhost/checkout/?q=messagesBrowserprivatemsg_roles.test130PrivatemsgRolesTestCase->testSendMessagetoRoleBatch()
Thread starter body displayed.Otherprivatemsg_roles.test131PrivatemsgRolesTestCase->testSendMessagetoRoleBatch()
Message is displayed as newOtherprivatemsg_roles.test128PrivatemsgRolesTestCase->testSendMessagetoRoleBatch()
Undefined variable: url_targetNoticedrupal_web_test_case.php2324DrupalWebTestCase->clickLink()
Clicked link q5O7GByksD () from http://localhost/checkout/?q=messagesBrowserprivatemsg_roles.test130PrivatemsgRolesTestCase->testSendMessagetoRoleBatch()
Thread starter body displayed.Otherprivatemsg_roles.test131PrivatemsgRolesTestCase->testSendMessagetoRoleBatch()
Message is displayed as newOtherprivatemsg_roles.test128PrivatemsgRolesTestCase->testSendMessagetoRoleBatch()
Undefined variable: url_targetNoticedrupal_web_test_case.php2324DrupalWebTestCase->clickLink()
Clicked link q5O7GByksD () from http://localhost/checkout/?q=messagesBrowserprivatemsg_roles.test130PrivatemsgRolesTestCase->testSendMessagetoRoleBatch()
Thread starter body displayed.Otherprivatemsg_roles.test131PrivatemsgRolesTestCase->testSendMessagetoRoleBatch()
Message is displayed as newOtherprivatemsg_roles.test128PrivatemsgRolesTestCase->testSendMessagetoRoleBatch()
Undefined variable: url_targetNoticedrupal_web_test_case.php2324DrupalWebTestCase->clickLink()
Clicked link q5O7GByksD () from http://localhost/checkout/?q=messagesBrowserprivatemsg_roles.test130PrivatemsgRolesTestCase->testSendMessagetoRoleBatch()
Thread starter body displayed.Otherprivatemsg_roles.test131PrivatemsgRolesTestCase->testSendMessagetoRoleBatch()
Message is displayed as newOtherprivatemsg_roles.test128PrivatemsgRolesTestCase->testSendMessagetoRoleBatch()
Undefined variable: url_targetNoticedrupal_web_test_case.php2324DrupalWebTestCase->clickLink()
Clicked link q5O7GByksD () from http://localhost/checkout/?q=messagesBrowserprivatemsg_roles.test130PrivatemsgRolesTestCase->testSendMessagetoRoleBatch()
Thread starter body displayed.Otherprivatemsg_roles.test131PrivatemsgRolesTestCase->testSendMessagetoRoleBatch()
Message is displayed as newOtherprivatemsg_roles.test128PrivatemsgRolesTestCase->testSendMessagetoRoleBatch()
Undefined variable: url_targetNoticedrupal_web_test_case.php2324DrupalWebTestCase->clickLink()
Clicked link q5O7GByksD () from http://localhost/checkout/?q=messagesBrowserprivatemsg_roles.test130PrivatemsgRolesTestCase->testSendMessagetoRoleBatch()
Thread starter body displayed.Otherprivatemsg_roles.test131PrivatemsgRolesTestCase->testSendMessagetoRoleBatch()
Message is displayed as newOtherprivatemsg_roles.test128PrivatemsgRolesTestCase->testSendMessagetoRoleBatch()
Undefined variable: url_targetNoticedrupal_web_test_case.php2324DrupalWebTestCase->clickLink()
Clicked link q5O7GByksD () from http://localhost/checkout/?q=messagesBrowserprivatemsg_roles.test130PrivatemsgRolesTestCase->testSendMessagetoRoleBatch()
Thread starter body displayed.Otherprivatemsg_roles.test131PrivatemsgRolesTestCase->testSendMessagetoRoleBatch()
Message is displayed as newOtherprivatemsg_roles.test128PrivatemsgRolesTestCase->testSendMessagetoRoleBatch()
Undefined variable: url_targetNoticedrupal_web_test_case.php2324DrupalWebTestCase->clickLink()
Clicked link q5O7GByksD () from http://localhost/checkout/?q=messagesBrowserprivatemsg_roles.test130PrivatemsgRolesTestCase->testSendMessagetoRoleBatch()
Thread starter body displayed.Otherprivatemsg_roles.test131PrivatemsgRolesTestCase->testSendMessagetoRoleBatch()
Message is displayed as newOtherprivatemsg_roles.test128PrivatemsgRolesTestCase->testSendMessagetoRoleBatch()
Undefined variable: url_targetNoticedrupal_web_test_case.php2324DrupalWebTestCase->clickLink()
Clicked link q5O7GByksD () from http://localhost/checkout/?q=messagesBrowserprivatemsg_roles.test130PrivatemsgRolesTestCase->testSendMessagetoRoleBatch()
Thread starter body displayed.Otherprivatemsg_roles.test131PrivatemsgRolesTestCase->testSendMessagetoRoleBatch()
Message is displayed as newOtherprivatemsg_roles.test128PrivatemsgRolesTestCase->testSendMessagetoRoleBatch()
Undefined variable: url_targetNoticedrupal_web_test_case.php2324DrupalWebTestCase->clickLink()
Clicked link q5O7GByksD () from http://localhost/checkout/?q=messagesBrowserprivatemsg_roles.test130PrivatemsgRolesTestCase->testSendMessagetoRoleBatch()
Thread starter body displayed.Otherprivatemsg_roles.test131PrivatemsgRolesTestCase->testSendMessagetoRoleBatch()
Message is displayed as newOtherprivatemsg_roles.test128PrivatemsgRolesTestCase->testSendMessagetoRoleBatch()
Undefined variable: url_targetNoticedrupal_web_test_case.php2324DrupalWebTestCase->clickLink()
Clicked link q5O7GByksD () from http://localhost/checkout/?q=messagesBrowserprivatemsg_roles.test130PrivatemsgRolesTestCase->testSendMessagetoRoleBatch()
Thread starter body displayed.Otherprivatemsg_roles.test131PrivatemsgRolesTestCase->testSendMessagetoRoleBatch()
Message is displayed as newOtherprivatemsg_roles.test128PrivatemsgRolesTestCase->testSendMessagetoRoleBatch()
Undefined variable: url_targetNoticedrupal_web_test_case.php2324DrupalWebTestCase->clickLink()
Clicked link q5O7GByksD () from http://localhost/checkout/?q=messagesBrowserprivatemsg_roles.test130PrivatemsgRolesTestCase->testSendMessagetoRoleBatch()
Thread starter body displayed.Otherprivatemsg_roles.test131PrivatemsgRolesTestCase->testSendMessagetoRoleBatch()
Message is displayed as newOtherprivatemsg_roles.test128PrivatemsgRolesTestCase->testSendMessagetoRoleBatch()
Undefined variable: url_targetNoticedrupal_web_test_case.php2324DrupalWebTestCase->clickLink()
Clicked link q5O7GByksD () from http://localhost/checkout/?q=messagesBrowserprivatemsg_roles.test130PrivatemsgRolesTestCase->testSendMessagetoRoleBatch()
Thread starter body displayed.Otherprivatemsg_roles.test131PrivatemsgRolesTestCase->testSendMessagetoRoleBatch()
Message is displayed as newOtherprivatemsg_roles.test128PrivatemsgRolesTestCase->testSendMessagetoRoleBatch()
Undefined variable: url_targetNoticedrupal_web_test_case.php2324DrupalWebTestCase->clickLink()
Clicked link q5O7GByksD () from http://localhost/checkout/?q=messagesBrowserprivatemsg_roles.test130PrivatemsgRolesTestCase->testSendMessagetoRoleBatch()
Thread starter body displayed.Otherprivatemsg_roles.test131PrivatemsgRolesTestCase->testSendMessagetoRoleBatch()
Message is displayed as newOtherprivatemsg_roles.test128PrivatemsgRolesTestCase->testSendMessagetoRoleBatch()
Undefined variable: url_targetNoticedrupal_web_test_case.php2324DrupalWebTestCase->clickLink()
Clicked link q5O7GByksD () from http://localhost/checkout/?q=messagesBrowserprivatemsg_roles.test130PrivatemsgRolesTestCase->testSendMessagetoRoleBatch()
Thread starter body displayed.Otherprivatemsg_roles.test131PrivatemsgRolesTestCase->testSendMessagetoRoleBatch()
"A message has been sent to i3WT2c9Z (role)." foundOtherprivatemsg_roles.test175PrivatemsgRolesTestCase->testSendMessageToRole()
Message is displayed as newOtherprivatemsg_roles.test181PrivatemsgRolesTestCase->testSendMessageToRole()
Undefined variable: url_targetNoticedrupal_web_test_case.php2324DrupalWebTestCase->clickLink()
Clicked link m0RIv4BLT6 () from http://localhost/checkout/?q=messagesBrowserprivatemsg_roles.test183PrivatemsgRolesTestCase->testSendMessageToRole()
Thread starter body displayed.Otherprivatemsg_roles.test184PrivatemsgRolesTestCase->testSendMessageToRole()
Failed to set field body[value] to t2YkBtsHPsahbzMB1ZHcbXSs4zN3rEXcF4qC14eoFQVBxLedhlOtherprivatemsg_roles.test193PrivatemsgRolesTestCase->testSendMessageToRole()
Found the Send message buttonOtherprivatemsg_roles.test193PrivatemsgRolesTestCase->testSendMessageToRole()
Found the requested form fields at Otherprivatemsg_roles.test193PrivatemsgRolesTestCase->testSendMessageToRole()
Message is displayed as newOtherprivatemsg_roles.test201PrivatemsgRolesTestCase->testSendMessageToRole()
Undefined variable: url_targetNoticedrupal_web_test_case.php2324DrupalWebTestCase->clickLink()
Clicked link m0RIv4BLT6 () from http://localhost/checkout/?q=messagesBrowserprivatemsg_roles.test202PrivatemsgRolesTestCase->testSendMessageToRole()
Reply1 is displayedOtherprivatemsg_roles.test204PrivatemsgRolesTestCase->testSendMessageToRole()
Failed to set field body[value] to qYdsaj69midFK46eiCoYU35ERyQXtTCsltddzaIKjEClNJC3LkOtherprivatemsg_roles.test210PrivatemsgRolesTestCase->testSendMessageToRole()
Found the Send message buttonOtherprivatemsg_roles.test210PrivatemsgRolesTestCase->testSendMessageToRole()
Found the requested form fields at Otherprivatemsg_roles.test210PrivatemsgRolesTestCase->testSendMessageToRole()
Message is displayed as newOtherprivatemsg_roles.test215PrivatemsgRolesTestCase->testSendMessageToRole()
Undefined variable: url_targetNoticedrupal_web_test_case.php2324DrupalWebTestCase->clickLink()
Clicked link m0RIv4BLT6 () from http://localhost/checkout/?q=messagesBrowserprivatemsg_roles.test216PrivatemsgRolesTestCase->testSendMessageToRole()
"i3WT2c9Z (role)" foundOtherprivatemsg_roles.test217PrivatemsgRolesTestCase->testSendMessageToRole()
Thread starter body is displayedOtherprivatemsg_roles.test219PrivatemsgRolesTestCase->testSendMessageToRole()
Reply2 is displayedOtherprivatemsg_roles.test221PrivatemsgRolesTestCase->testSendMessageToRole()
"A message has been sent to kkAHwZn7 (role)." foundOtherprivatemsg_roles.test246PrivatemsgRolesTestCase->testSendMessageToRoleBlocked()
Message is displayed as newOtherprivatemsg_roles.test252PrivatemsgRolesTestCase->testSendMessageToRoleBlocked()
Undefined variable: url_targetNoticedrupal_web_test_case.php2324DrupalWebTestCase->clickLink()
Clicked link lpMgHbAtdO () from http://localhost/checkout/?q=messagesBrowserprivatemsg_roles.test254PrivatemsgRolesTestCase->testSendMessageToRoleBlocked()
Thread starter body displayed.Otherprivatemsg_roles.test255PrivatemsgRolesTestCase->testSendMessageToRoleBlocked()
"A message has been sent to bGsyPPY0 (role)." foundOtherprivatemsg_roles.test279PrivatemsgRolesTestCase->testNewUser()
ExpandPrivatemsg Tags functionality. (PrivatemsgTagsTestCase) [Privatemsg]9303
MessageGroupFilenameLineFunctionStatus
PDOException: %message in _privatemsg_send() (line 1768 of /var/www/sites/default/files/checkout/sites/default/modules/privatemsg/privatemsg.module).Uncaught exceptiondatabase.inc1970PDOStatement->execute()
PDOException: %message in _privatemsg_send() (line 1768 of /var/www/sites/default/files/checkout/sites/default/modules/privatemsg/privatemsg.module).Uncaught exceptiondatabase.inc1970PDOStatement->execute()
PDOException: %message in _privatemsg_send() (line 1768 of /var/www/sites/default/files/checkout/sites/default/modules/privatemsg/privatemsg.module).Uncaught exceptiondatabase.inc1970PDOStatement->execute()
ExpandPrivatemsg tokens (PrivatemsgTokenTestCase) [Privatemsg]66202
MessageGroupFilenameLineFunctionStatus
Token is displayed in subject.Otherprivatemsg.test1127PrivatemsgTokenTestCase->testBasicTokens()
Subject token is displayed.Otherprivatemsg.test1128PrivatemsgTokenTestCase->testBasicTokens()
Author token is displayed.Otherprivatemsg.test1129PrivatemsgTokenTestCase->testBasicTokens()
Invalid token is displayed.Otherprivatemsg.test1130PrivatemsgTokenTestCase->testBasicTokens()
Token notice is displayed.Otherprivatemsg.test1131PrivatemsgTokenTestCase->testBasicTokens()
Undefined variable: url_targetNoticedrupal_web_test_case.php2324DrupalWebTestCase->clickLink()
Clicked link Hey vFhfb8r8 () from http://localhost/checkout/?q=messagesBrowserprivatemsg.test1137PrivatemsgTokenTestCase->testBasicTokens()
Replaced token is displayed in subject.Otherprivatemsg.test1141PrivatemsgTokenTestCase->testBasicTokens()
Subject token is replaced.Otherprivatemsg.test1142PrivatemsgTokenTestCase->testBasicTokens()
Author token is replaced.Otherprivatemsg.test1143PrivatemsgTokenTestCase->testBasicTokens()
Invalid token is displayed.Otherprivatemsg.test1144PrivatemsgTokenTestCase->testBasicTokens()
Failed to set field body[value] to Response with a token [privatemsg_message:mid]Otherprivatemsg.test1152PrivatemsgTokenTestCase->testBasicTokens()
Found the Send message buttonOtherprivatemsg.test1152PrivatemsgTokenTestCase->testBasicTokens()
Found the requested form fields at Otherprivatemsg.test1152PrivatemsgTokenTestCase->testBasicTokens()
Undefined variable: url_targetNoticedrupal_web_test_case.php2324DrupalWebTestCase->clickLink()
Clicked link Hey wMUcJRHM () from http://localhost/checkout/?q=messagesBrowserprivatemsg.test1156PrivatemsgTokenTestCase->testBasicTokens()
Replaced token is displayed in subject.Otherprivatemsg.test1160PrivatemsgTokenTestCase->testBasicTokens()
Subject token is replaced.Otherprivatemsg.test1161PrivatemsgTokenTestCase->testBasicTokens()
Author token is replaced.Otherprivatemsg.test1162PrivatemsgTokenTestCase->testBasicTokens()
Invalid token is displayed.Otherprivatemsg.test1163PrivatemsgTokenTestCase->testBasicTokens()
Token from recipient is not replaced.Otherprivatemsg.test1164PrivatemsgTokenTestCase->testBasicTokens()
Token is displayed correctly in subject for author.Otherprivatemsg.test1171PrivatemsgTokenTestCase->testBasicTokens()
ExpandUser blocking functionality. (PrivatemsgBlockUserCase) [Privatemsg]901
MessageGroupFilenameLineFunctionStatus
PDOException: %message in _privatemsg_send() (line 1768 of /var/www/sites/default/files/checkout/sites/default/modules/privatemsg/privatemsg.module).Uncaught exceptiondatabase.inc1970PDOStatement->execute()

All

Test namePassFailException
ExpandPrivatemsg API functionality. (PrivatemsgAPITestCase) [Privatemsg]2402
MessageGroupFilenameLineFunctionStatus
PDOException: SQLSTATE[HY000]: General error: 1366 Incorrect integer value: 'filtered_html' for column 'format' at row 1: INSERT INTO {pm_message} (subject, author, body, format, timestamp, has_tokens) VALUES (:db_insert_placeholder_0, :db_insert_placeholder_1, :db_insert_placeholder_2, :db_insert_placeholder_3, :db_insert_placeholder_4, :db_insert_placeholder_5); Array ( [:db_insert_placeholder_0] => normal message [:db_insert_placeholder_1] => 2 [:db_insert_placeholder_2] => Body text [:db_insert_placeholder_3] => filtered_html [:db_insert_placeholder_4] => 1287620218 [:db_insert_placeholder_5] => 0 ) in _privatemsg_send() (line 1768 of /var/www/sites/default/files/checkout/sites/default/modules/privatemsg/privatemsg.module).Uncaught exceptiondatabase.inc1970PDOStatement->execute()
PDOException: %message in _privatemsg_send() (line 1768 of /var/www/sites/default/files/checkout/sites/default/modules/privatemsg/privatemsg.module).Uncaught exceptiondatabase.inc1970PDOStatement->execute()
ExpandPrivatemsg fields. (PrivatemsgFieldsTestCase) [Privatemsg]89123
MessageGroupFilenameLineFunctionStatus
Undefined variable: url_targetNoticedrupal_web_test_case.php2324DrupalWebTestCase->clickLink()
Clicked link dJxMitee () from http://localhost/checkout/?q=messagesBrowserprivatemsg.test853PrivatemsgFieldsTestCase->testSingleField()
Message body displayed.Otherprivatemsg.test855PrivatemsgFieldsTestCase->testSingleField()
Content of new field is displayed.Otherprivatemsg.test856PrivatemsgFieldsTestCase->testSingleField()
Failed to set field body[value] to zLotJenVbCxeXZXrXgh3uwBEYFXT7rnpsKuyaSZFgiYfez7bOfOtherprivatemsg.test863PrivatemsgFieldsTestCase->testSingleField()
Failed to set field field_wj0oxpjq[und][0][value] to pa996jIBeoWog31iRXhNpj6TXMUdseR80oGP03Opy8VFqMzvuqOtherprivatemsg.test863PrivatemsgFieldsTestCase->testSingleField()
Found the Send message buttonOtherprivatemsg.test863PrivatemsgFieldsTestCase->testSingleField()
Found the requested form fields at Otherprivatemsg.test863PrivatemsgFieldsTestCase->testSingleField()
Undefined variable: url_targetNoticedrupal_web_test_case.php2324DrupalWebTestCase->clickLink()
Clicked link dJxMitee () from http://localhost/checkout/?q=messagesBrowserprivatemsg.test868PrivatemsgFieldsTestCase->testSingleField()
Message body displayed.Otherprivatemsg.test870PrivatemsgFieldsTestCase->testSingleField()
Content of new field is displayed.Otherprivatemsg.test871PrivatemsgFieldsTestCase->testSingleField()
Undefined variable: url_targetNoticedrupal_web_test_case.php2324DrupalWebTestCase->clickLink()
Clicked link szHRTysr () from http://localhost/checkout/?q=messagesBrowserprivatemsg.test911PrivatemsgFieldsTestCase->testEmptyImage()
Message body displayed.Otherprivatemsg.test913PrivatemsgFieldsTestCase->testEmptyImage()
ExpandPrivatemsg Filter functionality. (PrivatemsgFilterTestCase) [Privatemsg]85262
MessageGroupFilenameLineFunctionStatus
Message sent confirmation displayedOtherprivatemsg_filter.test39PrivatemsgFilterTestCase->testInboxSentHandling()
Thread displayed in "Sent messages" for author.Otherprivatemsg_filter.test46PrivatemsgFilterTestCase->testInboxSentHandling()
Thread displayed in "All messages" for author.Otherprivatemsg_filter.test48PrivatemsgFilterTestCase->testInboxSentHandling()
Thread displayed in inbox for recipient.Otherprivatemsg_filter.test53PrivatemsgFilterTestCase->testInboxSentHandling()
Thread displayed in "All messages." for recipient.Otherprivatemsg_filter.test57PrivatemsgFilterTestCase->testInboxSentHandling()
Undefined variable: url_targetNoticedrupal_web_test_case.php2324DrupalWebTestCase->clickLink()
Clicked link oYRDWMQz4C3S6xIqPCen () from http://localhost/checkout/?q=messages/listBrowserprivatemsg_filter.test60PrivatemsgFilterTestCase->testInboxSentHandling()
Failed to set field body[value] to qGpi2I6wDsryOqiCPDZzAhISOLVFv4PDCViSS06HPG3LFuhboFAXV9As044q1rOFo7BPymuUU2E3iOCoVBFrmlICGeohadevC32dOtherprivatemsg_filter.test64PrivatemsgFilterTestCase->testInboxSentHandling()
Found the Send message buttonOtherprivatemsg_filter.test64PrivatemsgFilterTestCase->testInboxSentHandling()
Found the requested form fields at Otherprivatemsg_filter.test64PrivatemsgFilterTestCase->testInboxSentHandling()
Message sent confirmation displayedOtherprivatemsg_filter.test65PrivatemsgFilterTestCase->testInboxSentHandling()
Thread displayed in "Sent messages" for recipient.Otherprivatemsg_filter.test68PrivatemsgFilterTestCase->testInboxSentHandling()
Thread displayed in inbox for author.Otherprivatemsg_filter.test72PrivatemsgFilterTestCase->testInboxSentHandling()
Failed to set field list[1] to 1Otherprivatemsg_filter.test79PrivatemsgFilterTestCase->testInboxSentHandling()
Found the Delete buttonOtherprivatemsg_filter.test79PrivatemsgFilterTestCase->testInboxSentHandling()
Found the requested form fields at Otherprivatemsg_filter.test79PrivatemsgFilterTestCase->testInboxSentHandling()
Undefined variable: url_targetNoticedrupal_web_test_case.php2324DrupalWebTestCase->clickLink()
Clicked link oYRDWMQz4C3S6xIqPCen () from http://localhost/checkout/?q=messagesBrowserprivatemsg_filter.test87PrivatemsgFilterTestCase->testInboxSentHandling()
Failed to set field body[value] to citynJy7wfYuPy3f2t8qCGLgvYR979OaFbPbfK0zkVhKWngqPhYLPgdDLKUfTPHAqNIp0mwbIpgeN6eJ8ArLROhfEYYlSLq6UmunOtherprivatemsg_filter.test91PrivatemsgFilterTestCase->testInboxSentHandling()
Found the Send message buttonOtherprivatemsg_filter.test91PrivatemsgFilterTestCase->testInboxSentHandling()
Found the requested form fields at Otherprivatemsg_filter.test91PrivatemsgFilterTestCase->testInboxSentHandling()
Message sent confirmation displayedOtherprivatemsg_filter.test92PrivatemsgFilterTestCase->testInboxSentHandling()
Thread displayed again in inbox for author.Otherprivatemsg_filter.test97PrivatemsgFilterTestCase->testInboxSentHandling()
Failed to set field list[1] to 1Otherprivatemsg_filter.test104PrivatemsgFilterTestCase->testInboxSentHandling()
Found the Archive buttonOtherprivatemsg_filter.test104PrivatemsgFilterTestCase->testInboxSentHandling()
Found the requested form fields at Otherprivatemsg_filter.test104PrivatemsgFilterTestCase->testInboxSentHandling()
Confirmation message displayedOtherprivatemsg_filter.test105PrivatemsgFilterTestCase->testInboxSentHandling()
Thread still displayed in "All messages" list.Otherprivatemsg_filter.test109PrivatemsgFilterTestCase->testInboxSentHandling()
ExpandPrivatemsg filter widget (PrivatemsgFilterWidgetTestCase) [Privatemsg]1701
MessageGroupFilenameLineFunctionStatus
PDOException: %message in _privatemsg_send() (line 1768 of /var/www/sites/default/files/checkout/sites/default/modules/privatemsg/privatemsg.module).Uncaught exceptiondatabase.inc1970PDOStatement->execute()
ExpandPrivatemsg functionality. (PrivatemsgTestCase) [Privatemsg]21610514
MessageGroupFilenameLineFunctionStatus
PDOException: %message in _privatemsg_send() (line 1768 of /var/www/sites/default/files/checkout/sites/default/modules/privatemsg/privatemsg.module).Uncaught exceptiondatabase.inc1970PDOStatement->execute()
PDOException: %message in _privatemsg_send() (line 1768 of /var/www/sites/default/files/checkout/sites/default/modules/privatemsg/privatemsg.module).Uncaught exceptiondatabase.inc1970PDOStatement->execute()
Invalid permission .Roleprivatemsg.test204PrivatemsgTestCase->testWriteReplyPrivatemsg()
Argument 1 passed to DrupalWebTestCase::drupalLogin() must be an instance of stdClass, boolean given, called in /var/www/sites/default/files/checkout/sites/default/modules/privatemsg/privatemsg.test on line 209 and definedRecoverable errordrupal_web_test_case.php1112DrupalWebTestCase->drupalLogin()
Trying to get property of non-objectNoticedrupal_web_test_case.php1118DrupalWebTestCase->drupalLogin()
Trying to get property of non-objectNoticedrupal_web_test_case.php1119DrupalWebTestCase->drupalLogin()
Failed to set field name to Otherprivatemsg.test209PrivatemsgTestCase->testWriteReplyPrivatemsg()
Failed to set field pass to Otherprivatemsg.test209PrivatemsgTestCase->testWriteReplyPrivatemsg()
Found the requested form fields at userOtherprivatemsg.test209PrivatemsgTestCase->testWriteReplyPrivatemsg()
Trying to get property of non-objectNoticedrupal_web_test_case.php1125DrupalWebTestCase->drupalLogin()
User successfully logged in.User loginprivatemsg.test209PrivatemsgTestCase->testWriteReplyPrivatemsg()
Failed to set field recipient to sqrDoIwP [user]Otherprivatemsg.test270PrivatemsgTestCase->testWriteReplyPrivatemsg()
Failed to set field subject to pEBMxesl4cg89FkO3wbEOtherprivatemsg.test270PrivatemsgTestCase->testWriteReplyPrivatemsg()
Failed to set field body[value] to iBrhGeIThk0e0QFUAECPqqUGD5Bur3azouX8kEcqNBwYXdyZoej4jqx3SI28js7uftetB5gUAVy9A3JnPT6tEcKEX3KW8eDTzlUGOtherprivatemsg.test270PrivatemsgTestCase->testWriteReplyPrivatemsg()
Found the Send message buttonOtherprivatemsg.test270PrivatemsgTestCase->testWriteReplyPrivatemsg()
Found the requested form fields at messages/newOtherprivatemsg.test270PrivatemsgTestCase->testWriteReplyPrivatemsg()
Message sent confirmation displayed.Otherprivatemsg.test271PrivatemsgTestCase->testWriteReplyPrivatemsg()
Failed to set field recipient to sqrDoIwP, wzEKacMgOtherprivatemsg.test273PrivatemsgTestCase->testWriteReplyPrivatemsg()
Failed to set field subject to goDYEMh6eLWQ6lAyZ1SQOtherprivatemsg.test273PrivatemsgTestCase->testWriteReplyPrivatemsg()
Failed to set field body[value] to qTByRb73vQd1sNteOhltTAuGDTsPWBevSjqnG3VznOMNpmwh7w6pcj0pHjwhrOK0PTiNp7zFJ7jvlJtuUCobqLVxd6SwSwJLOi6JOtherprivatemsg.test273PrivatemsgTestCase->testWriteReplyPrivatemsg()
Found the Send message buttonOtherprivatemsg.test273PrivatemsgTestCase->testWriteReplyPrivatemsg()
Found the requested form fields at messages/newOtherprivatemsg.test273PrivatemsgTestCase->testWriteReplyPrivatemsg()
Message sent confirmation displayed.Otherprivatemsg.test274PrivatemsgTestCase->testWriteReplyPrivatemsg()
Failed to set field recipient to Otherprivatemsg.test276PrivatemsgTestCase->testWriteReplyPrivatemsg()
Failed to set field subject to nBdxPFEeIivOWGsRmFytOtherprivatemsg.test276PrivatemsgTestCase->testWriteReplyPrivatemsg()
Failed to set field body[value] to wLmK4ZnlNURYlR5fXC8KjNeog5J6Iq4xWNiLdS8YXmxPCnopwuGGdLqCjKAdSp0yQ6vlNDyHN9XfwP8yQejiwgfe2tMHKwm7e6FkOtherprivatemsg.test276PrivatemsgTestCase->testWriteReplyPrivatemsg()
Found the Send message buttonOtherprivatemsg.test276PrivatemsgTestCase->testWriteReplyPrivatemsg()
Found the requested form fields at messages/newOtherprivatemsg.test276PrivatemsgTestCase->testWriteReplyPrivatemsg()
Message was not sent.Otherprivatemsg.test277PrivatemsgTestCase->testWriteReplyPrivatemsg()
Failed to set field recipient to q4zZZOtherprivatemsg.test279PrivatemsgTestCase->testWriteReplyPrivatemsg()
Failed to set field subject to rrv2KIuqQVse3HS5cDuROtherprivatemsg.test279PrivatemsgTestCase->testWriteReplyPrivatemsg()
Failed to set field body[value] to h2RqQB328OEpMJatQaWtqY2b9bpt5aNaUuJDKfU5kun094RMVTe5d8DBXJFVibbS0Xo5u6431tjOGxQwwu4LojGpFU2F006uhPX2Otherprivatemsg.test279PrivatemsgTestCase->testWriteReplyPrivatemsg()
Found the Send message buttonOtherprivatemsg.test279PrivatemsgTestCase->testWriteReplyPrivatemsg()
Found the requested form fields at messages/newOtherprivatemsg.test279PrivatemsgTestCase->testWriteReplyPrivatemsg()
Message was not sent.Otherprivatemsg.test280PrivatemsgTestCase->testWriteReplyPrivatemsg()
Message about non-existing user displayed.Otherprivatemsg.test281PrivatemsgTestCase->testWriteReplyPrivatemsg()
Failed to set field recipient to sqrDoIwPOtherprivatemsg.test283PrivatemsgTestCase->testWriteReplyPrivatemsg()
Failed to set field subject to aRDXAChu6E0ZgGXsVXrXOtherprivatemsg.test283PrivatemsgTestCase->testWriteReplyPrivatemsg()
Failed to set field body[value] to Otherprivatemsg.test283PrivatemsgTestCase->testWriteReplyPrivatemsg()
Found the Send message buttonOtherprivatemsg.test283PrivatemsgTestCase->testWriteReplyPrivatemsg()
Found the requested form fields at messages/newOtherprivatemsg.test283PrivatemsgTestCase->testWriteReplyPrivatemsg()
Message sent confirmation displayed.Otherprivatemsg.test284PrivatemsgTestCase->testWriteReplyPrivatemsg()
Failed to set field recipient to sqrDoIwPOtherprivatemsg.test286PrivatemsgTestCase->testWriteReplyPrivatemsg()
Failed to set field subject to Otherprivatemsg.test286PrivatemsgTestCase->testWriteReplyPrivatemsg()
Failed to set field body[value] to vGmYwEjBZlngMVMz2PxhOPxnpk8HshStWZqaqdFr5gHs6IKyGkOB4b5SaqPp5Dvi7zY3FIdh48dF6NaovEko9gTdxaWADd8JX91FOtherprivatemsg.test286PrivatemsgTestCase->testWriteReplyPrivatemsg()
Found the Send message buttonOtherprivatemsg.test286PrivatemsgTestCase->testWriteReplyPrivatemsg()
Found the requested form fields at messages/newOtherprivatemsg.test286PrivatemsgTestCase->testWriteReplyPrivatemsg()
Message sent confirmation displayed.Otherprivatemsg.test287PrivatemsgTestCase->testWriteReplyPrivatemsg()
Failed to set field recipient to sqrDoIwPOtherprivatemsg.test289PrivatemsgTestCase->testWriteReplyPrivatemsg()
Failed to set field subject to Otherprivatemsg.test289PrivatemsgTestCase->testWriteReplyPrivatemsg()
Failed to set field body[value] to Otherprivatemsg.test289PrivatemsgTestCase->testWriteReplyPrivatemsg()
Found the Send message buttonOtherprivatemsg.test289PrivatemsgTestCase->testWriteReplyPrivatemsg()
Found the requested form fields at messages/newOtherprivatemsg.test289PrivatemsgTestCase->testWriteReplyPrivatemsg()
Empty subject message displayed.Otherprivatemsg.test290PrivatemsgTestCase->testWriteReplyPrivatemsg()
Failed to set field recipient to fCFLk, sqrDoIwPOtherprivatemsg.test292PrivatemsgTestCase->testWriteReplyPrivatemsg()
Failed to set field subject to nWGi4SZsSScksfOafUCPOtherprivatemsg.test292PrivatemsgTestCase->testWriteReplyPrivatemsg()
Failed to set field body[value] to akKXWzPibMmf3yyJmSnoepUWGsWTQSvP4q6CJsrJASpEvUVruzs7STiW1bq02OR5mxVCiNUvk5zWT7nqvPqSrpKQ1noYVjoAa530Otherprivatemsg.test292PrivatemsgTestCase->testWriteReplyPrivatemsg()
Found the Send message buttonOtherprivatemsg.test292PrivatemsgTestCase->testWriteReplyPrivatemsg()
Found the requested form fields at messages/newOtherprivatemsg.test292PrivatemsgTestCase->testWriteReplyPrivatemsg()
Message sent confirmation displayed.Otherprivatemsg.test293PrivatemsgTestCase->testWriteReplyPrivatemsg()
Message about non-existing user displayed.Otherprivatemsg.test294PrivatemsgTestCase->testWriteReplyPrivatemsg()
Failed to set field recipient to wzEKacMgOtherprivatemsg.test296PrivatemsgTestCase->testWriteReplyPrivatemsg()
Failed to set field subject to dwhw3u0QtS5wyxQijL6yOtherprivatemsg.test296PrivatemsgTestCase->testWriteReplyPrivatemsg()
Failed to set field body[value] to tU4Kfrdt8XtASppf5OgnMgbiItAxpJBFVMCI0V1zTYdllD0SmCuJ9Fkep4HgmcNyzG823CGkvvoytJj6Q1mlQZY9WH19zzm151qu<b>formatted message #1</b>Otherprivatemsg.test296PrivatemsgTestCase->testWriteReplyPrivatemsg()
Failed to set field body[format] to 3Otherprivatemsg.test296PrivatemsgTestCase->testWriteReplyPrivatemsg()
Found the Send message buttonOtherprivatemsg.test296PrivatemsgTestCase->testWriteReplyPrivatemsg()
Found the requested form fields at messages/newOtherprivatemsg.test296PrivatemsgTestCase->testWriteReplyPrivatemsg()
Message sent confirmation displayed.Otherprivatemsg.test297PrivatemsgTestCase->testWriteReplyPrivatemsg()
Sent message subject found.Otherprivatemsg.test304PrivatemsgTestCase->testWriteReplyPrivatemsg()
Undefined variable: url_targetNoticedrupal_web_test_case.php2324DrupalWebTestCase->clickLink()
Clicked link goDYEMh6eLWQ6lAyZ1SQ () from http://localhost/checkout/?q=messagesBrowserprivatemsg.test305PrivatemsgTestCase->testWriteReplyPrivatemsg()
Found message body.Otherprivatemsg.test307PrivatemsgTestCase->testWriteReplyPrivatemsg()
Failed to set field body[value] to s0GeNPhINEdzsOB1rL4jPMEpQSKD6YJbctbSZhBRQQyEYbBsM3ighhvD7x5gOFbJDXq5itvnDfjFhNWZj7d7ScSEwmjht5HbWfveOtherprivatemsg.test318PrivatemsgTestCase->testWriteReplyPrivatemsg()
Found the Send message buttonOtherprivatemsg.test318PrivatemsgTestCase->testWriteReplyPrivatemsg()
Found the requested form fields at Otherprivatemsg.test318PrivatemsgTestCase->testWriteReplyPrivatemsg()
New message body displayed.Otherprivatemsg.test319PrivatemsgTestCase->testWriteReplyPrivatemsg()
Failed to set field body[value] to Otherprivatemsg.test321PrivatemsgTestCase->testWriteReplyPrivatemsg()
Found the Send message buttonOtherprivatemsg.test321PrivatemsgTestCase->testWriteReplyPrivatemsg()
Found the requested form fields at Otherprivatemsg.test321PrivatemsgTestCase->testWriteReplyPrivatemsg()
"You must include a message in your reply." foundOtherprivatemsg.test322PrivatemsgTestCase->testWriteReplyPrivatemsg()
Undefined variable: url_targetNoticedrupal_web_test_case.php2324DrupalWebTestCase->clickLink()
Clicked link dwhw3u0QtS5wyxQijL6y () from http://localhost/checkout/?q=messagesBrowserprivatemsg.test329PrivatemsgTestCase->testWriteReplyPrivatemsg()
Found formatted message body.Otherprivatemsg.test330PrivatemsgTestCase->testWriteReplyPrivatemsg()
Failed to set field body[value] to knSdF6sMzcgDEgqbR4MHk04rRtAR6mZjxY6jQIc2mLZfy83fkiVCpJhs2GGcTv5I34FDWRLHgy1q9ua2oPkmIU6dDqWTtcvIi0Z9<b>formatted message #2</b>Otherprivatemsg.test332PrivatemsgTestCase->testWriteReplyPrivatemsg()
Found the Send message buttonOtherprivatemsg.test332PrivatemsgTestCase->testWriteReplyPrivatemsg()
Found the requested form fields at Otherprivatemsg.test332PrivatemsgTestCase->testWriteReplyPrivatemsg()
New reply body displayed.Otherprivatemsg.test334PrivatemsgTestCase->testWriteReplyPrivatemsg()
Sent message subject found.Otherprivatemsg.test341PrivatemsgTestCase->testWriteReplyPrivatemsg()
Sent message subject found.Otherprivatemsg.test342PrivatemsgTestCase->testWriteReplyPrivatemsg()
Sent message subject found.Otherprivatemsg.test343PrivatemsgTestCase->testWriteReplyPrivatemsg()
Sent message subject found.Otherprivatemsg.test344PrivatemsgTestCase->testWriteReplyPrivatemsg()
Sent message subject found.Otherprivatemsg.test345PrivatemsgTestCase->testWriteReplyPrivatemsg()
Undefined variable: url_targetNoticedrupal_web_test_case.php2324DrupalWebTestCase->clickLink()
Clicked link pEBMxesl4cg89FkO3wbE () from http://localhost/checkout/?q=messagesBrowserprivatemsg.test352PrivatemsgTestCase->testWriteReplyPrivatemsg()
Found message body.Otherprivatemsg.test354PrivatemsgTestCase->testWriteReplyPrivatemsg()
Trying to get property of non-objectNoticeprivatemsg.test358PrivatemsgTestCase->testWriteReplyPrivatemsg()
"Between you and " foundOtherprivatemsg.test358PrivatemsgTestCase->testWriteReplyPrivatemsg()
Undefined variable: url_targetNoticedrupal_web_test_case.php2324DrupalWebTestCase->clickLink()
Clicked link goDYEMh6eLWQ6lAyZ1SQ () from http://localhost/checkout/?q=messagesBrowserprivatemsg.test362PrivatemsgTestCase->testWriteReplyPrivatemsg()
Found message body.Otherprivatemsg.test364PrivatemsgTestCase->testWriteReplyPrivatemsg()
Found reply body.Otherprivatemsg.test366PrivatemsgTestCase->testWriteReplyPrivatemsg()
PDOException: %message in _privatemsg_send() (line 1768 of /var/www/sites/default/files/checkout/sites/default/modules/privatemsg/privatemsg.module).Uncaught exceptiondatabase.inc1970PDOStatement->execute()
Message sent confirmation displayedOtherprivatemsg.test466PrivatemsgTestCase->testReadAllPermission()
Notice about read all mode displayed.Otherprivatemsg.test471PrivatemsgTestCase->testReadAllPermission()
Failed to set field body[value] to c0atBXxsJzJakvouipIFpihTVZXUMBabxBOaWy4eUmGbfZBjC4M6dIBidIXfA5CIWQ2rAdFXxvumK7cltJC63odzKzEXKVfyeorVOtherprivatemsg.test477PrivatemsgTestCase->testReadAllPermission()
Found the Send message buttonOtherprivatemsg.test477PrivatemsgTestCase->testReadAllPermission()
Found the requested form fields at messages/view/1Otherprivatemsg.test477PrivatemsgTestCase->testReadAllPermission()
First message body displayed.Otherprivatemsg.test484PrivatemsgTestCase->testReadAllPermission()
New message body displayed.Otherprivatemsg.test485PrivatemsgTestCase->testReadAllPermission()
Admin is listed as recipient for every message once.Otherprivatemsg.test491PrivatemsgTestCase->testReadAllPermission()
Failed to set field body[value] to okMgjmpeUDwQGDHsnbvZTiGS2XeujW7S3tDMomN8WkLcTxmgOPnnZYv3diQld1MRBSjryEImrihujvXNZqVS3QdiUEDpKyBwqVTAOtherprivatemsg.test498PrivatemsgTestCase->testReadAllPermission()
Found the Send message buttonOtherprivatemsg.test498PrivatemsgTestCase->testReadAllPermission()
Found the requested form fields at messages/view/1Otherprivatemsg.test498PrivatemsgTestCase->testReadAllPermission()
First message body displayed.Otherprivatemsg.test501PrivatemsgTestCase->testReadAllPermission()
Second response body displayed.Otherprivatemsg.test502PrivatemsgTestCase->testReadAllPermission()
Third message body displayed.Otherprivatemsg.test503PrivatemsgTestCase->testReadAllPermission()
Admin is listed as recipient for every message once.Otherprivatemsg.test509PrivatemsgTestCase->testReadAllPermission()
PDOException: %message in _privatemsg_send() (line 1768 of /var/www/sites/default/files/checkout/sites/default/modules/privatemsg/privatemsg.module).Uncaught exceptiondatabase.inc1970PDOStatement->execute()
PDOException: %message in _privatemsg_send() (line 1768 of /var/www/sites/default/files/checkout/sites/default/modules/privatemsg/privatemsg.module).Uncaught exceptiondatabase.inc1970PDOStatement->execute()
ExpandPrivatemsg links (PrivatemsgLinksTestCase) [Privatemsg]13950
MessageGroupFilenameLineFunctionStatus
"A message has been sent to cm4PAFTQ" foundOtherprivatemsg.test990PrivatemsgLinksTestCase->testAuthorLinks()
"Message regarding zDPjtJDOME" foundOtherprivatemsg.test998PrivatemsgLinksTestCase->testAuthorLinks()
Messages link including new message information displayedOtherprivatemsg.test1037PrivatemsgLinksTestCase->testMenuBlock()
Privatemsg new block title displayed.Otherprivatemsg.test1065PrivatemsgLinksTestCase->testNewBlock()
New message indication displayed.Otherprivatemsg.test1067PrivatemsgLinksTestCase->testNewBlock()
ExpandPrivatemsg Roles functionality (PrivatemsgRolesTestCase) [Privatemsg]6789931
MessageGroupFilenameLineFunctionStatus
PDOException: %message in _privatemsg_send() (line 1768 of /var/www/sites/default/files/checkout/sites/default/modules/privatemsg/privatemsg.module).Uncaught exceptiondatabase.inc1970PDOStatement->execute()
PDOException: %message in _privatemsg_send() (line 1768 of /var/www/sites/default/files/checkout/sites/default/modules/privatemsg/privatemsg.module).Uncaught exceptiondatabase.inc1970PDOStatement->execute()
"A message has been sent to eMeEdkxi (role)." foundOtherprivatemsg_roles.test122PrivatemsgRolesTestCase->testSendMessagetoRoleBatch()
Message is displayed as newOtherprivatemsg_roles.test128PrivatemsgRolesTestCase->testSendMessagetoRoleBatch()
Undefined variable: url_targetNoticedrupal_web_test_case.php2324DrupalWebTestCase->clickLink()
Clicked link q5O7GByksD () from http://localhost/checkout/?q=messagesBrowserprivatemsg_roles.test130PrivatemsgRolesTestCase->testSendMessagetoRoleBatch()
Thread starter body displayed.Otherprivatemsg_roles.test131PrivatemsgRolesTestCase->testSendMessagetoRoleBatch()
Message is displayed as newOtherprivatemsg_roles.test128PrivatemsgRolesTestCase->testSendMessagetoRoleBatch()
Undefined variable: url_targetNoticedrupal_web_test_case.php2324DrupalWebTestCase->clickLink()
Clicked link q5O7GByksD () from http://localhost/checkout/?q=messagesBrowserprivatemsg_roles.test130PrivatemsgRolesTestCase->testSendMessagetoRoleBatch()
Thread starter body displayed.Otherprivatemsg_roles.test131PrivatemsgRolesTestCase->testSendMessagetoRoleBatch()
Message is displayed as newOtherprivatemsg_roles.test128PrivatemsgRolesTestCase->testSendMessagetoRoleBatch()
Undefined variable: url_targetNoticedrupal_web_test_case.php2324DrupalWebTestCase->clickLink()
Clicked link q5O7GByksD () from http://localhost/checkout/?q=messagesBrowserprivatemsg_roles.test130PrivatemsgRolesTestCase->testSendMessagetoRoleBatch()
Thread starter body displayed.Otherprivatemsg_roles.test131PrivatemsgRolesTestCase->testSendMessagetoRoleBatch()
Message is displayed as newOtherprivatemsg_roles.test128PrivatemsgRolesTestCase->testSendMessagetoRoleBatch()
Undefined variable: url_targetNoticedrupal_web_test_case.php2324DrupalWebTestCase->clickLink()
Clicked link q5O7GByksD () from http://localhost/checkout/?q=messagesBrowserprivatemsg_roles.test130PrivatemsgRolesTestCase->testSendMessagetoRoleBatch()
Thread starter body displayed.Otherprivatemsg_roles.test131PrivatemsgRolesTestCase->testSendMessagetoRoleBatch()
Message is displayed as newOtherprivatemsg_roles.test128PrivatemsgRolesTestCase->testSendMessagetoRoleBatch()
Undefined variable: url_targetNoticedrupal_web_test_case.php2324DrupalWebTestCase->clickLink()
Clicked link q5O7GByksD () from http://localhost/checkout/?q=messagesBrowserprivatemsg_roles.test130PrivatemsgRolesTestCase->testSendMessagetoRoleBatch()
Thread starter body displayed.Otherprivatemsg_roles.test131PrivatemsgRolesTestCase->testSendMessagetoRoleBatch()
Message is displayed as newOtherprivatemsg_roles.test128PrivatemsgRolesTestCase->testSendMessagetoRoleBatch()
Undefined variable: url_targetNoticedrupal_web_test_case.php2324DrupalWebTestCase->clickLink()
Clicked link q5O7GByksD () from http://localhost/checkout/?q=messagesBrowserprivatemsg_roles.test130PrivatemsgRolesTestCase->testSendMessagetoRoleBatch()
Thread starter body displayed.Otherprivatemsg_roles.test131PrivatemsgRolesTestCase->testSendMessagetoRoleBatch()
Message is displayed as newOtherprivatemsg_roles.test128PrivatemsgRolesTestCase->testSendMessagetoRoleBatch()
Undefined variable: url_targetNoticedrupal_web_test_case.php2324DrupalWebTestCase->clickLink()
Clicked link q5O7GByksD () from http://localhost/checkout/?q=messagesBrowserprivatemsg_roles.test130PrivatemsgRolesTestCase->testSendMessagetoRoleBatch()
Thread starter body displayed.Otherprivatemsg_roles.test131PrivatemsgRolesTestCase->testSendMessagetoRoleBatch()
Message is displayed as newOtherprivatemsg_roles.test128PrivatemsgRolesTestCase->testSendMessagetoRoleBatch()
Undefined variable: url_targetNoticedrupal_web_test_case.php2324DrupalWebTestCase->clickLink()
Clicked link q5O7GByksD () from http://localhost/checkout/?q=messagesBrowserprivatemsg_roles.test130PrivatemsgRolesTestCase->testSendMessagetoRoleBatch()
Thread starter body displayed.Otherprivatemsg_roles.test131PrivatemsgRolesTestCase->testSendMessagetoRoleBatch()
Message is displayed as newOtherprivatemsg_roles.test128PrivatemsgRolesTestCase->testSendMessagetoRoleBatch()
Undefined variable: url_targetNoticedrupal_web_test_case.php2324DrupalWebTestCase->clickLink()
Clicked link q5O7GByksD () from http://localhost/checkout/?q=messagesBrowserprivatemsg_roles.test130PrivatemsgRolesTestCase->testSendMessagetoRoleBatch()
Thread starter body displayed.Otherprivatemsg_roles.test131PrivatemsgRolesTestCase->testSendMessagetoRoleBatch()
Message is displayed as newOtherprivatemsg_roles.test128PrivatemsgRolesTestCase->testSendMessagetoRoleBatch()
Undefined variable: url_targetNoticedrupal_web_test_case.php2324DrupalWebTestCase->clickLink()
Clicked link q5O7GByksD () from http://localhost/checkout/?q=messagesBrowserprivatemsg_roles.test130PrivatemsgRolesTestCase->testSendMessagetoRoleBatch()
Thread starter body displayed.Otherprivatemsg_roles.test131PrivatemsgRolesTestCase->testSendMessagetoRoleBatch()
Message is displayed as newOtherprivatemsg_roles.test128PrivatemsgRolesTestCase->testSendMessagetoRoleBatch()
Undefined variable: url_targetNoticedrupal_web_test_case.php2324DrupalWebTestCase->clickLink()
Clicked link q5O7GByksD () from http://localhost/checkout/?q=messagesBrowserprivatemsg_roles.test130PrivatemsgRolesTestCase->testSendMessagetoRoleBatch()
Thread starter body displayed.Otherprivatemsg_roles.test131PrivatemsgRolesTestCase->testSendMessagetoRoleBatch()
Message is displayed as newOtherprivatemsg_roles.test128PrivatemsgRolesTestCase->testSendMessagetoRoleBatch()
Undefined variable: url_targetNoticedrupal_web_test_case.php2324DrupalWebTestCase->clickLink()
Clicked link q5O7GByksD () from http://localhost/checkout/?q=messagesBrowserprivatemsg_roles.test130PrivatemsgRolesTestCase->testSendMessagetoRoleBatch()
Thread starter body displayed.Otherprivatemsg_roles.test131PrivatemsgRolesTestCase->testSendMessagetoRoleBatch()
Message is displayed as newOtherprivatemsg_roles.test128PrivatemsgRolesTestCase->testSendMessagetoRoleBatch()
Undefined variable: url_targetNoticedrupal_web_test_case.php2324DrupalWebTestCase->clickLink()
Clicked link q5O7GByksD () from http://localhost/checkout/?q=messagesBrowserprivatemsg_roles.test130PrivatemsgRolesTestCase->testSendMessagetoRoleBatch()
Thread starter body displayed.Otherprivatemsg_roles.test131PrivatemsgRolesTestCase->testSendMessagetoRoleBatch()
Message is displayed as newOtherprivatemsg_roles.test128PrivatemsgRolesTestCase->testSendMessagetoRoleBatch()
Undefined variable: url_targetNoticedrupal_web_test_case.php2324DrupalWebTestCase->clickLink()
Clicked link q5O7GByksD () from http://localhost/checkout/?q=messagesBrowserprivatemsg_roles.test130PrivatemsgRolesTestCase->testSendMessagetoRoleBatch()
Thread starter body displayed.Otherprivatemsg_roles.test131PrivatemsgRolesTestCase->testSendMessagetoRoleBatch()
Message is displayed as newOtherprivatemsg_roles.test128PrivatemsgRolesTestCase->testSendMessagetoRoleBatch()
Undefined variable: url_targetNoticedrupal_web_test_case.php2324DrupalWebTestCase->clickLink()
Clicked link q5O7GByksD () from http://localhost/checkout/?q=messagesBrowserprivatemsg_roles.test130PrivatemsgRolesTestCase->testSendMessagetoRoleBatch()
Thread starter body displayed.Otherprivatemsg_roles.test131PrivatemsgRolesTestCase->testSendMessagetoRoleBatch()
Message is displayed as newOtherprivatemsg_roles.test128PrivatemsgRolesTestCase->testSendMessagetoRoleBatch()
Undefined variable: url_targetNoticedrupal_web_test_case.php2324DrupalWebTestCase->clickLink()
Clicked link q5O7GByksD () from http://localhost/checkout/?q=messagesBrowserprivatemsg_roles.test130PrivatemsgRolesTestCase->testSendMessagetoRoleBatch()
Thread starter body displayed.Otherprivatemsg_roles.test131PrivatemsgRolesTestCase->testSendMessagetoRoleBatch()
Message is displayed as newOtherprivatemsg_roles.test128PrivatemsgRolesTestCase->testSendMessagetoRoleBatch()
Undefined variable: url_targetNoticedrupal_web_test_case.php2324DrupalWebTestCase->clickLink()
Clicked link q5O7GByksD () from http://localhost/checkout/?q=messagesBrowserprivatemsg_roles.test130PrivatemsgRolesTestCase->testSendMessagetoRoleBatch()
Thread starter body displayed.Otherprivatemsg_roles.test131PrivatemsgRolesTestCase->testSendMessagetoRoleBatch()
Message is displayed as newOtherprivatemsg_roles.test128PrivatemsgRolesTestCase->testSendMessagetoRoleBatch()
Undefined variable: url_targetNoticedrupal_web_test_case.php2324DrupalWebTestCase->clickLink()
Clicked link q5O7GByksD () from http://localhost/checkout/?q=messagesBrowserprivatemsg_roles.test130PrivatemsgRolesTestCase->testSendMessagetoRoleBatch()
Thread starter body displayed.Otherprivatemsg_roles.test131PrivatemsgRolesTestCase->testSendMessagetoRoleBatch()
Message is displayed as newOtherprivatemsg_roles.test128PrivatemsgRolesTestCase->testSendMessagetoRoleBatch()
Undefined variable: url_targetNoticedrupal_web_test_case.php2324DrupalWebTestCase->clickLink()
Clicked link q5O7GByksD () from http://localhost/checkout/?q=messagesBrowserprivatemsg_roles.test130PrivatemsgRolesTestCase->testSendMessagetoRoleBatch()
Thread starter body displayed.Otherprivatemsg_roles.test131PrivatemsgRolesTestCase->testSendMessagetoRoleBatch()
Message is displayed as newOtherprivatemsg_roles.test128PrivatemsgRolesTestCase->testSendMessagetoRoleBatch()
Undefined variable: url_targetNoticedrupal_web_test_case.php2324DrupalWebTestCase->clickLink()
Clicked link q5O7GByksD () from http://localhost/checkout/?q=messagesBrowserprivatemsg_roles.test130PrivatemsgRolesTestCase->testSendMessagetoRoleBatch()
Thread starter body displayed.Otherprivatemsg_roles.test131PrivatemsgRolesTestCase->testSendMessagetoRoleBatch()
Message is displayed as newOtherprivatemsg_roles.test128PrivatemsgRolesTestCase->testSendMessagetoRoleBatch()
Undefined variable: url_targetNoticedrupal_web_test_case.php2324DrupalWebTestCase->clickLink()
Clicked link q5O7GByksD () from http://localhost/checkout/?q=messagesBrowserprivatemsg_roles.test130PrivatemsgRolesTestCase->testSendMessagetoRoleBatch()
Thread starter body displayed.Otherprivatemsg_roles.test131PrivatemsgRolesTestCase->testSendMessagetoRoleBatch()
Message is displayed as newOtherprivatemsg_roles.test128PrivatemsgRolesTestCase->testSendMessagetoRoleBatch()
Undefined variable: url_targetNoticedrupal_web_test_case.php2324DrupalWebTestCase->clickLink()
Clicked link q5O7GByksD () from http://localhost/checkout/?q=messagesBrowserprivatemsg_roles.test130PrivatemsgRolesTestCase->testSendMessagetoRoleBatch()
Thread starter body displayed.Otherprivatemsg_roles.test131PrivatemsgRolesTestCase->testSendMessagetoRoleBatch()
Message is displayed as newOtherprivatemsg_roles.test128PrivatemsgRolesTestCase->testSendMessagetoRoleBatch()
Undefined variable: url_targetNoticedrupal_web_test_case.php2324DrupalWebTestCase->clickLink()
Clicked link q5O7GByksD () from http://localhost/checkout/?q=messagesBrowserprivatemsg_roles.test130PrivatemsgRolesTestCase->testSendMessagetoRoleBatch()
Thread starter body displayed.Otherprivatemsg_roles.test131PrivatemsgRolesTestCase->testSendMessagetoRoleBatch()
Message is displayed as newOtherprivatemsg_roles.test128PrivatemsgRolesTestCase->testSendMessagetoRoleBatch()
Undefined variable: url_targetNoticedrupal_web_test_case.php2324DrupalWebTestCase->clickLink()
Clicked link q5O7GByksD () from http://localhost/checkout/?q=messagesBrowserprivatemsg_roles.test130PrivatemsgRolesTestCase->testSendMessagetoRoleBatch()
Thread starter body displayed.Otherprivatemsg_roles.test131PrivatemsgRolesTestCase->testSendMessagetoRoleBatch()
Message is displayed as newOtherprivatemsg_roles.test128PrivatemsgRolesTestCase->testSendMessagetoRoleBatch()
Undefined variable: url_targetNoticedrupal_web_test_case.php2324DrupalWebTestCase->clickLink()
Clicked link q5O7GByksD () from http://localhost/checkout/?q=messagesBrowserprivatemsg_roles.test130PrivatemsgRolesTestCase->testSendMessagetoRoleBatch()
Thread starter body displayed.Otherprivatemsg_roles.test131PrivatemsgRolesTestCase->testSendMessagetoRoleBatch()
"A message has been sent to i3WT2c9Z (role)." foundOtherprivatemsg_roles.test175PrivatemsgRolesTestCase->testSendMessageToRole()
Message is displayed as newOtherprivatemsg_roles.test181PrivatemsgRolesTestCase->testSendMessageToRole()
Undefined variable: url_targetNoticedrupal_web_test_case.php2324DrupalWebTestCase->clickLink()
Clicked link m0RIv4BLT6 () from http://localhost/checkout/?q=messagesBrowserprivatemsg_roles.test183PrivatemsgRolesTestCase->testSendMessageToRole()
Thread starter body displayed.Otherprivatemsg_roles.test184PrivatemsgRolesTestCase->testSendMessageToRole()
Failed to set field body[value] to t2YkBtsHPsahbzMB1ZHcbXSs4zN3rEXcF4qC14eoFQVBxLedhlOtherprivatemsg_roles.test193PrivatemsgRolesTestCase->testSendMessageToRole()
Found the Send message buttonOtherprivatemsg_roles.test193PrivatemsgRolesTestCase->testSendMessageToRole()
Found the requested form fields at Otherprivatemsg_roles.test193PrivatemsgRolesTestCase->testSendMessageToRole()
Message is displayed as newOtherprivatemsg_roles.test201PrivatemsgRolesTestCase->testSendMessageToRole()
Undefined variable: url_targetNoticedrupal_web_test_case.php2324DrupalWebTestCase->clickLink()
Clicked link m0RIv4BLT6 () from http://localhost/checkout/?q=messagesBrowserprivatemsg_roles.test202PrivatemsgRolesTestCase->testSendMessageToRole()
Reply1 is displayedOtherprivatemsg_roles.test204PrivatemsgRolesTestCase->testSendMessageToRole()
Failed to set field body[value] to qYdsaj69midFK46eiCoYU35ERyQXtTCsltddzaIKjEClNJC3LkOtherprivatemsg_roles.test210PrivatemsgRolesTestCase->testSendMessageToRole()
Found the Send message buttonOtherprivatemsg_roles.test210PrivatemsgRolesTestCase->testSendMessageToRole()
Found the requested form fields at Otherprivatemsg_roles.test210PrivatemsgRolesTestCase->testSendMessageToRole()
Message is displayed as newOtherprivatemsg_roles.test215PrivatemsgRolesTestCase->testSendMessageToRole()
Undefined variable: url_targetNoticedrupal_web_test_case.php2324DrupalWebTestCase->clickLink()
Clicked link m0RIv4BLT6 () from http://localhost/checkout/?q=messagesBrowserprivatemsg_roles.test216PrivatemsgRolesTestCase->testSendMessageToRole()
"i3WT2c9Z (role)" foundOtherprivatemsg_roles.test217PrivatemsgRolesTestCase->testSendMessageToRole()
Thread starter body is displayedOtherprivatemsg_roles.test219PrivatemsgRolesTestCase->testSendMessageToRole()
Reply2 is displayedOtherprivatemsg_roles.test221PrivatemsgRolesTestCase->testSendMessageToRole()
"A message has been sent to kkAHwZn7 (role)." foundOtherprivatemsg_roles.test246PrivatemsgRolesTestCase->testSendMessageToRoleBlocked()
Message is displayed as newOtherprivatemsg_roles.test252PrivatemsgRolesTestCase->testSendMessageToRoleBlocked()
Undefined variable: url_targetNoticedrupal_web_test_case.php2324DrupalWebTestCase->clickLink()
Clicked link lpMgHbAtdO () from http://localhost/checkout/?q=messagesBrowserprivatemsg_roles.test254PrivatemsgRolesTestCase->testSendMessageToRoleBlocked()
Thread starter body displayed.Otherprivatemsg_roles.test255PrivatemsgRolesTestCase->testSendMessageToRoleBlocked()
"A message has been sent to bGsyPPY0 (role)." foundOtherprivatemsg_roles.test279PrivatemsgRolesTestCase->testNewUser()
ExpandPrivatemsg Tags functionality. (PrivatemsgTagsTestCase) [Privatemsg]9303
MessageGroupFilenameLineFunctionStatus
PDOException: %message in _privatemsg_send() (line 1768 of /var/www/sites/default/files/checkout/sites/default/modules/privatemsg/privatemsg.module).Uncaught exceptiondatabase.inc1970PDOStatement->execute()
PDOException: %message in _privatemsg_send() (line 1768 of /var/www/sites/default/files/checkout/sites/default/modules/privatemsg/privatemsg.module).Uncaught exceptiondatabase.inc1970PDOStatement->execute()
PDOException: %message in _privatemsg_send() (line 1768 of /var/www/sites/default/files/checkout/sites/default/modules/privatemsg/privatemsg.module).Uncaught exceptiondatabase.inc1970PDOStatement->execute()
ExpandPrivatemsg tokens (PrivatemsgTokenTestCase) [Privatemsg]66202
MessageGroupFilenameLineFunctionStatus
Token is displayed in subject.Otherprivatemsg.test1127PrivatemsgTokenTestCase->testBasicTokens()
Subject token is displayed.Otherprivatemsg.test1128PrivatemsgTokenTestCase->testBasicTokens()
Author token is displayed.Otherprivatemsg.test1129PrivatemsgTokenTestCase->testBasicTokens()
Invalid token is displayed.Otherprivatemsg.test1130PrivatemsgTokenTestCase->testBasicTokens()
Token notice is displayed.Otherprivatemsg.test1131PrivatemsgTokenTestCase->testBasicTokens()
Undefined variable: url_targetNoticedrupal_web_test_case.php2324DrupalWebTestCase->clickLink()
Clicked link Hey vFhfb8r8 () from http://localhost/checkout/?q=messagesBrowserprivatemsg.test1137PrivatemsgTokenTestCase->testBasicTokens()
Replaced token is displayed in subject.Otherprivatemsg.test1141PrivatemsgTokenTestCase->testBasicTokens()
Subject token is replaced.Otherprivatemsg.test1142PrivatemsgTokenTestCase->testBasicTokens()
Author token is replaced.Otherprivatemsg.test1143PrivatemsgTokenTestCase->testBasicTokens()
Invalid token is displayed.Otherprivatemsg.test1144PrivatemsgTokenTestCase->testBasicTokens()
Failed to set field body[value] to Response with a token [privatemsg_message:mid]Otherprivatemsg.test1152PrivatemsgTokenTestCase->testBasicTokens()
Found the Send message buttonOtherprivatemsg.test1152PrivatemsgTokenTestCase->testBasicTokens()
Found the requested form fields at Otherprivatemsg.test1152PrivatemsgTokenTestCase->testBasicTokens()
Undefined variable: url_targetNoticedrupal_web_test_case.php2324DrupalWebTestCase->clickLink()
Clicked link Hey wMUcJRHM () from http://localhost/checkout/?q=messagesBrowserprivatemsg.test1156PrivatemsgTokenTestCase->testBasicTokens()
Replaced token is displayed in subject.Otherprivatemsg.test1160PrivatemsgTokenTestCase->testBasicTokens()
Subject token is replaced.Otherprivatemsg.test1161PrivatemsgTokenTestCase->testBasicTokens()
Author token is replaced.Otherprivatemsg.test1162PrivatemsgTokenTestCase->testBasicTokens()
Invalid token is displayed.Otherprivatemsg.test1163PrivatemsgTokenTestCase->testBasicTokens()
Token from recipient is not replaced.Otherprivatemsg.test1164PrivatemsgTokenTestCase->testBasicTokens()
Token is displayed correctly in subject for author.Otherprivatemsg.test1171PrivatemsgTokenTestCase->testBasicTokens()
ExpandUser blocking functionality. (PrivatemsgBlockUserCase) [Privatemsg]901
MessageGroupFilenameLineFunctionStatus
PDOException: %message in _privatemsg_send() (line 1768 of /var/www/sites/default/files/checkout/sites/default/modules/privatemsg/privatemsg.module).Uncaught exceptiondatabase.inc1970PDOStatement->execute()