loading_tokens_uri3.patch

Test status
StatusResult
Last receivedWed, 10/20/2010 - 23:22:01
Last requestedWed, 10/20/2010 - 23:54:15
Last testedWed, 10/20/2010 - 23:56:21
Test count1
Environment status
MySQLfail
File information
Fileloading_tokens_uri3.patch
BranchPrivatemsg - 7.x-1.x
LinkIssue Link
SummaryFAILED: [[SimpleTest]]: [MySQL] 1,416 pass(es), 267 fail(s), and 59 exception(s).
Details

MySQL

  1. Setup environment
  2. Detect an invalid patch URL
  3. Detect invalid repository information
  4. Detect invalid patch format
  5. Detect a non-applicable patch
  6. Detect invalid PHP syntax
  7. Detect a Drupal installation failure
  8. Detect a test run failure
  9. Detect a failing test
    Review the test failures below then if necessary run them locally until the problem has been fixed.
  10. Complete test suite with all tests passing
1,416 pass(es), 267 fail(s), and 59 exception(s)

Non-pass

Test namePassFailException
ExpandPrivatemsg API functionality. (PrivatemsgAPITestCase) [Privatemsg]2402
MessageGroupFilenameLineFunctionStatus
PDOException: %message in _privatemsg_send() (line 1768 of /var/lib/drupaltestbot/sites/default/files/checkout/sites/default/modules/privatemsg/privatemsg.module).Uncaught exceptiondatabase.inc1970PDOStatement->execute()
PDOException: %message in _privatemsg_send() (line 1768 of /var/lib/drupaltestbot/sites/default/files/checkout/sites/default/modules/privatemsg/privatemsg.module).Uncaught exceptiondatabase.inc1970PDOStatement->execute()
ExpandPrivatemsg fields. (PrivatemsgFieldsTestCase) [Privatemsg]89123
MessageGroupFilenameLineFunctionStatus
Undefined variable: url_targetNoticedrupal_web_test_case.php2324DrupalWebTestCase->clickLink()
Clicked link zBJPMVyf () from http://pifr-mysql/checkout/?q=messagesBrowserprivatemsg.test853PrivatemsgFieldsTestCase->testSingleField()
Message body displayed.Otherprivatemsg.test855PrivatemsgFieldsTestCase->testSingleField()
Content of new field is displayed.Otherprivatemsg.test856PrivatemsgFieldsTestCase->testSingleField()
Failed to set field body[value] to tOWZ769G8RgLcVhivvMRiKtN1FHT0JdvTZpmUvfHMSBr9T0zfXOtherprivatemsg.test863PrivatemsgFieldsTestCase->testSingleField()
Failed to set field field_ge6egcdv[und][0][value] to lsUxVFxyJwddzLd50JtrriJSG059H7h0YsQN3w1Q62NGRstI9EOtherprivatemsg.test863PrivatemsgFieldsTestCase->testSingleField()
Found the Send message buttonOtherprivatemsg.test863PrivatemsgFieldsTestCase->testSingleField()
Found the requested form fields at Otherprivatemsg.test863PrivatemsgFieldsTestCase->testSingleField()
Undefined variable: url_targetNoticedrupal_web_test_case.php2324DrupalWebTestCase->clickLink()
Clicked link zBJPMVyf () from http://pifr-mysql/checkout/?q=messagesBrowserprivatemsg.test868PrivatemsgFieldsTestCase->testSingleField()
Message body displayed.Otherprivatemsg.test870PrivatemsgFieldsTestCase->testSingleField()
Content of new field is displayed.Otherprivatemsg.test871PrivatemsgFieldsTestCase->testSingleField()
Undefined variable: url_targetNoticedrupal_web_test_case.php2324DrupalWebTestCase->clickLink()
Clicked link cXqEj4KF () from http://pifr-mysql/checkout/?q=messagesBrowserprivatemsg.test911PrivatemsgFieldsTestCase->testEmptyImage()
Message body displayed.Otherprivatemsg.test913PrivatemsgFieldsTestCase->testEmptyImage()
ExpandPrivatemsg Filter functionality. (PrivatemsgFilterTestCase) [Privatemsg]85262
MessageGroupFilenameLineFunctionStatus
Message sent confirmation displayedOtherprivatemsg_filter.test39PrivatemsgFilterTestCase->testInboxSentHandling()
Thread displayed in "Sent messages" for author.Otherprivatemsg_filter.test46PrivatemsgFilterTestCase->testInboxSentHandling()
Thread displayed in "All messages" for author.Otherprivatemsg_filter.test48PrivatemsgFilterTestCase->testInboxSentHandling()
Thread displayed in inbox for recipient.Otherprivatemsg_filter.test53PrivatemsgFilterTestCase->testInboxSentHandling()
Thread displayed in "All messages." for recipient.Otherprivatemsg_filter.test57PrivatemsgFilterTestCase->testInboxSentHandling()
Undefined variable: url_targetNoticedrupal_web_test_case.php2324DrupalWebTestCase->clickLink()
Clicked link jUVgdZvfr1mFpalb0UQE () from http://pifr-mysql/checkout/?q=messages/listBrowserprivatemsg_filter.test60PrivatemsgFilterTestCase->testInboxSentHandling()
Failed to set field body[value] to knKuk372zWwVTthnjXZ93NBPGGJfR8yEIXaucNWwJ5IXqJ1hmxZWRWhpuex6CoF93lPdd9E9cfp59AADNifyBO3Aq3a6gksaW4B5Otherprivatemsg_filter.test64PrivatemsgFilterTestCase->testInboxSentHandling()
Found the Send message buttonOtherprivatemsg_filter.test64PrivatemsgFilterTestCase->testInboxSentHandling()
Found the requested form fields at Otherprivatemsg_filter.test64PrivatemsgFilterTestCase->testInboxSentHandling()
Message sent confirmation displayedOtherprivatemsg_filter.test65PrivatemsgFilterTestCase->testInboxSentHandling()
Thread displayed in "Sent messages" for recipient.Otherprivatemsg_filter.test68PrivatemsgFilterTestCase->testInboxSentHandling()
Thread displayed in inbox for author.Otherprivatemsg_filter.test72PrivatemsgFilterTestCase->testInboxSentHandling()
Failed to set field list[1] to 1Otherprivatemsg_filter.test79PrivatemsgFilterTestCase->testInboxSentHandling()
Found the Delete buttonOtherprivatemsg_filter.test79PrivatemsgFilterTestCase->testInboxSentHandling()
Found the requested form fields at Otherprivatemsg_filter.test79PrivatemsgFilterTestCase->testInboxSentHandling()
Undefined variable: url_targetNoticedrupal_web_test_case.php2324DrupalWebTestCase->clickLink()
Clicked link jUVgdZvfr1mFpalb0UQE () from http://pifr-mysql/checkout/?q=messagesBrowserprivatemsg_filter.test87PrivatemsgFilterTestCase->testInboxSentHandling()
Failed to set field body[value] to epnlsBkvjfdPluN6haRdix8nTYkO2YdDOdsN30fB7BA0Ve0y69BYan7nSm4hhndI8DnXat5GQW7xL29WXr7q1og3nJDaHVgUGOBVOtherprivatemsg_filter.test91PrivatemsgFilterTestCase->testInboxSentHandling()
Found the Send message buttonOtherprivatemsg_filter.test91PrivatemsgFilterTestCase->testInboxSentHandling()
Found the requested form fields at Otherprivatemsg_filter.test91PrivatemsgFilterTestCase->testInboxSentHandling()
Message sent confirmation displayedOtherprivatemsg_filter.test92PrivatemsgFilterTestCase->testInboxSentHandling()
Thread displayed again in inbox for author.Otherprivatemsg_filter.test97PrivatemsgFilterTestCase->testInboxSentHandling()
Failed to set field list[1] to 1Otherprivatemsg_filter.test104PrivatemsgFilterTestCase->testInboxSentHandling()
Found the Archive buttonOtherprivatemsg_filter.test104PrivatemsgFilterTestCase->testInboxSentHandling()
Found the requested form fields at Otherprivatemsg_filter.test104PrivatemsgFilterTestCase->testInboxSentHandling()
Confirmation message displayedOtherprivatemsg_filter.test105PrivatemsgFilterTestCase->testInboxSentHandling()
Thread still displayed in "All messages" list.Otherprivatemsg_filter.test109PrivatemsgFilterTestCase->testInboxSentHandling()
ExpandPrivatemsg filter widget (PrivatemsgFilterWidgetTestCase) [Privatemsg]1701
MessageGroupFilenameLineFunctionStatus
PDOException: %message in _privatemsg_send() (line 1768 of /var/lib/drupaltestbot/sites/default/files/checkout/sites/default/modules/privatemsg/privatemsg.module).Uncaught exceptiondatabase.inc1970PDOStatement->execute()
ExpandPrivatemsg functionality. (PrivatemsgTestCase) [Privatemsg]21610514
MessageGroupFilenameLineFunctionStatus
PDOException: %message in _privatemsg_send() (line 1768 of /var/lib/drupaltestbot/sites/default/files/checkout/sites/default/modules/privatemsg/privatemsg.module).Uncaught exceptiondatabase.inc1970PDOStatement->execute()
PDOException: %message in _privatemsg_send() (line 1768 of /var/lib/drupaltestbot/sites/default/files/checkout/sites/default/modules/privatemsg/privatemsg.module).Uncaught exceptiondatabase.inc1970PDOStatement->execute()
Invalid permission .Roleprivatemsg.test204PrivatemsgTestCase->testWriteReplyPrivatemsg()
Argument 1 passed to DrupalWebTestCase::drupalLogin() must be an instance of stdClass, boolean given, called in /var/lib/drupaltestbot/sites/default/files/checkout/sites/default/modules/privatemsg/privatemsg.test on line 209 and definedRecoverable errordrupal_web_test_case.php1112DrupalWebTestCase->drupalLogin()
Trying to get property of non-objectNoticedrupal_web_test_case.php1118DrupalWebTestCase->drupalLogin()
Trying to get property of non-objectNoticedrupal_web_test_case.php1119DrupalWebTestCase->drupalLogin()
Failed to set field name to Otherprivatemsg.test209PrivatemsgTestCase->testWriteReplyPrivatemsg()
Failed to set field pass to Otherprivatemsg.test209PrivatemsgTestCase->testWriteReplyPrivatemsg()
Found the requested form fields at userOtherprivatemsg.test209PrivatemsgTestCase->testWriteReplyPrivatemsg()
Trying to get property of non-objectNoticedrupal_web_test_case.php1125DrupalWebTestCase->drupalLogin()
User successfully logged in.User loginprivatemsg.test209PrivatemsgTestCase->testWriteReplyPrivatemsg()
Failed to set field recipient to ayYkAGKo [user]Otherprivatemsg.test270PrivatemsgTestCase->testWriteReplyPrivatemsg()
Failed to set field subject to dbmNZz2owHibMS0yTncXOtherprivatemsg.test270PrivatemsgTestCase->testWriteReplyPrivatemsg()
Failed to set field body[value] to dbL9J4H809kxjhGQTfqDcajQRk8ZbnOZkFRfNTrIpxT6sxK1Gj2MvxS08fr1JaAJsmFFdY8gUkAZV6YQpEa0ylzZJjaCCqWZmXpOOtherprivatemsg.test270PrivatemsgTestCase->testWriteReplyPrivatemsg()
Found the Send message buttonOtherprivatemsg.test270PrivatemsgTestCase->testWriteReplyPrivatemsg()
Found the requested form fields at messages/newOtherprivatemsg.test270PrivatemsgTestCase->testWriteReplyPrivatemsg()
Message sent confirmation displayed.Otherprivatemsg.test271PrivatemsgTestCase->testWriteReplyPrivatemsg()
Failed to set field recipient to ayYkAGKo, mYaEEgJyOtherprivatemsg.test273PrivatemsgTestCase->testWriteReplyPrivatemsg()
Failed to set field subject to hR5cOXA4jY6xwwj27marOtherprivatemsg.test273PrivatemsgTestCase->testWriteReplyPrivatemsg()
Failed to set field body[value] to wU82nBB5DRqlMQA2RNX8RRewCJ3crVVoWaEywA3cmsrEeR5E66lsgB72AFwcZ8bcdeKHQ6F47Y6gPAkTjakwLHtkOlBFuaHFYNS1Otherprivatemsg.test273PrivatemsgTestCase->testWriteReplyPrivatemsg()
Found the Send message buttonOtherprivatemsg.test273PrivatemsgTestCase->testWriteReplyPrivatemsg()
Found the requested form fields at messages/newOtherprivatemsg.test273PrivatemsgTestCase->testWriteReplyPrivatemsg()
Message sent confirmation displayed.Otherprivatemsg.test274PrivatemsgTestCase->testWriteReplyPrivatemsg()
Failed to set field recipient to Otherprivatemsg.test276PrivatemsgTestCase->testWriteReplyPrivatemsg()
Failed to set field subject to isVeoG1W7z5TaQj2U6oiOtherprivatemsg.test276PrivatemsgTestCase->testWriteReplyPrivatemsg()
Failed to set field body[value] to vSZ51K5SYE7KpRcLXBr3X8vI6XKmDIvt1s5xtaxVUMLfCOs1RdgqkIzFoskredPc5kmaYibnJEO5oZ4EGQCatR8kanjgsqb0M0vSOtherprivatemsg.test276PrivatemsgTestCase->testWriteReplyPrivatemsg()
Found the Send message buttonOtherprivatemsg.test276PrivatemsgTestCase->testWriteReplyPrivatemsg()
Found the requested form fields at messages/newOtherprivatemsg.test276PrivatemsgTestCase->testWriteReplyPrivatemsg()
Message was not sent.Otherprivatemsg.test277PrivatemsgTestCase->testWriteReplyPrivatemsg()
Failed to set field recipient to vNbqXOtherprivatemsg.test279PrivatemsgTestCase->testWriteReplyPrivatemsg()
Failed to set field subject to vWtCpC8hYgzHnEOWUPZIOtherprivatemsg.test279PrivatemsgTestCase->testWriteReplyPrivatemsg()
Failed to set field body[value] to orvEPn3OjFRdvJsH35fFxOZUzymBmWBrE8NFCm5lAeOE96vY5ThL9tHGHnv13LmH5iPBO38VEh69uBbK1nUYccJfBRFn1SvwA8wwOtherprivatemsg.test279PrivatemsgTestCase->testWriteReplyPrivatemsg()
Found the Send message buttonOtherprivatemsg.test279PrivatemsgTestCase->testWriteReplyPrivatemsg()
Found the requested form fields at messages/newOtherprivatemsg.test279PrivatemsgTestCase->testWriteReplyPrivatemsg()
Message was not sent.Otherprivatemsg.test280PrivatemsgTestCase->testWriteReplyPrivatemsg()
Message about non-existing user displayed.Otherprivatemsg.test281PrivatemsgTestCase->testWriteReplyPrivatemsg()
Failed to set field recipient to ayYkAGKoOtherprivatemsg.test283PrivatemsgTestCase->testWriteReplyPrivatemsg()
Failed to set field subject to bKUgY68Of5yZEzffjE4hOtherprivatemsg.test283PrivatemsgTestCase->testWriteReplyPrivatemsg()
Failed to set field body[value] to Otherprivatemsg.test283PrivatemsgTestCase->testWriteReplyPrivatemsg()
Found the Send message buttonOtherprivatemsg.test283PrivatemsgTestCase->testWriteReplyPrivatemsg()
Found the requested form fields at messages/newOtherprivatemsg.test283PrivatemsgTestCase->testWriteReplyPrivatemsg()
Message sent confirmation displayed.Otherprivatemsg.test284PrivatemsgTestCase->testWriteReplyPrivatemsg()
Failed to set field recipient to ayYkAGKoOtherprivatemsg.test286PrivatemsgTestCase->testWriteReplyPrivatemsg()
Failed to set field subject to Otherprivatemsg.test286PrivatemsgTestCase->testWriteReplyPrivatemsg()
Failed to set field body[value] to hzpHeTScBjHLV67pFs4bIKGHZKwx87tAnjOyfHphR3w9q9gjNdoZyLCaWF9kThyf7wzstp3AJSs5loOV0u2SCOzV6KRRD8w4xZ5YOtherprivatemsg.test286PrivatemsgTestCase->testWriteReplyPrivatemsg()
Found the Send message buttonOtherprivatemsg.test286PrivatemsgTestCase->testWriteReplyPrivatemsg()
Found the requested form fields at messages/newOtherprivatemsg.test286PrivatemsgTestCase->testWriteReplyPrivatemsg()
Message sent confirmation displayed.Otherprivatemsg.test287PrivatemsgTestCase->testWriteReplyPrivatemsg()
Failed to set field recipient to ayYkAGKoOtherprivatemsg.test289PrivatemsgTestCase->testWriteReplyPrivatemsg()
Failed to set field subject to Otherprivatemsg.test289PrivatemsgTestCase->testWriteReplyPrivatemsg()
Failed to set field body[value] to Otherprivatemsg.test289PrivatemsgTestCase->testWriteReplyPrivatemsg()
Found the Send message buttonOtherprivatemsg.test289PrivatemsgTestCase->testWriteReplyPrivatemsg()
Found the requested form fields at messages/newOtherprivatemsg.test289PrivatemsgTestCase->testWriteReplyPrivatemsg()
Empty subject message displayed.Otherprivatemsg.test290PrivatemsgTestCase->testWriteReplyPrivatemsg()
Failed to set field recipient to hVxjq, ayYkAGKoOtherprivatemsg.test292PrivatemsgTestCase->testWriteReplyPrivatemsg()
Failed to set field subject to qvSJ0FI91ChSnvfGlSbbOtherprivatemsg.test292PrivatemsgTestCase->testWriteReplyPrivatemsg()
Failed to set field body[value] to h4Zz1XmlgrNY9yFNGJQkuy40W17EuusZ03AE3kdjWBRl3r88FeDul8a5z2k7NP7pSJgAqaQ9bnZKw01YbWYVgA0c72PKYsu3XOhHOtherprivatemsg.test292PrivatemsgTestCase->testWriteReplyPrivatemsg()
Found the Send message buttonOtherprivatemsg.test292PrivatemsgTestCase->testWriteReplyPrivatemsg()
Found the requested form fields at messages/newOtherprivatemsg.test292PrivatemsgTestCase->testWriteReplyPrivatemsg()
Message sent confirmation displayed.Otherprivatemsg.test293PrivatemsgTestCase->testWriteReplyPrivatemsg()
Message about non-existing user displayed.Otherprivatemsg.test294PrivatemsgTestCase->testWriteReplyPrivatemsg()
Failed to set field recipient to mYaEEgJyOtherprivatemsg.test296PrivatemsgTestCase->testWriteReplyPrivatemsg()
Failed to set field subject to r8QABgK2o4yRcVfHqmsnOtherprivatemsg.test296PrivatemsgTestCase->testWriteReplyPrivatemsg()
Failed to set field body[value] to lckyINdyQwfSFm0sQcvN22Ur3yP1GHpbczbFr2fvz8hKbmSjfLoLPOeCOhEZWAkMtoosZntH5h4E5bTCsQubde4lyEcTmoA8qmsv<b>formatted message #1</b>Otherprivatemsg.test296PrivatemsgTestCase->testWriteReplyPrivatemsg()
Failed to set field body[format] to 3Otherprivatemsg.test296PrivatemsgTestCase->testWriteReplyPrivatemsg()
Found the Send message buttonOtherprivatemsg.test296PrivatemsgTestCase->testWriteReplyPrivatemsg()
Found the requested form fields at messages/newOtherprivatemsg.test296PrivatemsgTestCase->testWriteReplyPrivatemsg()
Message sent confirmation displayed.Otherprivatemsg.test297PrivatemsgTestCase->testWriteReplyPrivatemsg()
Sent message subject found.Otherprivatemsg.test304PrivatemsgTestCase->testWriteReplyPrivatemsg()
Undefined variable: url_targetNoticedrupal_web_test_case.php2324DrupalWebTestCase->clickLink()
Clicked link hR5cOXA4jY6xwwj27mar () from http://pifr-mysql/checkout/?q=messagesBrowserprivatemsg.test305PrivatemsgTestCase->testWriteReplyPrivatemsg()
Found message body.Otherprivatemsg.test307PrivatemsgTestCase->testWriteReplyPrivatemsg()
Failed to set field body[value] to hbbX3DYIofW7TqEQat0asB4TmZdVlBXcsHMjcZYYH8hnb1qdXCqXALRQY9Pk3pUVONbgFPc1mfAN0WOvDt7mwgE3Ht1jwD40ollCOtherprivatemsg.test318PrivatemsgTestCase->testWriteReplyPrivatemsg()
Found the Send message buttonOtherprivatemsg.test318PrivatemsgTestCase->testWriteReplyPrivatemsg()
Found the requested form fields at Otherprivatemsg.test318PrivatemsgTestCase->testWriteReplyPrivatemsg()
New message body displayed.Otherprivatemsg.test319PrivatemsgTestCase->testWriteReplyPrivatemsg()
Failed to set field body[value] to Otherprivatemsg.test321PrivatemsgTestCase->testWriteReplyPrivatemsg()
Found the Send message buttonOtherprivatemsg.test321PrivatemsgTestCase->testWriteReplyPrivatemsg()
Found the requested form fields at Otherprivatemsg.test321PrivatemsgTestCase->testWriteReplyPrivatemsg()
"You must include a message in your reply." foundOtherprivatemsg.test322PrivatemsgTestCase->testWriteReplyPrivatemsg()
Undefined variable: url_targetNoticedrupal_web_test_case.php2324DrupalWebTestCase->clickLink()
Clicked link r8QABgK2o4yRcVfHqmsn () from http://pifr-mysql/checkout/?q=messagesBrowserprivatemsg.test329PrivatemsgTestCase->testWriteReplyPrivatemsg()
Found formatted message body.Otherprivatemsg.test330PrivatemsgTestCase->testWriteReplyPrivatemsg()
Failed to set field body[value] to pkCE7j9oUc6GMbsi8kGA9SIJ4LekhSnXoYLB2DSGC7EWYbwcS2bIJiySKmVvZAEU7YovYrYJQzhaL1FWuFndsX37J7vLLmCSX1fP<b>formatted message #2</b>Otherprivatemsg.test332PrivatemsgTestCase->testWriteReplyPrivatemsg()
Found the Send message buttonOtherprivatemsg.test332PrivatemsgTestCase->testWriteReplyPrivatemsg()
Found the requested form fields at Otherprivatemsg.test332PrivatemsgTestCase->testWriteReplyPrivatemsg()
New reply body displayed.Otherprivatemsg.test334PrivatemsgTestCase->testWriteReplyPrivatemsg()
Sent message subject found.Otherprivatemsg.test341PrivatemsgTestCase->testWriteReplyPrivatemsg()
Sent message subject found.Otherprivatemsg.test342PrivatemsgTestCase->testWriteReplyPrivatemsg()
Sent message subject found.Otherprivatemsg.test343PrivatemsgTestCase->testWriteReplyPrivatemsg()
Sent message subject found.Otherprivatemsg.test344PrivatemsgTestCase->testWriteReplyPrivatemsg()
Sent message subject found.Otherprivatemsg.test345PrivatemsgTestCase->testWriteReplyPrivatemsg()
Undefined variable: url_targetNoticedrupal_web_test_case.php2324DrupalWebTestCase->clickLink()
Clicked link dbmNZz2owHibMS0yTncX () from http://pifr-mysql/checkout/?q=messagesBrowserprivatemsg.test352PrivatemsgTestCase->testWriteReplyPrivatemsg()
Found message body.Otherprivatemsg.test354PrivatemsgTestCase->testWriteReplyPrivatemsg()
Trying to get property of non-objectNoticeprivatemsg.test358PrivatemsgTestCase->testWriteReplyPrivatemsg()
"Between you and " foundOtherprivatemsg.test358PrivatemsgTestCase->testWriteReplyPrivatemsg()
Undefined variable: url_targetNoticedrupal_web_test_case.php2324DrupalWebTestCase->clickLink()
Clicked link hR5cOXA4jY6xwwj27mar () from http://pifr-mysql/checkout/?q=messagesBrowserprivatemsg.test362PrivatemsgTestCase->testWriteReplyPrivatemsg()
Found message body.Otherprivatemsg.test364PrivatemsgTestCase->testWriteReplyPrivatemsg()
Found reply body.Otherprivatemsg.test366PrivatemsgTestCase->testWriteReplyPrivatemsg()
PDOException: %message in _privatemsg_send() (line 1768 of /var/lib/drupaltestbot/sites/default/files/checkout/sites/default/modules/privatemsg/privatemsg.module).Uncaught exceptiondatabase.inc1970PDOStatement->execute()
Message sent confirmation displayedOtherprivatemsg.test466PrivatemsgTestCase->testReadAllPermission()
Notice about read all mode displayed.Otherprivatemsg.test471PrivatemsgTestCase->testReadAllPermission()
Failed to set field body[value] to yMn6iYH0OloZqYmAfse6p3fmTkR8qXzLRID19M6xYYlYvCwku5qEQnuorh9Y9H9FPSewoFKIf2A3zNenUFC23lj61vCbJItPhQnrOtherprivatemsg.test477PrivatemsgTestCase->testReadAllPermission()
Found the Send message buttonOtherprivatemsg.test477PrivatemsgTestCase->testReadAllPermission()
Found the requested form fields at messages/view/1Otherprivatemsg.test477PrivatemsgTestCase->testReadAllPermission()
First message body displayed.Otherprivatemsg.test484PrivatemsgTestCase->testReadAllPermission()
New message body displayed.Otherprivatemsg.test485PrivatemsgTestCase->testReadAllPermission()
Admin is listed as recipient for every message once.Otherprivatemsg.test491PrivatemsgTestCase->testReadAllPermission()
Failed to set field body[value] to xNFz0XAXmSohjmh5sJAN3B6KaZocOttCPY5p4qI8vsfKHIhRPg0VsGbcP90utCDy9yEluynqGtQXznVselJy47qUNQ8pWxzshOmJOtherprivatemsg.test498PrivatemsgTestCase->testReadAllPermission()
Found the Send message buttonOtherprivatemsg.test498PrivatemsgTestCase->testReadAllPermission()
Found the requested form fields at messages/view/1Otherprivatemsg.test498PrivatemsgTestCase->testReadAllPermission()
First message body displayed.Otherprivatemsg.test501PrivatemsgTestCase->testReadAllPermission()
Second response body displayed.Otherprivatemsg.test502PrivatemsgTestCase->testReadAllPermission()
Third message body displayed.Otherprivatemsg.test503PrivatemsgTestCase->testReadAllPermission()
Admin is listed as recipient for every message once.Otherprivatemsg.test509PrivatemsgTestCase->testReadAllPermission()
PDOException: %message in _privatemsg_send() (line 1768 of /var/lib/drupaltestbot/sites/default/files/checkout/sites/default/modules/privatemsg/privatemsg.module).Uncaught exceptiondatabase.inc1970PDOStatement->execute()
PDOException: %message in _privatemsg_send() (line 1768 of /var/lib/drupaltestbot/sites/default/files/checkout/sites/default/modules/privatemsg/privatemsg.module).Uncaught exceptiondatabase.inc1970PDOStatement->execute()
ExpandPrivatemsg links (PrivatemsgLinksTestCase) [Privatemsg]13950
MessageGroupFilenameLineFunctionStatus
"A message has been sent to rWR29UmN" foundOtherprivatemsg.test990PrivatemsgLinksTestCase->testAuthorLinks()
"Message regarding eUfPlrFOX5" foundOtherprivatemsg.test998PrivatemsgLinksTestCase->testAuthorLinks()
Messages link including new message information displayedOtherprivatemsg.test1037PrivatemsgLinksTestCase->testMenuBlock()
Privatemsg new block title displayed.Otherprivatemsg.test1065PrivatemsgLinksTestCase->testNewBlock()
New message indication displayed.Otherprivatemsg.test1067PrivatemsgLinksTestCase->testNewBlock()
ExpandPrivatemsg Roles functionality (PrivatemsgRolesTestCase) [Privatemsg]6789931
MessageGroupFilenameLineFunctionStatus
PDOException: %message in _privatemsg_send() (line 1768 of /var/lib/drupaltestbot/sites/default/files/checkout/sites/default/modules/privatemsg/privatemsg.module).Uncaught exceptiondatabase.inc1970PDOStatement->execute()
PDOException: %message in _privatemsg_send() (line 1768 of /var/lib/drupaltestbot/sites/default/files/checkout/sites/default/modules/privatemsg/privatemsg.module).Uncaught exceptiondatabase.inc1970PDOStatement->execute()
"A message has been sent to qDdfAIC0 (role)." foundOtherprivatemsg_roles.test122PrivatemsgRolesTestCase->testSendMessagetoRoleBatch()
Message is displayed as newOtherprivatemsg_roles.test128PrivatemsgRolesTestCase->testSendMessagetoRoleBatch()
Undefined variable: url_targetNoticedrupal_web_test_case.php2324DrupalWebTestCase->clickLink()
Clicked link bCJx33dglL () from http://pifr-mysql/checkout/?q=messagesBrowserprivatemsg_roles.test130PrivatemsgRolesTestCase->testSendMessagetoRoleBatch()
Thread starter body displayed.Otherprivatemsg_roles.test131PrivatemsgRolesTestCase->testSendMessagetoRoleBatch()
Message is displayed as newOtherprivatemsg_roles.test128PrivatemsgRolesTestCase->testSendMessagetoRoleBatch()
Undefined variable: url_targetNoticedrupal_web_test_case.php2324DrupalWebTestCase->clickLink()
Clicked link bCJx33dglL () from http://pifr-mysql/checkout/?q=messagesBrowserprivatemsg_roles.test130PrivatemsgRolesTestCase->testSendMessagetoRoleBatch()
Thread starter body displayed.Otherprivatemsg_roles.test131PrivatemsgRolesTestCase->testSendMessagetoRoleBatch()
Message is displayed as newOtherprivatemsg_roles.test128PrivatemsgRolesTestCase->testSendMessagetoRoleBatch()
Undefined variable: url_targetNoticedrupal_web_test_case.php2324DrupalWebTestCase->clickLink()
Clicked link bCJx33dglL () from http://pifr-mysql/checkout/?q=messagesBrowserprivatemsg_roles.test130PrivatemsgRolesTestCase->testSendMessagetoRoleBatch()
Thread starter body displayed.Otherprivatemsg_roles.test131PrivatemsgRolesTestCase->testSendMessagetoRoleBatch()
Message is displayed as newOtherprivatemsg_roles.test128PrivatemsgRolesTestCase->testSendMessagetoRoleBatch()
Undefined variable: url_targetNoticedrupal_web_test_case.php2324DrupalWebTestCase->clickLink()
Clicked link bCJx33dglL () from http://pifr-mysql/checkout/?q=messagesBrowserprivatemsg_roles.test130PrivatemsgRolesTestCase->testSendMessagetoRoleBatch()
Thread starter body displayed.Otherprivatemsg_roles.test131PrivatemsgRolesTestCase->testSendMessagetoRoleBatch()
Message is displayed as newOtherprivatemsg_roles.test128PrivatemsgRolesTestCase->testSendMessagetoRoleBatch()
Undefined variable: url_targetNoticedrupal_web_test_case.php2324DrupalWebTestCase->clickLink()
Clicked link bCJx33dglL () from http://pifr-mysql/checkout/?q=messagesBrowserprivatemsg_roles.test130PrivatemsgRolesTestCase->testSendMessagetoRoleBatch()
Thread starter body displayed.Otherprivatemsg_roles.test131PrivatemsgRolesTestCase->testSendMessagetoRoleBatch()
Message is displayed as newOtherprivatemsg_roles.test128PrivatemsgRolesTestCase->testSendMessagetoRoleBatch()
Undefined variable: url_targetNoticedrupal_web_test_case.php2324DrupalWebTestCase->clickLink()
Clicked link bCJx33dglL () from http://pifr-mysql/checkout/?q=messagesBrowserprivatemsg_roles.test130PrivatemsgRolesTestCase->testSendMessagetoRoleBatch()
Thread starter body displayed.Otherprivatemsg_roles.test131PrivatemsgRolesTestCase->testSendMessagetoRoleBatch()
Message is displayed as newOtherprivatemsg_roles.test128PrivatemsgRolesTestCase->testSendMessagetoRoleBatch()
Undefined variable: url_targetNoticedrupal_web_test_case.php2324DrupalWebTestCase->clickLink()
Clicked link bCJx33dglL () from http://pifr-mysql/checkout/?q=messagesBrowserprivatemsg_roles.test130PrivatemsgRolesTestCase->testSendMessagetoRoleBatch()
Thread starter body displayed.Otherprivatemsg_roles.test131PrivatemsgRolesTestCase->testSendMessagetoRoleBatch()
Message is displayed as newOtherprivatemsg_roles.test128PrivatemsgRolesTestCase->testSendMessagetoRoleBatch()
Undefined variable: url_targetNoticedrupal_web_test_case.php2324DrupalWebTestCase->clickLink()
Clicked link bCJx33dglL () from http://pifr-mysql/checkout/?q=messagesBrowserprivatemsg_roles.test130PrivatemsgRolesTestCase->testSendMessagetoRoleBatch()
Thread starter body displayed.Otherprivatemsg_roles.test131PrivatemsgRolesTestCase->testSendMessagetoRoleBatch()
Message is displayed as newOtherprivatemsg_roles.test128PrivatemsgRolesTestCase->testSendMessagetoRoleBatch()
Undefined variable: url_targetNoticedrupal_web_test_case.php2324DrupalWebTestCase->clickLink()
Clicked link bCJx33dglL () from http://pifr-mysql/checkout/?q=messagesBrowserprivatemsg_roles.test130PrivatemsgRolesTestCase->testSendMessagetoRoleBatch()
Thread starter body displayed.Otherprivatemsg_roles.test131PrivatemsgRolesTestCase->testSendMessagetoRoleBatch()
Message is displayed as newOtherprivatemsg_roles.test128PrivatemsgRolesTestCase->testSendMessagetoRoleBatch()
Undefined variable: url_targetNoticedrupal_web_test_case.php2324DrupalWebTestCase->clickLink()
Clicked link bCJx33dglL () from http://pifr-mysql/checkout/?q=messagesBrowserprivatemsg_roles.test130PrivatemsgRolesTestCase->testSendMessagetoRoleBatch()
Thread starter body displayed.Otherprivatemsg_roles.test131PrivatemsgRolesTestCase->testSendMessagetoRoleBatch()
Message is displayed as newOtherprivatemsg_roles.test128PrivatemsgRolesTestCase->testSendMessagetoRoleBatch()
Undefined variable: url_targetNoticedrupal_web_test_case.php2324DrupalWebTestCase->clickLink()
Clicked link bCJx33dglL () from http://pifr-mysql/checkout/?q=messagesBrowserprivatemsg_roles.test130PrivatemsgRolesTestCase->testSendMessagetoRoleBatch()
Thread starter body displayed.Otherprivatemsg_roles.test131PrivatemsgRolesTestCase->testSendMessagetoRoleBatch()
Message is displayed as newOtherprivatemsg_roles.test128PrivatemsgRolesTestCase->testSendMessagetoRoleBatch()
Undefined variable: url_targetNoticedrupal_web_test_case.php2324DrupalWebTestCase->clickLink()
Clicked link bCJx33dglL () from http://pifr-mysql/checkout/?q=messagesBrowserprivatemsg_roles.test130PrivatemsgRolesTestCase->testSendMessagetoRoleBatch()
Thread starter body displayed.Otherprivatemsg_roles.test131PrivatemsgRolesTestCase->testSendMessagetoRoleBatch()
Message is displayed as newOtherprivatemsg_roles.test128PrivatemsgRolesTestCase->testSendMessagetoRoleBatch()
Undefined variable: url_targetNoticedrupal_web_test_case.php2324DrupalWebTestCase->clickLink()
Clicked link bCJx33dglL () from http://pifr-mysql/checkout/?q=messagesBrowserprivatemsg_roles.test130PrivatemsgRolesTestCase->testSendMessagetoRoleBatch()
Thread starter body displayed.Otherprivatemsg_roles.test131PrivatemsgRolesTestCase->testSendMessagetoRoleBatch()
Message is displayed as newOtherprivatemsg_roles.test128PrivatemsgRolesTestCase->testSendMessagetoRoleBatch()
Undefined variable: url_targetNoticedrupal_web_test_case.php2324DrupalWebTestCase->clickLink()
Clicked link bCJx33dglL () from http://pifr-mysql/checkout/?q=messagesBrowserprivatemsg_roles.test130PrivatemsgRolesTestCase->testSendMessagetoRoleBatch()
Thread starter body displayed.Otherprivatemsg_roles.test131PrivatemsgRolesTestCase->testSendMessagetoRoleBatch()
Message is displayed as newOtherprivatemsg_roles.test128PrivatemsgRolesTestCase->testSendMessagetoRoleBatch()
Undefined variable: url_targetNoticedrupal_web_test_case.php2324DrupalWebTestCase->clickLink()
Clicked link bCJx33dglL () from http://pifr-mysql/checkout/?q=messagesBrowserprivatemsg_roles.test130PrivatemsgRolesTestCase->testSendMessagetoRoleBatch()
Thread starter body displayed.Otherprivatemsg_roles.test131PrivatemsgRolesTestCase->testSendMessagetoRoleBatch()
Message is displayed as newOtherprivatemsg_roles.test128PrivatemsgRolesTestCase->testSendMessagetoRoleBatch()
Undefined variable: url_targetNoticedrupal_web_test_case.php2324DrupalWebTestCase->clickLink()
Clicked link bCJx33dglL () from http://pifr-mysql/checkout/?q=messagesBrowserprivatemsg_roles.test130PrivatemsgRolesTestCase->testSendMessagetoRoleBatch()
Thread starter body displayed.Otherprivatemsg_roles.test131PrivatemsgRolesTestCase->testSendMessagetoRoleBatch()
Message is displayed as newOtherprivatemsg_roles.test128PrivatemsgRolesTestCase->testSendMessagetoRoleBatch()
Undefined variable: url_targetNoticedrupal_web_test_case.php2324DrupalWebTestCase->clickLink()
Clicked link bCJx33dglL () from http://pifr-mysql/checkout/?q=messagesBrowserprivatemsg_roles.test130PrivatemsgRolesTestCase->testSendMessagetoRoleBatch()
Thread starter body displayed.Otherprivatemsg_roles.test131PrivatemsgRolesTestCase->testSendMessagetoRoleBatch()
Message is displayed as newOtherprivatemsg_roles.test128PrivatemsgRolesTestCase->testSendMessagetoRoleBatch()
Undefined variable: url_targetNoticedrupal_web_test_case.php2324DrupalWebTestCase->clickLink()
Clicked link bCJx33dglL () from http://pifr-mysql/checkout/?q=messagesBrowserprivatemsg_roles.test130PrivatemsgRolesTestCase->testSendMessagetoRoleBatch()
Thread starter body displayed.Otherprivatemsg_roles.test131PrivatemsgRolesTestCase->testSendMessagetoRoleBatch()
Message is displayed as newOtherprivatemsg_roles.test128PrivatemsgRolesTestCase->testSendMessagetoRoleBatch()
Undefined variable: url_targetNoticedrupal_web_test_case.php2324DrupalWebTestCase->clickLink()
Clicked link bCJx33dglL () from http://pifr-mysql/checkout/?q=messagesBrowserprivatemsg_roles.test130PrivatemsgRolesTestCase->testSendMessagetoRoleBatch()
Thread starter body displayed.Otherprivatemsg_roles.test131PrivatemsgRolesTestCase->testSendMessagetoRoleBatch()
Message is displayed as newOtherprivatemsg_roles.test128PrivatemsgRolesTestCase->testSendMessagetoRoleBatch()
Undefined variable: url_targetNoticedrupal_web_test_case.php2324DrupalWebTestCase->clickLink()
Clicked link bCJx33dglL () from http://pifr-mysql/checkout/?q=messagesBrowserprivatemsg_roles.test130PrivatemsgRolesTestCase->testSendMessagetoRoleBatch()
Thread starter body displayed.Otherprivatemsg_roles.test131PrivatemsgRolesTestCase->testSendMessagetoRoleBatch()
Message is displayed as newOtherprivatemsg_roles.test128PrivatemsgRolesTestCase->testSendMessagetoRoleBatch()
Undefined variable: url_targetNoticedrupal_web_test_case.php2324DrupalWebTestCase->clickLink()
Clicked link bCJx33dglL () from http://pifr-mysql/checkout/?q=messagesBrowserprivatemsg_roles.test130PrivatemsgRolesTestCase->testSendMessagetoRoleBatch()
Thread starter body displayed.Otherprivatemsg_roles.test131PrivatemsgRolesTestCase->testSendMessagetoRoleBatch()
Message is displayed as newOtherprivatemsg_roles.test128PrivatemsgRolesTestCase->testSendMessagetoRoleBatch()
Undefined variable: url_targetNoticedrupal_web_test_case.php2324DrupalWebTestCase->clickLink()
Clicked link bCJx33dglL () from http://pifr-mysql/checkout/?q=messagesBrowserprivatemsg_roles.test130PrivatemsgRolesTestCase->testSendMessagetoRoleBatch()
Thread starter body displayed.Otherprivatemsg_roles.test131PrivatemsgRolesTestCase->testSendMessagetoRoleBatch()
Message is displayed as newOtherprivatemsg_roles.test128PrivatemsgRolesTestCase->testSendMessagetoRoleBatch()
Undefined variable: url_targetNoticedrupal_web_test_case.php2324DrupalWebTestCase->clickLink()
Clicked link bCJx33dglL () from http://pifr-mysql/checkout/?q=messagesBrowserprivatemsg_roles.test130PrivatemsgRolesTestCase->testSendMessagetoRoleBatch()
Thread starter body displayed.Otherprivatemsg_roles.test131PrivatemsgRolesTestCase->testSendMessagetoRoleBatch()
Message is displayed as newOtherprivatemsg_roles.test128PrivatemsgRolesTestCase->testSendMessagetoRoleBatch()
Undefined variable: url_targetNoticedrupal_web_test_case.php2324DrupalWebTestCase->clickLink()
Clicked link bCJx33dglL () from http://pifr-mysql/checkout/?q=messagesBrowserprivatemsg_roles.test130PrivatemsgRolesTestCase->testSendMessagetoRoleBatch()
Thread starter body displayed.Otherprivatemsg_roles.test131PrivatemsgRolesTestCase->testSendMessagetoRoleBatch()
Message is displayed as newOtherprivatemsg_roles.test128PrivatemsgRolesTestCase->testSendMessagetoRoleBatch()
Undefined variable: url_targetNoticedrupal_web_test_case.php2324DrupalWebTestCase->clickLink()
Clicked link bCJx33dglL () from http://pifr-mysql/checkout/?q=messagesBrowserprivatemsg_roles.test130PrivatemsgRolesTestCase->testSendMessagetoRoleBatch()
Thread starter body displayed.Otherprivatemsg_roles.test131PrivatemsgRolesTestCase->testSendMessagetoRoleBatch()
"A message has been sent to zG5k8aid (role)." foundOtherprivatemsg_roles.test175PrivatemsgRolesTestCase->testSendMessageToRole()
Message is displayed as newOtherprivatemsg_roles.test181PrivatemsgRolesTestCase->testSendMessageToRole()
Undefined variable: url_targetNoticedrupal_web_test_case.php2324DrupalWebTestCase->clickLink()
Clicked link zJY8Pnrs5I () from http://pifr-mysql/checkout/?q=messagesBrowserprivatemsg_roles.test183PrivatemsgRolesTestCase->testSendMessageToRole()
Thread starter body displayed.Otherprivatemsg_roles.test184PrivatemsgRolesTestCase->testSendMessageToRole()
Failed to set field body[value] to jhx1QpMAQ7yZ7r6N5DAkwR37B77pUbpWHWCsJ24NStExrOwcTKOtherprivatemsg_roles.test193PrivatemsgRolesTestCase->testSendMessageToRole()
Found the Send message buttonOtherprivatemsg_roles.test193PrivatemsgRolesTestCase->testSendMessageToRole()
Found the requested form fields at Otherprivatemsg_roles.test193PrivatemsgRolesTestCase->testSendMessageToRole()
Message is displayed as newOtherprivatemsg_roles.test201PrivatemsgRolesTestCase->testSendMessageToRole()
Undefined variable: url_targetNoticedrupal_web_test_case.php2324DrupalWebTestCase->clickLink()
Clicked link zJY8Pnrs5I () from http://pifr-mysql/checkout/?q=messagesBrowserprivatemsg_roles.test202PrivatemsgRolesTestCase->testSendMessageToRole()
Reply1 is displayedOtherprivatemsg_roles.test204PrivatemsgRolesTestCase->testSendMessageToRole()
Failed to set field body[value] to baj7wN2bHODgsVDOcxXBOtf6kloVwyEWnDCnhdiNNfoS6fcb02Otherprivatemsg_roles.test210PrivatemsgRolesTestCase->testSendMessageToRole()
Found the Send message buttonOtherprivatemsg_roles.test210PrivatemsgRolesTestCase->testSendMessageToRole()
Found the requested form fields at Otherprivatemsg_roles.test210PrivatemsgRolesTestCase->testSendMessageToRole()
Message is displayed as newOtherprivatemsg_roles.test215PrivatemsgRolesTestCase->testSendMessageToRole()
Undefined variable: url_targetNoticedrupal_web_test_case.php2324DrupalWebTestCase->clickLink()
Clicked link zJY8Pnrs5I () from http://pifr-mysql/checkout/?q=messagesBrowserprivatemsg_roles.test216PrivatemsgRolesTestCase->testSendMessageToRole()
"zG5k8aid (role)" foundOtherprivatemsg_roles.test217PrivatemsgRolesTestCase->testSendMessageToRole()
Thread starter body is displayedOtherprivatemsg_roles.test219PrivatemsgRolesTestCase->testSendMessageToRole()
Reply2 is displayedOtherprivatemsg_roles.test221PrivatemsgRolesTestCase->testSendMessageToRole()
"A message has been sent to lkfD8e3z (role)." foundOtherprivatemsg_roles.test246PrivatemsgRolesTestCase->testSendMessageToRoleBlocked()
Message is displayed as newOtherprivatemsg_roles.test252PrivatemsgRolesTestCase->testSendMessageToRoleBlocked()
Undefined variable: url_targetNoticedrupal_web_test_case.php2324DrupalWebTestCase->clickLink()
Clicked link xRDdcj3Ntm () from http://pifr-mysql/checkout/?q=messagesBrowserprivatemsg_roles.test254PrivatemsgRolesTestCase->testSendMessageToRoleBlocked()
Thread starter body displayed.Otherprivatemsg_roles.test255PrivatemsgRolesTestCase->testSendMessageToRoleBlocked()
"A message has been sent to wX1NISV5 (role)." foundOtherprivatemsg_roles.test279PrivatemsgRolesTestCase->testNewUser()
ExpandPrivatemsg Tags functionality. (PrivatemsgTagsTestCase) [Privatemsg]9303
MessageGroupFilenameLineFunctionStatus
PDOException: %message in _privatemsg_send() (line 1768 of /var/lib/drupaltestbot/sites/default/files/checkout/sites/default/modules/privatemsg/privatemsg.module).Uncaught exceptiondatabase.inc1970PDOStatement->execute()
PDOException: %message in _privatemsg_send() (line 1768 of /var/lib/drupaltestbot/sites/default/files/checkout/sites/default/modules/privatemsg/privatemsg.module).Uncaught exceptiondatabase.inc1970PDOStatement->execute()
PDOException: %message in _privatemsg_send() (line 1768 of /var/lib/drupaltestbot/sites/default/files/checkout/sites/default/modules/privatemsg/privatemsg.module).Uncaught exceptiondatabase.inc1970PDOStatement->execute()
ExpandPrivatemsg tokens (PrivatemsgTokenTestCase) [Privatemsg]66202
MessageGroupFilenameLineFunctionStatus
Token is displayed in subject.Otherprivatemsg.test1127PrivatemsgTokenTestCase->testBasicTokens()
Subject token is displayed.Otherprivatemsg.test1128PrivatemsgTokenTestCase->testBasicTokens()
Author token is displayed.Otherprivatemsg.test1129PrivatemsgTokenTestCase->testBasicTokens()
Invalid token is displayed.Otherprivatemsg.test1130PrivatemsgTokenTestCase->testBasicTokens()
Token notice is displayed.Otherprivatemsg.test1131PrivatemsgTokenTestCase->testBasicTokens()
Undefined variable: url_targetNoticedrupal_web_test_case.php2324DrupalWebTestCase->clickLink()
Clicked link Hey cmDYQ39D () from http://pifr-mysql/checkout/?q=messagesBrowserprivatemsg.test1137PrivatemsgTokenTestCase->testBasicTokens()
Replaced token is displayed in subject.Otherprivatemsg.test1141PrivatemsgTokenTestCase->testBasicTokens()
Subject token is replaced.Otherprivatemsg.test1142PrivatemsgTokenTestCase->testBasicTokens()
Author token is replaced.Otherprivatemsg.test1143PrivatemsgTokenTestCase->testBasicTokens()
Invalid token is displayed.Otherprivatemsg.test1144PrivatemsgTokenTestCase->testBasicTokens()
Failed to set field body[value] to Response with a token [privatemsg_message:mid]Otherprivatemsg.test1152PrivatemsgTokenTestCase->testBasicTokens()
Found the Send message buttonOtherprivatemsg.test1152PrivatemsgTokenTestCase->testBasicTokens()
Found the requested form fields at Otherprivatemsg.test1152PrivatemsgTokenTestCase->testBasicTokens()
Undefined variable: url_targetNoticedrupal_web_test_case.php2324DrupalWebTestCase->clickLink()
Clicked link Hey hWMnFO84 () from http://pifr-mysql/checkout/?q=messagesBrowserprivatemsg.test1156PrivatemsgTokenTestCase->testBasicTokens()
Replaced token is displayed in subject.Otherprivatemsg.test1160PrivatemsgTokenTestCase->testBasicTokens()
Subject token is replaced.Otherprivatemsg.test1161PrivatemsgTokenTestCase->testBasicTokens()
Author token is replaced.Otherprivatemsg.test1162PrivatemsgTokenTestCase->testBasicTokens()
Invalid token is displayed.Otherprivatemsg.test1163PrivatemsgTokenTestCase->testBasicTokens()
Token from recipient is not replaced.Otherprivatemsg.test1164PrivatemsgTokenTestCase->testBasicTokens()
Token is displayed correctly in subject for author.Otherprivatemsg.test1171PrivatemsgTokenTestCase->testBasicTokens()
ExpandUser blocking functionality. (PrivatemsgBlockUserCase) [Privatemsg]901
MessageGroupFilenameLineFunctionStatus
PDOException: %message in _privatemsg_send() (line 1768 of /var/lib/drupaltestbot/sites/default/files/checkout/sites/default/modules/privatemsg/privatemsg.module).Uncaught exceptiondatabase.inc1970PDOStatement->execute()

All

Test namePassFailException
ExpandPrivatemsg API functionality. (PrivatemsgAPITestCase) [Privatemsg]2402
MessageGroupFilenameLineFunctionStatus
PDOException: %message in _privatemsg_send() (line 1768 of /var/lib/drupaltestbot/sites/default/files/checkout/sites/default/modules/privatemsg/privatemsg.module).Uncaught exceptiondatabase.inc1970PDOStatement->execute()
PDOException: %message in _privatemsg_send() (line 1768 of /var/lib/drupaltestbot/sites/default/files/checkout/sites/default/modules/privatemsg/privatemsg.module).Uncaught exceptiondatabase.inc1970PDOStatement->execute()
ExpandPrivatemsg fields. (PrivatemsgFieldsTestCase) [Privatemsg]89123
MessageGroupFilenameLineFunctionStatus
Undefined variable: url_targetNoticedrupal_web_test_case.php2324DrupalWebTestCase->clickLink()
Clicked link zBJPMVyf () from http://pifr-mysql/checkout/?q=messagesBrowserprivatemsg.test853PrivatemsgFieldsTestCase->testSingleField()
Message body displayed.Otherprivatemsg.test855PrivatemsgFieldsTestCase->testSingleField()
Content of new field is displayed.Otherprivatemsg.test856PrivatemsgFieldsTestCase->testSingleField()
Failed to set field body[value] to tOWZ769G8RgLcVhivvMRiKtN1FHT0JdvTZpmUvfHMSBr9T0zfXOtherprivatemsg.test863PrivatemsgFieldsTestCase->testSingleField()
Failed to set field field_ge6egcdv[und][0][value] to lsUxVFxyJwddzLd50JtrriJSG059H7h0YsQN3w1Q62NGRstI9EOtherprivatemsg.test863PrivatemsgFieldsTestCase->testSingleField()
Found the Send message buttonOtherprivatemsg.test863PrivatemsgFieldsTestCase->testSingleField()
Found the requested form fields at Otherprivatemsg.test863PrivatemsgFieldsTestCase->testSingleField()
Undefined variable: url_targetNoticedrupal_web_test_case.php2324DrupalWebTestCase->clickLink()
Clicked link zBJPMVyf () from http://pifr-mysql/checkout/?q=messagesBrowserprivatemsg.test868PrivatemsgFieldsTestCase->testSingleField()
Message body displayed.Otherprivatemsg.test870PrivatemsgFieldsTestCase->testSingleField()
Content of new field is displayed.Otherprivatemsg.test871PrivatemsgFieldsTestCase->testSingleField()
Undefined variable: url_targetNoticedrupal_web_test_case.php2324DrupalWebTestCase->clickLink()
Clicked link cXqEj4KF () from http://pifr-mysql/checkout/?q=messagesBrowserprivatemsg.test911PrivatemsgFieldsTestCase->testEmptyImage()
Message body displayed.Otherprivatemsg.test913PrivatemsgFieldsTestCase->testEmptyImage()
ExpandPrivatemsg Filter functionality. (PrivatemsgFilterTestCase) [Privatemsg]85262
MessageGroupFilenameLineFunctionStatus
Message sent confirmation displayedOtherprivatemsg_filter.test39PrivatemsgFilterTestCase->testInboxSentHandling()
Thread displayed in "Sent messages" for author.Otherprivatemsg_filter.test46PrivatemsgFilterTestCase->testInboxSentHandling()
Thread displayed in "All messages" for author.Otherprivatemsg_filter.test48PrivatemsgFilterTestCase->testInboxSentHandling()
Thread displayed in inbox for recipient.Otherprivatemsg_filter.test53PrivatemsgFilterTestCase->testInboxSentHandling()
Thread displayed in "All messages." for recipient.Otherprivatemsg_filter.test57PrivatemsgFilterTestCase->testInboxSentHandling()
Undefined variable: url_targetNoticedrupal_web_test_case.php2324DrupalWebTestCase->clickLink()
Clicked link jUVgdZvfr1mFpalb0UQE () from http://pifr-mysql/checkout/?q=messages/listBrowserprivatemsg_filter.test60PrivatemsgFilterTestCase->testInboxSentHandling()
Failed to set field body[value] to knKuk372zWwVTthnjXZ93NBPGGJfR8yEIXaucNWwJ5IXqJ1hmxZWRWhpuex6CoF93lPdd9E9cfp59AADNifyBO3Aq3a6gksaW4B5Otherprivatemsg_filter.test64PrivatemsgFilterTestCase->testInboxSentHandling()
Found the Send message buttonOtherprivatemsg_filter.test64PrivatemsgFilterTestCase->testInboxSentHandling()
Found the requested form fields at Otherprivatemsg_filter.test64PrivatemsgFilterTestCase->testInboxSentHandling()
Message sent confirmation displayedOtherprivatemsg_filter.test65PrivatemsgFilterTestCase->testInboxSentHandling()
Thread displayed in "Sent messages" for recipient.Otherprivatemsg_filter.test68PrivatemsgFilterTestCase->testInboxSentHandling()
Thread displayed in inbox for author.Otherprivatemsg_filter.test72PrivatemsgFilterTestCase->testInboxSentHandling()
Failed to set field list[1] to 1Otherprivatemsg_filter.test79PrivatemsgFilterTestCase->testInboxSentHandling()
Found the Delete buttonOtherprivatemsg_filter.test79PrivatemsgFilterTestCase->testInboxSentHandling()
Found the requested form fields at Otherprivatemsg_filter.test79PrivatemsgFilterTestCase->testInboxSentHandling()
Undefined variable: url_targetNoticedrupal_web_test_case.php2324DrupalWebTestCase->clickLink()
Clicked link jUVgdZvfr1mFpalb0UQE () from http://pifr-mysql/checkout/?q=messagesBrowserprivatemsg_filter.test87PrivatemsgFilterTestCase->testInboxSentHandling()
Failed to set field body[value] to epnlsBkvjfdPluN6haRdix8nTYkO2YdDOdsN30fB7BA0Ve0y69BYan7nSm4hhndI8DnXat5GQW7xL29WXr7q1og3nJDaHVgUGOBVOtherprivatemsg_filter.test91PrivatemsgFilterTestCase->testInboxSentHandling()
Found the Send message buttonOtherprivatemsg_filter.test91PrivatemsgFilterTestCase->testInboxSentHandling()
Found the requested form fields at Otherprivatemsg_filter.test91PrivatemsgFilterTestCase->testInboxSentHandling()
Message sent confirmation displayedOtherprivatemsg_filter.test92PrivatemsgFilterTestCase->testInboxSentHandling()
Thread displayed again in inbox for author.Otherprivatemsg_filter.test97PrivatemsgFilterTestCase->testInboxSentHandling()
Failed to set field list[1] to 1Otherprivatemsg_filter.test104PrivatemsgFilterTestCase->testInboxSentHandling()
Found the Archive buttonOtherprivatemsg_filter.test104PrivatemsgFilterTestCase->testInboxSentHandling()
Found the requested form fields at Otherprivatemsg_filter.test104PrivatemsgFilterTestCase->testInboxSentHandling()
Confirmation message displayedOtherprivatemsg_filter.test105PrivatemsgFilterTestCase->testInboxSentHandling()
Thread still displayed in "All messages" list.Otherprivatemsg_filter.test109PrivatemsgFilterTestCase->testInboxSentHandling()
ExpandPrivatemsg filter widget (PrivatemsgFilterWidgetTestCase) [Privatemsg]1701
MessageGroupFilenameLineFunctionStatus
PDOException: %message in _privatemsg_send() (line 1768 of /var/lib/drupaltestbot/sites/default/files/checkout/sites/default/modules/privatemsg/privatemsg.module).Uncaught exceptiondatabase.inc1970PDOStatement->execute()
ExpandPrivatemsg functionality. (PrivatemsgTestCase) [Privatemsg]21610514
MessageGroupFilenameLineFunctionStatus
PDOException: %message in _privatemsg_send() (line 1768 of /var/lib/drupaltestbot/sites/default/files/checkout/sites/default/modules/privatemsg/privatemsg.module).Uncaught exceptiondatabase.inc1970PDOStatement->execute()
PDOException: %message in _privatemsg_send() (line 1768 of /var/lib/drupaltestbot/sites/default/files/checkout/sites/default/modules/privatemsg/privatemsg.module).Uncaught exceptiondatabase.inc1970PDOStatement->execute()
Invalid permission .Roleprivatemsg.test204PrivatemsgTestCase->testWriteReplyPrivatemsg()
Argument 1 passed to DrupalWebTestCase::drupalLogin() must be an instance of stdClass, boolean given, called in /var/lib/drupaltestbot/sites/default/files/checkout/sites/default/modules/privatemsg/privatemsg.test on line 209 and definedRecoverable errordrupal_web_test_case.php1112DrupalWebTestCase->drupalLogin()
Trying to get property of non-objectNoticedrupal_web_test_case.php1118DrupalWebTestCase->drupalLogin()
Trying to get property of non-objectNoticedrupal_web_test_case.php1119DrupalWebTestCase->drupalLogin()
Failed to set field name to Otherprivatemsg.test209PrivatemsgTestCase->testWriteReplyPrivatemsg()
Failed to set field pass to Otherprivatemsg.test209PrivatemsgTestCase->testWriteReplyPrivatemsg()
Found the requested form fields at userOtherprivatemsg.test209PrivatemsgTestCase->testWriteReplyPrivatemsg()
Trying to get property of non-objectNoticedrupal_web_test_case.php1125DrupalWebTestCase->drupalLogin()
User successfully logged in.User loginprivatemsg.test209PrivatemsgTestCase->testWriteReplyPrivatemsg()
Failed to set field recipient to ayYkAGKo [user]Otherprivatemsg.test270PrivatemsgTestCase->testWriteReplyPrivatemsg()
Failed to set field subject to dbmNZz2owHibMS0yTncXOtherprivatemsg.test270PrivatemsgTestCase->testWriteReplyPrivatemsg()
Failed to set field body[value] to dbL9J4H809kxjhGQTfqDcajQRk8ZbnOZkFRfNTrIpxT6sxK1Gj2MvxS08fr1JaAJsmFFdY8gUkAZV6YQpEa0ylzZJjaCCqWZmXpOOtherprivatemsg.test270PrivatemsgTestCase->testWriteReplyPrivatemsg()
Found the Send message buttonOtherprivatemsg.test270PrivatemsgTestCase->testWriteReplyPrivatemsg()
Found the requested form fields at messages/newOtherprivatemsg.test270PrivatemsgTestCase->testWriteReplyPrivatemsg()
Message sent confirmation displayed.Otherprivatemsg.test271PrivatemsgTestCase->testWriteReplyPrivatemsg()
Failed to set field recipient to ayYkAGKo, mYaEEgJyOtherprivatemsg.test273PrivatemsgTestCase->testWriteReplyPrivatemsg()
Failed to set field subject to hR5cOXA4jY6xwwj27marOtherprivatemsg.test273PrivatemsgTestCase->testWriteReplyPrivatemsg()
Failed to set field body[value] to wU82nBB5DRqlMQA2RNX8RRewCJ3crVVoWaEywA3cmsrEeR5E66lsgB72AFwcZ8bcdeKHQ6F47Y6gPAkTjakwLHtkOlBFuaHFYNS1Otherprivatemsg.test273PrivatemsgTestCase->testWriteReplyPrivatemsg()
Found the Send message buttonOtherprivatemsg.test273PrivatemsgTestCase->testWriteReplyPrivatemsg()
Found the requested form fields at messages/newOtherprivatemsg.test273PrivatemsgTestCase->testWriteReplyPrivatemsg()
Message sent confirmation displayed.Otherprivatemsg.test274PrivatemsgTestCase->testWriteReplyPrivatemsg()
Failed to set field recipient to Otherprivatemsg.test276PrivatemsgTestCase->testWriteReplyPrivatemsg()
Failed to set field subject to isVeoG1W7z5TaQj2U6oiOtherprivatemsg.test276PrivatemsgTestCase->testWriteReplyPrivatemsg()
Failed to set field body[value] to vSZ51K5SYE7KpRcLXBr3X8vI6XKmDIvt1s5xtaxVUMLfCOs1RdgqkIzFoskredPc5kmaYibnJEO5oZ4EGQCatR8kanjgsqb0M0vSOtherprivatemsg.test276PrivatemsgTestCase->testWriteReplyPrivatemsg()
Found the Send message buttonOtherprivatemsg.test276PrivatemsgTestCase->testWriteReplyPrivatemsg()
Found the requested form fields at messages/newOtherprivatemsg.test276PrivatemsgTestCase->testWriteReplyPrivatemsg()
Message was not sent.Otherprivatemsg.test277PrivatemsgTestCase->testWriteReplyPrivatemsg()
Failed to set field recipient to vNbqXOtherprivatemsg.test279PrivatemsgTestCase->testWriteReplyPrivatemsg()
Failed to set field subject to vWtCpC8hYgzHnEOWUPZIOtherprivatemsg.test279PrivatemsgTestCase->testWriteReplyPrivatemsg()
Failed to set field body[value] to orvEPn3OjFRdvJsH35fFxOZUzymBmWBrE8NFCm5lAeOE96vY5ThL9tHGHnv13LmH5iPBO38VEh69uBbK1nUYccJfBRFn1SvwA8wwOtherprivatemsg.test279PrivatemsgTestCase->testWriteReplyPrivatemsg()
Found the Send message buttonOtherprivatemsg.test279PrivatemsgTestCase->testWriteReplyPrivatemsg()
Found the requested form fields at messages/newOtherprivatemsg.test279PrivatemsgTestCase->testWriteReplyPrivatemsg()
Message was not sent.Otherprivatemsg.test280PrivatemsgTestCase->testWriteReplyPrivatemsg()
Message about non-existing user displayed.Otherprivatemsg.test281PrivatemsgTestCase->testWriteReplyPrivatemsg()
Failed to set field recipient to ayYkAGKoOtherprivatemsg.test283PrivatemsgTestCase->testWriteReplyPrivatemsg()
Failed to set field subject to bKUgY68Of5yZEzffjE4hOtherprivatemsg.test283PrivatemsgTestCase->testWriteReplyPrivatemsg()
Failed to set field body[value] to Otherprivatemsg.test283PrivatemsgTestCase->testWriteReplyPrivatemsg()
Found the Send message buttonOtherprivatemsg.test283PrivatemsgTestCase->testWriteReplyPrivatemsg()
Found the requested form fields at messages/newOtherprivatemsg.test283PrivatemsgTestCase->testWriteReplyPrivatemsg()
Message sent confirmation displayed.Otherprivatemsg.test284PrivatemsgTestCase->testWriteReplyPrivatemsg()
Failed to set field recipient to ayYkAGKoOtherprivatemsg.test286PrivatemsgTestCase->testWriteReplyPrivatemsg()
Failed to set field subject to Otherprivatemsg.test286PrivatemsgTestCase->testWriteReplyPrivatemsg()
Failed to set field body[value] to hzpHeTScBjHLV67pFs4bIKGHZKwx87tAnjOyfHphR3w9q9gjNdoZyLCaWF9kThyf7wzstp3AJSs5loOV0u2SCOzV6KRRD8w4xZ5YOtherprivatemsg.test286PrivatemsgTestCase->testWriteReplyPrivatemsg()
Found the Send message buttonOtherprivatemsg.test286PrivatemsgTestCase->testWriteReplyPrivatemsg()
Found the requested form fields at messages/newOtherprivatemsg.test286PrivatemsgTestCase->testWriteReplyPrivatemsg()
Message sent confirmation displayed.Otherprivatemsg.test287PrivatemsgTestCase->testWriteReplyPrivatemsg()
Failed to set field recipient to ayYkAGKoOtherprivatemsg.test289PrivatemsgTestCase->testWriteReplyPrivatemsg()
Failed to set field subject to Otherprivatemsg.test289PrivatemsgTestCase->testWriteReplyPrivatemsg()
Failed to set field body[value] to Otherprivatemsg.test289PrivatemsgTestCase->testWriteReplyPrivatemsg()
Found the Send message buttonOtherprivatemsg.test289PrivatemsgTestCase->testWriteReplyPrivatemsg()
Found the requested form fields at messages/newOtherprivatemsg.test289PrivatemsgTestCase->testWriteReplyPrivatemsg()
Empty subject message displayed.Otherprivatemsg.test290PrivatemsgTestCase->testWriteReplyPrivatemsg()
Failed to set field recipient to hVxjq, ayYkAGKoOtherprivatemsg.test292PrivatemsgTestCase->testWriteReplyPrivatemsg()
Failed to set field subject to qvSJ0FI91ChSnvfGlSbbOtherprivatemsg.test292PrivatemsgTestCase->testWriteReplyPrivatemsg()
Failed to set field body[value] to h4Zz1XmlgrNY9yFNGJQkuy40W17EuusZ03AE3kdjWBRl3r88FeDul8a5z2k7NP7pSJgAqaQ9bnZKw01YbWYVgA0c72PKYsu3XOhHOtherprivatemsg.test292PrivatemsgTestCase->testWriteReplyPrivatemsg()
Found the Send message buttonOtherprivatemsg.test292PrivatemsgTestCase->testWriteReplyPrivatemsg()
Found the requested form fields at messages/newOtherprivatemsg.test292PrivatemsgTestCase->testWriteReplyPrivatemsg()
Message sent confirmation displayed.Otherprivatemsg.test293PrivatemsgTestCase->testWriteReplyPrivatemsg()
Message about non-existing user displayed.Otherprivatemsg.test294PrivatemsgTestCase->testWriteReplyPrivatemsg()
Failed to set field recipient to mYaEEgJyOtherprivatemsg.test296PrivatemsgTestCase->testWriteReplyPrivatemsg()
Failed to set field subject to r8QABgK2o4yRcVfHqmsnOtherprivatemsg.test296PrivatemsgTestCase->testWriteReplyPrivatemsg()
Failed to set field body[value] to lckyINdyQwfSFm0sQcvN22Ur3yP1GHpbczbFr2fvz8hKbmSjfLoLPOeCOhEZWAkMtoosZntH5h4E5bTCsQubde4lyEcTmoA8qmsv<b>formatted message #1</b>Otherprivatemsg.test296PrivatemsgTestCase->testWriteReplyPrivatemsg()
Failed to set field body[format] to 3Otherprivatemsg.test296PrivatemsgTestCase->testWriteReplyPrivatemsg()
Found the Send message buttonOtherprivatemsg.test296PrivatemsgTestCase->testWriteReplyPrivatemsg()
Found the requested form fields at messages/newOtherprivatemsg.test296PrivatemsgTestCase->testWriteReplyPrivatemsg()
Message sent confirmation displayed.Otherprivatemsg.test297PrivatemsgTestCase->testWriteReplyPrivatemsg()
Sent message subject found.Otherprivatemsg.test304PrivatemsgTestCase->testWriteReplyPrivatemsg()
Undefined variable: url_targetNoticedrupal_web_test_case.php2324DrupalWebTestCase->clickLink()
Clicked link hR5cOXA4jY6xwwj27mar () from http://pifr-mysql/checkout/?q=messagesBrowserprivatemsg.test305PrivatemsgTestCase->testWriteReplyPrivatemsg()
Found message body.Otherprivatemsg.test307PrivatemsgTestCase->testWriteReplyPrivatemsg()
Failed to set field body[value] to hbbX3DYIofW7TqEQat0asB4TmZdVlBXcsHMjcZYYH8hnb1qdXCqXALRQY9Pk3pUVONbgFPc1mfAN0WOvDt7mwgE3Ht1jwD40ollCOtherprivatemsg.test318PrivatemsgTestCase->testWriteReplyPrivatemsg()
Found the Send message buttonOtherprivatemsg.test318PrivatemsgTestCase->testWriteReplyPrivatemsg()
Found the requested form fields at Otherprivatemsg.test318PrivatemsgTestCase->testWriteReplyPrivatemsg()
New message body displayed.Otherprivatemsg.test319PrivatemsgTestCase->testWriteReplyPrivatemsg()
Failed to set field body[value] to Otherprivatemsg.test321PrivatemsgTestCase->testWriteReplyPrivatemsg()
Found the Send message buttonOtherprivatemsg.test321PrivatemsgTestCase->testWriteReplyPrivatemsg()
Found the requested form fields at Otherprivatemsg.test321PrivatemsgTestCase->testWriteReplyPrivatemsg()
"You must include a message in your reply." foundOtherprivatemsg.test322PrivatemsgTestCase->testWriteReplyPrivatemsg()
Undefined variable: url_targetNoticedrupal_web_test_case.php2324DrupalWebTestCase->clickLink()
Clicked link r8QABgK2o4yRcVfHqmsn () from http://pifr-mysql/checkout/?q=messagesBrowserprivatemsg.test329PrivatemsgTestCase->testWriteReplyPrivatemsg()
Found formatted message body.Otherprivatemsg.test330PrivatemsgTestCase->testWriteReplyPrivatemsg()
Failed to set field body[value] to pkCE7j9oUc6GMbsi8kGA9SIJ4LekhSnXoYLB2DSGC7EWYbwcS2bIJiySKmVvZAEU7YovYrYJQzhaL1FWuFndsX37J7vLLmCSX1fP<b>formatted message #2</b>Otherprivatemsg.test332PrivatemsgTestCase->testWriteReplyPrivatemsg()
Found the Send message buttonOtherprivatemsg.test332PrivatemsgTestCase->testWriteReplyPrivatemsg()
Found the requested form fields at Otherprivatemsg.test332PrivatemsgTestCase->testWriteReplyPrivatemsg()
New reply body displayed.Otherprivatemsg.test334PrivatemsgTestCase->testWriteReplyPrivatemsg()
Sent message subject found.Otherprivatemsg.test341PrivatemsgTestCase->testWriteReplyPrivatemsg()
Sent message subject found.Otherprivatemsg.test342PrivatemsgTestCase->testWriteReplyPrivatemsg()
Sent message subject found.Otherprivatemsg.test343PrivatemsgTestCase->testWriteReplyPrivatemsg()
Sent message subject found.Otherprivatemsg.test344PrivatemsgTestCase->testWriteReplyPrivatemsg()
Sent message subject found.Otherprivatemsg.test345PrivatemsgTestCase->testWriteReplyPrivatemsg()
Undefined variable: url_targetNoticedrupal_web_test_case.php2324DrupalWebTestCase->clickLink()
Clicked link dbmNZz2owHibMS0yTncX () from http://pifr-mysql/checkout/?q=messagesBrowserprivatemsg.test352PrivatemsgTestCase->testWriteReplyPrivatemsg()
Found message body.Otherprivatemsg.test354PrivatemsgTestCase->testWriteReplyPrivatemsg()
Trying to get property of non-objectNoticeprivatemsg.test358PrivatemsgTestCase->testWriteReplyPrivatemsg()
"Between you and " foundOtherprivatemsg.test358PrivatemsgTestCase->testWriteReplyPrivatemsg()
Undefined variable: url_targetNoticedrupal_web_test_case.php2324DrupalWebTestCase->clickLink()
Clicked link hR5cOXA4jY6xwwj27mar () from http://pifr-mysql/checkout/?q=messagesBrowserprivatemsg.test362PrivatemsgTestCase->testWriteReplyPrivatemsg()
Found message body.Otherprivatemsg.test364PrivatemsgTestCase->testWriteReplyPrivatemsg()
Found reply body.Otherprivatemsg.test366PrivatemsgTestCase->testWriteReplyPrivatemsg()
PDOException: %message in _privatemsg_send() (line 1768 of /var/lib/drupaltestbot/sites/default/files/checkout/sites/default/modules/privatemsg/privatemsg.module).Uncaught exceptiondatabase.inc1970PDOStatement->execute()
Message sent confirmation displayedOtherprivatemsg.test466PrivatemsgTestCase->testReadAllPermission()
Notice about read all mode displayed.Otherprivatemsg.test471PrivatemsgTestCase->testReadAllPermission()
Failed to set field body[value] to yMn6iYH0OloZqYmAfse6p3fmTkR8qXzLRID19M6xYYlYvCwku5qEQnuorh9Y9H9FPSewoFKIf2A3zNenUFC23lj61vCbJItPhQnrOtherprivatemsg.test477PrivatemsgTestCase->testReadAllPermission()
Found the Send message buttonOtherprivatemsg.test477PrivatemsgTestCase->testReadAllPermission()
Found the requested form fields at messages/view/1Otherprivatemsg.test477PrivatemsgTestCase->testReadAllPermission()
First message body displayed.Otherprivatemsg.test484PrivatemsgTestCase->testReadAllPermission()
New message body displayed.Otherprivatemsg.test485PrivatemsgTestCase->testReadAllPermission()
Admin is listed as recipient for every message once.Otherprivatemsg.test491PrivatemsgTestCase->testReadAllPermission()
Failed to set field body[value] to xNFz0XAXmSohjmh5sJAN3B6KaZocOttCPY5p4qI8vsfKHIhRPg0VsGbcP90utCDy9yEluynqGtQXznVselJy47qUNQ8pWxzshOmJOtherprivatemsg.test498PrivatemsgTestCase->testReadAllPermission()
Found the Send message buttonOtherprivatemsg.test498PrivatemsgTestCase->testReadAllPermission()
Found the requested form fields at messages/view/1Otherprivatemsg.test498PrivatemsgTestCase->testReadAllPermission()
First message body displayed.Otherprivatemsg.test501PrivatemsgTestCase->testReadAllPermission()
Second response body displayed.Otherprivatemsg.test502PrivatemsgTestCase->testReadAllPermission()
Third message body displayed.Otherprivatemsg.test503PrivatemsgTestCase->testReadAllPermission()
Admin is listed as recipient for every message once.Otherprivatemsg.test509PrivatemsgTestCase->testReadAllPermission()
PDOException: %message in _privatemsg_send() (line 1768 of /var/lib/drupaltestbot/sites/default/files/checkout/sites/default/modules/privatemsg/privatemsg.module).Uncaught exceptiondatabase.inc1970PDOStatement->execute()
PDOException: %message in _privatemsg_send() (line 1768 of /var/lib/drupaltestbot/sites/default/files/checkout/sites/default/modules/privatemsg/privatemsg.module).Uncaught exceptiondatabase.inc1970PDOStatement->execute()
ExpandPrivatemsg links (PrivatemsgLinksTestCase) [Privatemsg]13950
MessageGroupFilenameLineFunctionStatus
"A message has been sent to rWR29UmN" foundOtherprivatemsg.test990PrivatemsgLinksTestCase->testAuthorLinks()
"Message regarding eUfPlrFOX5" foundOtherprivatemsg.test998PrivatemsgLinksTestCase->testAuthorLinks()
Messages link including new message information displayedOtherprivatemsg.test1037PrivatemsgLinksTestCase->testMenuBlock()
Privatemsg new block title displayed.Otherprivatemsg.test1065PrivatemsgLinksTestCase->testNewBlock()
New message indication displayed.Otherprivatemsg.test1067PrivatemsgLinksTestCase->testNewBlock()
ExpandPrivatemsg Roles functionality (PrivatemsgRolesTestCase) [Privatemsg]6789931
MessageGroupFilenameLineFunctionStatus
PDOException: %message in _privatemsg_send() (line 1768 of /var/lib/drupaltestbot/sites/default/files/checkout/sites/default/modules/privatemsg/privatemsg.module).Uncaught exceptiondatabase.inc1970PDOStatement->execute()
PDOException: %message in _privatemsg_send() (line 1768 of /var/lib/drupaltestbot/sites/default/files/checkout/sites/default/modules/privatemsg/privatemsg.module).Uncaught exceptiondatabase.inc1970PDOStatement->execute()
"A message has been sent to qDdfAIC0 (role)." foundOtherprivatemsg_roles.test122PrivatemsgRolesTestCase->testSendMessagetoRoleBatch()
Message is displayed as newOtherprivatemsg_roles.test128PrivatemsgRolesTestCase->testSendMessagetoRoleBatch()
Undefined variable: url_targetNoticedrupal_web_test_case.php2324DrupalWebTestCase->clickLink()
Clicked link bCJx33dglL () from http://pifr-mysql/checkout/?q=messagesBrowserprivatemsg_roles.test130PrivatemsgRolesTestCase->testSendMessagetoRoleBatch()
Thread starter body displayed.Otherprivatemsg_roles.test131PrivatemsgRolesTestCase->testSendMessagetoRoleBatch()
Message is displayed as newOtherprivatemsg_roles.test128PrivatemsgRolesTestCase->testSendMessagetoRoleBatch()
Undefined variable: url_targetNoticedrupal_web_test_case.php2324DrupalWebTestCase->clickLink()
Clicked link bCJx33dglL () from http://pifr-mysql/checkout/?q=messagesBrowserprivatemsg_roles.test130PrivatemsgRolesTestCase->testSendMessagetoRoleBatch()
Thread starter body displayed.Otherprivatemsg_roles.test131PrivatemsgRolesTestCase->testSendMessagetoRoleBatch()
Message is displayed as newOtherprivatemsg_roles.test128PrivatemsgRolesTestCase->testSendMessagetoRoleBatch()
Undefined variable: url_targetNoticedrupal_web_test_case.php2324DrupalWebTestCase->clickLink()
Clicked link bCJx33dglL () from http://pifr-mysql/checkout/?q=messagesBrowserprivatemsg_roles.test130PrivatemsgRolesTestCase->testSendMessagetoRoleBatch()
Thread starter body displayed.Otherprivatemsg_roles.test131PrivatemsgRolesTestCase->testSendMessagetoRoleBatch()
Message is displayed as newOtherprivatemsg_roles.test128PrivatemsgRolesTestCase->testSendMessagetoRoleBatch()
Undefined variable: url_targetNoticedrupal_web_test_case.php2324DrupalWebTestCase->clickLink()
Clicked link bCJx33dglL () from http://pifr-mysql/checkout/?q=messagesBrowserprivatemsg_roles.test130PrivatemsgRolesTestCase->testSendMessagetoRoleBatch()
Thread starter body displayed.Otherprivatemsg_roles.test131PrivatemsgRolesTestCase->testSendMessagetoRoleBatch()
Message is displayed as newOtherprivatemsg_roles.test128PrivatemsgRolesTestCase->testSendMessagetoRoleBatch()
Undefined variable: url_targetNoticedrupal_web_test_case.php2324DrupalWebTestCase->clickLink()
Clicked link bCJx33dglL () from http://pifr-mysql/checkout/?q=messagesBrowserprivatemsg_roles.test130PrivatemsgRolesTestCase->testSendMessagetoRoleBatch()
Thread starter body displayed.Otherprivatemsg_roles.test131PrivatemsgRolesTestCase->testSendMessagetoRoleBatch()
Message is displayed as newOtherprivatemsg_roles.test128PrivatemsgRolesTestCase->testSendMessagetoRoleBatch()
Undefined variable: url_targetNoticedrupal_web_test_case.php2324DrupalWebTestCase->clickLink()
Clicked link bCJx33dglL () from http://pifr-mysql/checkout/?q=messagesBrowserprivatemsg_roles.test130PrivatemsgRolesTestCase->testSendMessagetoRoleBatch()
Thread starter body displayed.Otherprivatemsg_roles.test131PrivatemsgRolesTestCase->testSendMessagetoRoleBatch()
Message is displayed as newOtherprivatemsg_roles.test128PrivatemsgRolesTestCase->testSendMessagetoRoleBatch()
Undefined variable: url_targetNoticedrupal_web_test_case.php2324DrupalWebTestCase->clickLink()
Clicked link bCJx33dglL () from http://pifr-mysql/checkout/?q=messagesBrowserprivatemsg_roles.test130PrivatemsgRolesTestCase->testSendMessagetoRoleBatch()
Thread starter body displayed.Otherprivatemsg_roles.test131PrivatemsgRolesTestCase->testSendMessagetoRoleBatch()
Message is displayed as newOtherprivatemsg_roles.test128PrivatemsgRolesTestCase->testSendMessagetoRoleBatch()
Undefined variable: url_targetNoticedrupal_web_test_case.php2324DrupalWebTestCase->clickLink()
Clicked link bCJx33dglL () from http://pifr-mysql/checkout/?q=messagesBrowserprivatemsg_roles.test130PrivatemsgRolesTestCase->testSendMessagetoRoleBatch()
Thread starter body displayed.Otherprivatemsg_roles.test131PrivatemsgRolesTestCase->testSendMessagetoRoleBatch()
Message is displayed as newOtherprivatemsg_roles.test128PrivatemsgRolesTestCase->testSendMessagetoRoleBatch()
Undefined variable: url_targetNoticedrupal_web_test_case.php2324DrupalWebTestCase->clickLink()
Clicked link bCJx33dglL () from http://pifr-mysql/checkout/?q=messagesBrowserprivatemsg_roles.test130PrivatemsgRolesTestCase->testSendMessagetoRoleBatch()
Thread starter body displayed.Otherprivatemsg_roles.test131PrivatemsgRolesTestCase->testSendMessagetoRoleBatch()
Message is displayed as newOtherprivatemsg_roles.test128PrivatemsgRolesTestCase->testSendMessagetoRoleBatch()
Undefined variable: url_targetNoticedrupal_web_test_case.php2324DrupalWebTestCase->clickLink()
Clicked link bCJx33dglL () from http://pifr-mysql/checkout/?q=messagesBrowserprivatemsg_roles.test130PrivatemsgRolesTestCase->testSendMessagetoRoleBatch()
Thread starter body displayed.Otherprivatemsg_roles.test131PrivatemsgRolesTestCase->testSendMessagetoRoleBatch()
Message is displayed as newOtherprivatemsg_roles.test128PrivatemsgRolesTestCase->testSendMessagetoRoleBatch()
Undefined variable: url_targetNoticedrupal_web_test_case.php2324DrupalWebTestCase->clickLink()
Clicked link bCJx33dglL () from http://pifr-mysql/checkout/?q=messagesBrowserprivatemsg_roles.test130PrivatemsgRolesTestCase->testSendMessagetoRoleBatch()
Thread starter body displayed.Otherprivatemsg_roles.test131PrivatemsgRolesTestCase->testSendMessagetoRoleBatch()
Message is displayed as newOtherprivatemsg_roles.test128PrivatemsgRolesTestCase->testSendMessagetoRoleBatch()
Undefined variable: url_targetNoticedrupal_web_test_case.php2324DrupalWebTestCase->clickLink()
Clicked link bCJx33dglL () from http://pifr-mysql/checkout/?q=messagesBrowserprivatemsg_roles.test130PrivatemsgRolesTestCase->testSendMessagetoRoleBatch()
Thread starter body displayed.Otherprivatemsg_roles.test131PrivatemsgRolesTestCase->testSendMessagetoRoleBatch()
Message is displayed as newOtherprivatemsg_roles.test128PrivatemsgRolesTestCase->testSendMessagetoRoleBatch()
Undefined variable: url_targetNoticedrupal_web_test_case.php2324DrupalWebTestCase->clickLink()
Clicked link bCJx33dglL () from http://pifr-mysql/checkout/?q=messagesBrowserprivatemsg_roles.test130PrivatemsgRolesTestCase->testSendMessagetoRoleBatch()
Thread starter body displayed.Otherprivatemsg_roles.test131PrivatemsgRolesTestCase->testSendMessagetoRoleBatch()
Message is displayed as newOtherprivatemsg_roles.test128PrivatemsgRolesTestCase->testSendMessagetoRoleBatch()
Undefined variable: url_targetNoticedrupal_web_test_case.php2324DrupalWebTestCase->clickLink()
Clicked link bCJx33dglL () from http://pifr-mysql/checkout/?q=messagesBrowserprivatemsg_roles.test130PrivatemsgRolesTestCase->testSendMessagetoRoleBatch()
Thread starter body displayed.Otherprivatemsg_roles.test131PrivatemsgRolesTestCase->testSendMessagetoRoleBatch()
Message is displayed as newOtherprivatemsg_roles.test128PrivatemsgRolesTestCase->testSendMessagetoRoleBatch()
Undefined variable: url_targetNoticedrupal_web_test_case.php2324DrupalWebTestCase->clickLink()
Clicked link bCJx33dglL () from http://pifr-mysql/checkout/?q=messagesBrowserprivatemsg_roles.test130PrivatemsgRolesTestCase->testSendMessagetoRoleBatch()
Thread starter body displayed.Otherprivatemsg_roles.test131PrivatemsgRolesTestCase->testSendMessagetoRoleBatch()
Message is displayed as newOtherprivatemsg_roles.test128PrivatemsgRolesTestCase->testSendMessagetoRoleBatch()
Undefined variable: url_targetNoticedrupal_web_test_case.php2324DrupalWebTestCase->clickLink()
Clicked link bCJx33dglL () from http://pifr-mysql/checkout/?q=messagesBrowserprivatemsg_roles.test130PrivatemsgRolesTestCase->testSendMessagetoRoleBatch()
Thread starter body displayed.Otherprivatemsg_roles.test131PrivatemsgRolesTestCase->testSendMessagetoRoleBatch()
Message is displayed as newOtherprivatemsg_roles.test128PrivatemsgRolesTestCase->testSendMessagetoRoleBatch()
Undefined variable: url_targetNoticedrupal_web_test_case.php2324DrupalWebTestCase->clickLink()
Clicked link bCJx33dglL () from http://pifr-mysql/checkout/?q=messagesBrowserprivatemsg_roles.test130PrivatemsgRolesTestCase->testSendMessagetoRoleBatch()
Thread starter body displayed.Otherprivatemsg_roles.test131PrivatemsgRolesTestCase->testSendMessagetoRoleBatch()
Message is displayed as newOtherprivatemsg_roles.test128PrivatemsgRolesTestCase->testSendMessagetoRoleBatch()
Undefined variable: url_targetNoticedrupal_web_test_case.php2324DrupalWebTestCase->clickLink()
Clicked link bCJx33dglL () from http://pifr-mysql/checkout/?q=messagesBrowserprivatemsg_roles.test130PrivatemsgRolesTestCase->testSendMessagetoRoleBatch()
Thread starter body displayed.Otherprivatemsg_roles.test131PrivatemsgRolesTestCase->testSendMessagetoRoleBatch()
Message is displayed as newOtherprivatemsg_roles.test128PrivatemsgRolesTestCase->testSendMessagetoRoleBatch()
Undefined variable: url_targetNoticedrupal_web_test_case.php2324DrupalWebTestCase->clickLink()
Clicked link bCJx33dglL () from http://pifr-mysql/checkout/?q=messagesBrowserprivatemsg_roles.test130PrivatemsgRolesTestCase->testSendMessagetoRoleBatch()
Thread starter body displayed.Otherprivatemsg_roles.test131PrivatemsgRolesTestCase->testSendMessagetoRoleBatch()
Message is displayed as newOtherprivatemsg_roles.test128PrivatemsgRolesTestCase->testSendMessagetoRoleBatch()
Undefined variable: url_targetNoticedrupal_web_test_case.php2324DrupalWebTestCase->clickLink()
Clicked link bCJx33dglL () from http://pifr-mysql/checkout/?q=messagesBrowserprivatemsg_roles.test130PrivatemsgRolesTestCase->testSendMessagetoRoleBatch()
Thread starter body displayed.Otherprivatemsg_roles.test131PrivatemsgRolesTestCase->testSendMessagetoRoleBatch()
Message is displayed as newOtherprivatemsg_roles.test128PrivatemsgRolesTestCase->testSendMessagetoRoleBatch()
Undefined variable: url_targetNoticedrupal_web_test_case.php2324DrupalWebTestCase->clickLink()
Clicked link bCJx33dglL () from http://pifr-mysql/checkout/?q=messagesBrowserprivatemsg_roles.test130PrivatemsgRolesTestCase->testSendMessagetoRoleBatch()
Thread starter body displayed.Otherprivatemsg_roles.test131PrivatemsgRolesTestCase->testSendMessagetoRoleBatch()
Message is displayed as newOtherprivatemsg_roles.test128PrivatemsgRolesTestCase->testSendMessagetoRoleBatch()
Undefined variable: url_targetNoticedrupal_web_test_case.php2324DrupalWebTestCase->clickLink()
Clicked link bCJx33dglL () from http://pifr-mysql/checkout/?q=messagesBrowserprivatemsg_roles.test130PrivatemsgRolesTestCase->testSendMessagetoRoleBatch()
Thread starter body displayed.Otherprivatemsg_roles.test131PrivatemsgRolesTestCase->testSendMessagetoRoleBatch()
Message is displayed as newOtherprivatemsg_roles.test128PrivatemsgRolesTestCase->testSendMessagetoRoleBatch()
Undefined variable: url_targetNoticedrupal_web_test_case.php2324DrupalWebTestCase->clickLink()
Clicked link bCJx33dglL () from http://pifr-mysql/checkout/?q=messagesBrowserprivatemsg_roles.test130PrivatemsgRolesTestCase->testSendMessagetoRoleBatch()
Thread starter body displayed.Otherprivatemsg_roles.test131PrivatemsgRolesTestCase->testSendMessagetoRoleBatch()
Message is displayed as newOtherprivatemsg_roles.test128PrivatemsgRolesTestCase->testSendMessagetoRoleBatch()
Undefined variable: url_targetNoticedrupal_web_test_case.php2324DrupalWebTestCase->clickLink()
Clicked link bCJx33dglL () from http://pifr-mysql/checkout/?q=messagesBrowserprivatemsg_roles.test130PrivatemsgRolesTestCase->testSendMessagetoRoleBatch()
Thread starter body displayed.Otherprivatemsg_roles.test131PrivatemsgRolesTestCase->testSendMessagetoRoleBatch()
Message is displayed as newOtherprivatemsg_roles.test128PrivatemsgRolesTestCase->testSendMessagetoRoleBatch()
Undefined variable: url_targetNoticedrupal_web_test_case.php2324DrupalWebTestCase->clickLink()
Clicked link bCJx33dglL () from http://pifr-mysql/checkout/?q=messagesBrowserprivatemsg_roles.test130PrivatemsgRolesTestCase->testSendMessagetoRoleBatch()
Thread starter body displayed.Otherprivatemsg_roles.test131PrivatemsgRolesTestCase->testSendMessagetoRoleBatch()
"A message has been sent to zG5k8aid (role)." foundOtherprivatemsg_roles.test175PrivatemsgRolesTestCase->testSendMessageToRole()
Message is displayed as newOtherprivatemsg_roles.test181PrivatemsgRolesTestCase->testSendMessageToRole()
Undefined variable: url_targetNoticedrupal_web_test_case.php2324DrupalWebTestCase->clickLink()
Clicked link zJY8Pnrs5I () from http://pifr-mysql/checkout/?q=messagesBrowserprivatemsg_roles.test183PrivatemsgRolesTestCase->testSendMessageToRole()
Thread starter body displayed.Otherprivatemsg_roles.test184PrivatemsgRolesTestCase->testSendMessageToRole()
Failed to set field body[value] to jhx1QpMAQ7yZ7r6N5DAkwR37B77pUbpWHWCsJ24NStExrOwcTKOtherprivatemsg_roles.test193PrivatemsgRolesTestCase->testSendMessageToRole()
Found the Send message buttonOtherprivatemsg_roles.test193PrivatemsgRolesTestCase->testSendMessageToRole()
Found the requested form fields at Otherprivatemsg_roles.test193PrivatemsgRolesTestCase->testSendMessageToRole()
Message is displayed as newOtherprivatemsg_roles.test201PrivatemsgRolesTestCase->testSendMessageToRole()
Undefined variable: url_targetNoticedrupal_web_test_case.php2324DrupalWebTestCase->clickLink()
Clicked link zJY8Pnrs5I () from http://pifr-mysql/checkout/?q=messagesBrowserprivatemsg_roles.test202PrivatemsgRolesTestCase->testSendMessageToRole()
Reply1 is displayedOtherprivatemsg_roles.test204PrivatemsgRolesTestCase->testSendMessageToRole()
Failed to set field body[value] to baj7wN2bHODgsVDOcxXBOtf6kloVwyEWnDCnhdiNNfoS6fcb02Otherprivatemsg_roles.test210PrivatemsgRolesTestCase->testSendMessageToRole()
Found the Send message buttonOtherprivatemsg_roles.test210PrivatemsgRolesTestCase->testSendMessageToRole()
Found the requested form fields at Otherprivatemsg_roles.test210PrivatemsgRolesTestCase->testSendMessageToRole()
Message is displayed as newOtherprivatemsg_roles.test215PrivatemsgRolesTestCase->testSendMessageToRole()
Undefined variable: url_targetNoticedrupal_web_test_case.php2324DrupalWebTestCase->clickLink()
Clicked link zJY8Pnrs5I () from http://pifr-mysql/checkout/?q=messagesBrowserprivatemsg_roles.test216PrivatemsgRolesTestCase->testSendMessageToRole()
"zG5k8aid (role)" foundOtherprivatemsg_roles.test217PrivatemsgRolesTestCase->testSendMessageToRole()
Thread starter body is displayedOtherprivatemsg_roles.test219PrivatemsgRolesTestCase->testSendMessageToRole()
Reply2 is displayedOtherprivatemsg_roles.test221PrivatemsgRolesTestCase->testSendMessageToRole()
"A message has been sent to lkfD8e3z (role)." foundOtherprivatemsg_roles.test246PrivatemsgRolesTestCase->testSendMessageToRoleBlocked()
Message is displayed as newOtherprivatemsg_roles.test252PrivatemsgRolesTestCase->testSendMessageToRoleBlocked()
Undefined variable: url_targetNoticedrupal_web_test_case.php2324DrupalWebTestCase->clickLink()
Clicked link xRDdcj3Ntm () from http://pifr-mysql/checkout/?q=messagesBrowserprivatemsg_roles.test254PrivatemsgRolesTestCase->testSendMessageToRoleBlocked()
Thread starter body displayed.Otherprivatemsg_roles.test255PrivatemsgRolesTestCase->testSendMessageToRoleBlocked()
"A message has been sent to wX1NISV5 (role)." foundOtherprivatemsg_roles.test279PrivatemsgRolesTestCase->testNewUser()
ExpandPrivatemsg Tags functionality. (PrivatemsgTagsTestCase) [Privatemsg]9303
MessageGroupFilenameLineFunctionStatus
PDOException: %message in _privatemsg_send() (line 1768 of /var/lib/drupaltestbot/sites/default/files/checkout/sites/default/modules/privatemsg/privatemsg.module).Uncaught exceptiondatabase.inc1970PDOStatement->execute()
PDOException: %message in _privatemsg_send() (line 1768 of /var/lib/drupaltestbot/sites/default/files/checkout/sites/default/modules/privatemsg/privatemsg.module).Uncaught exceptiondatabase.inc1970PDOStatement->execute()
PDOException: %message in _privatemsg_send() (line 1768 of /var/lib/drupaltestbot/sites/default/files/checkout/sites/default/modules/privatemsg/privatemsg.module).Uncaught exceptiondatabase.inc1970PDOStatement->execute()
ExpandPrivatemsg tokens (PrivatemsgTokenTestCase) [Privatemsg]66202
MessageGroupFilenameLineFunctionStatus
Token is displayed in subject.Otherprivatemsg.test1127PrivatemsgTokenTestCase->testBasicTokens()
Subject token is displayed.Otherprivatemsg.test1128PrivatemsgTokenTestCase->testBasicTokens()
Author token is displayed.Otherprivatemsg.test1129PrivatemsgTokenTestCase->testBasicTokens()
Invalid token is displayed.Otherprivatemsg.test1130PrivatemsgTokenTestCase->testBasicTokens()
Token notice is displayed.Otherprivatemsg.test1131PrivatemsgTokenTestCase->testBasicTokens()
Undefined variable: url_targetNoticedrupal_web_test_case.php2324DrupalWebTestCase->clickLink()
Clicked link Hey cmDYQ39D () from http://pifr-mysql/checkout/?q=messagesBrowserprivatemsg.test1137PrivatemsgTokenTestCase->testBasicTokens()
Replaced token is displayed in subject.Otherprivatemsg.test1141PrivatemsgTokenTestCase->testBasicTokens()
Subject token is replaced.Otherprivatemsg.test1142PrivatemsgTokenTestCase->testBasicTokens()
Author token is replaced.Otherprivatemsg.test1143PrivatemsgTokenTestCase->testBasicTokens()
Invalid token is displayed.Otherprivatemsg.test1144PrivatemsgTokenTestCase->testBasicTokens()
Failed to set field body[value] to Response with a token [privatemsg_message:mid]Otherprivatemsg.test1152PrivatemsgTokenTestCase->testBasicTokens()
Found the Send message buttonOtherprivatemsg.test1152PrivatemsgTokenTestCase->testBasicTokens()
Found the requested form fields at Otherprivatemsg.test1152PrivatemsgTokenTestCase->testBasicTokens()
Undefined variable: url_targetNoticedrupal_web_test_case.php2324DrupalWebTestCase->clickLink()
Clicked link Hey hWMnFO84 () from http://pifr-mysql/checkout/?q=messagesBrowserprivatemsg.test1156PrivatemsgTokenTestCase->testBasicTokens()
Replaced token is displayed in subject.Otherprivatemsg.test1160PrivatemsgTokenTestCase->testBasicTokens()
Subject token is replaced.Otherprivatemsg.test1161PrivatemsgTokenTestCase->testBasicTokens()
Author token is replaced.Otherprivatemsg.test1162PrivatemsgTokenTestCase->testBasicTokens()
Invalid token is displayed.Otherprivatemsg.test1163PrivatemsgTokenTestCase->testBasicTokens()
Token from recipient is not replaced.Otherprivatemsg.test1164PrivatemsgTokenTestCase->testBasicTokens()
Token is displayed correctly in subject for author.Otherprivatemsg.test1171PrivatemsgTokenTestCase->testBasicTokens()
ExpandUser blocking functionality. (PrivatemsgBlockUserCase) [Privatemsg]901
MessageGroupFilenameLineFunctionStatus
PDOException: %message in _privatemsg_send() (line 1768 of /var/lib/drupaltestbot/sites/default/files/checkout/sites/default/modules/privatemsg/privatemsg.module).Uncaught exceptiondatabase.inc1970PDOStatement->execute()