notifiy_tokens.patch

Test status
StatusResult
Last receivedWed, 10/20/2010 - 10:00:26
Last requestedWed, 10/20/2010 - 10:00:49
Last testedWed, 10/20/2010 - 10:02:44
Test count1
Environment status
MySQLfail
File information
Filenotifiy_tokens.patch
BranchPrivatemsg - 7.x-1.x
LinkIssue Link
SummaryFAILED: [[SimpleTest]]: [MySQL] 964 pass(es), 215 fail(s), and 49 exception(s).
Details

MySQL

  1. Setup environment
  2. Detect an invalid patch URL
  3. Detect invalid repository information
  4. Detect invalid patch format
  5. Detect a non-applicable patch
  6. Detect invalid PHP syntax
  7. Detect a Drupal installation failure
  8. Detect a test run failure
  9. Detect a failing test
    Review the test failures below then if necessary run them locally until the problem has been fixed.
  10. Complete test suite with all tests passing
964 pass(es), 215 fail(s), and 49 exception(s)

Non-pass

Test namePassFailException
ExpandPrivatemsg API functionality. (PrivatemsgAPITestCase) [Privatemsg]2402
MessageGroupFilenameLineFunctionStatus
PDOException: %message in _privatemsg_send() (line 1787 of /var/lib/drupaltestbot/sites/default/files/checkout/sites/default/modules/privatemsg/privatemsg.module).Uncaught exceptiondatabase.inc1970PDOStatement->execute()
PDOException: %message in _privatemsg_send() (line 1787 of /var/lib/drupaltestbot/sites/default/files/checkout/sites/default/modules/privatemsg/privatemsg.module).Uncaught exceptiondatabase.inc1970PDOStatement->execute()
ExpandPrivatemsg Filter functionality. (PrivatemsgFilterTestCase) [Privatemsg]85262
MessageGroupFilenameLineFunctionStatus
Message sent confirmation displayedOtherprivatemsg_filter.test39PrivatemsgFilterTestCase->testInboxSentHandling()
Thread displayed in "Sent messages" for author.Otherprivatemsg_filter.test46PrivatemsgFilterTestCase->testInboxSentHandling()
Thread displayed in "All messages" for author.Otherprivatemsg_filter.test48PrivatemsgFilterTestCase->testInboxSentHandling()
Thread displayed in inbox for recipient.Otherprivatemsg_filter.test53PrivatemsgFilterTestCase->testInboxSentHandling()
Thread displayed in "All messages." for recipient.Otherprivatemsg_filter.test57PrivatemsgFilterTestCase->testInboxSentHandling()
Undefined variable: url_targetNoticedrupal_web_test_case.php2318DrupalWebTestCase->clickLink()
Clicked link qmYgJNE3m3t6rAUx43vI () from http://pifr-mysql/checkout/?q=messages/listBrowserprivatemsg_filter.test60PrivatemsgFilterTestCase->testInboxSentHandling()
Failed to set field body[value] to e6xOoZnIv1nX0hTAlujtG8L7jNdAqSSJABRwbKDco3HiuWbh4VLSmm0mUGqf3ZSHwRYw88nJKnJhOySbXW2sEzfWEYaWH3ZPXSLbOtherprivatemsg_filter.test64PrivatemsgFilterTestCase->testInboxSentHandling()
Found the Send message buttonOtherprivatemsg_filter.test64PrivatemsgFilterTestCase->testInboxSentHandling()
Found the requested form fields at Otherprivatemsg_filter.test64PrivatemsgFilterTestCase->testInboxSentHandling()
Message sent confirmation displayedOtherprivatemsg_filter.test65PrivatemsgFilterTestCase->testInboxSentHandling()
Thread displayed in "Sent messages" for recipient.Otherprivatemsg_filter.test68PrivatemsgFilterTestCase->testInboxSentHandling()
Thread displayed in inbox for author.Otherprivatemsg_filter.test72PrivatemsgFilterTestCase->testInboxSentHandling()
Failed to set field list[1] to 1Otherprivatemsg_filter.test79PrivatemsgFilterTestCase->testInboxSentHandling()
Found the Delete buttonOtherprivatemsg_filter.test79PrivatemsgFilterTestCase->testInboxSentHandling()
Found the requested form fields at Otherprivatemsg_filter.test79PrivatemsgFilterTestCase->testInboxSentHandling()
Undefined variable: url_targetNoticedrupal_web_test_case.php2318DrupalWebTestCase->clickLink()
Clicked link qmYgJNE3m3t6rAUx43vI () from http://pifr-mysql/checkout/?q=messagesBrowserprivatemsg_filter.test87PrivatemsgFilterTestCase->testInboxSentHandling()
Failed to set field body[value] to yeMa26uNQ7FV2PLsfNqT3k8us4xd2zWbOIgB0t9C7MiBVH2y4DqSc8hMYQrhnr4isUz8v3um9SRyvq4OyWH3s4bwpx6wOfTVPhzkOtherprivatemsg_filter.test91PrivatemsgFilterTestCase->testInboxSentHandling()
Found the Send message buttonOtherprivatemsg_filter.test91PrivatemsgFilterTestCase->testInboxSentHandling()
Found the requested form fields at Otherprivatemsg_filter.test91PrivatemsgFilterTestCase->testInboxSentHandling()
Message sent confirmation displayedOtherprivatemsg_filter.test92PrivatemsgFilterTestCase->testInboxSentHandling()
Thread displayed again in inbox for author.Otherprivatemsg_filter.test97PrivatemsgFilterTestCase->testInboxSentHandling()
Failed to set field list[1] to 1Otherprivatemsg_filter.test104PrivatemsgFilterTestCase->testInboxSentHandling()
Found the Archive buttonOtherprivatemsg_filter.test104PrivatemsgFilterTestCase->testInboxSentHandling()
Found the requested form fields at Otherprivatemsg_filter.test104PrivatemsgFilterTestCase->testInboxSentHandling()
Confirmation message displayedOtherprivatemsg_filter.test105PrivatemsgFilterTestCase->testInboxSentHandling()
Thread still displayed in "All messages" list.Otherprivatemsg_filter.test109PrivatemsgFilterTestCase->testInboxSentHandling()
ExpandPrivatemsg filter widget (PrivatemsgFilterWidgetTestCase) [Privatemsg]1701
MessageGroupFilenameLineFunctionStatus
PDOException: %message in _privatemsg_send() (line 1787 of /var/lib/drupaltestbot/sites/default/files/checkout/sites/default/modules/privatemsg/privatemsg.module).Uncaught exceptiondatabase.inc1970PDOStatement->execute()
ExpandPrivatemsg functionality. (PrivatemsgTestCase) [Privatemsg]58909
MessageGroupFilenameLineFunctionStatus
Invalid permission .Roleprivatemsg.test204PrivatemsgTestCase->testWriteReplyPrivatemsg()
Argument 1 passed to DrupalWebTestCase::drupalLogin() must be an instance of stdClass, boolean given, called in /var/lib/drupaltestbot/sites/default/files/checkout/sites/default/modules/privatemsg/privatemsg.test on line 209 and definedRecoverable errordrupal_web_test_case.php1112DrupalWebTestCase->drupalLogin()
Trying to get property of non-objectNoticedrupal_web_test_case.php1118DrupalWebTestCase->drupalLogin()
Trying to get property of non-objectNoticedrupal_web_test_case.php1119DrupalWebTestCase->drupalLogin()
Failed to set field name to Otherprivatemsg.test209PrivatemsgTestCase->testWriteReplyPrivatemsg()
Failed to set field pass to Otherprivatemsg.test209PrivatemsgTestCase->testWriteReplyPrivatemsg()
Found the requested form fields at userOtherprivatemsg.test209PrivatemsgTestCase->testWriteReplyPrivatemsg()
Trying to get property of non-objectNoticedrupal_web_test_case.php1125DrupalWebTestCase->drupalLogin()
User successfully logged in.User loginprivatemsg.test209PrivatemsgTestCase->testWriteReplyPrivatemsg()
Failed to set field recipient to wmqeWUBW [user]Otherprivatemsg.test270PrivatemsgTestCase->testWriteReplyPrivatemsg()
Failed to set field subject to v6JQYAtlTeLXPhFk48SYOtherprivatemsg.test270PrivatemsgTestCase->testWriteReplyPrivatemsg()
Failed to set field body[value] to ow12hqFagZeWQdoyaUQCISkN1anTbyM7heAQG38iacnvT949n2v8vuce6cmh6kS2VLv9tPwamqI3yY5P0RvmxILfB43YEvLuMx4yOtherprivatemsg.test270PrivatemsgTestCase->testWriteReplyPrivatemsg()
Found the Send message buttonOtherprivatemsg.test270PrivatemsgTestCase->testWriteReplyPrivatemsg()
Found the requested form fields at messages/newOtherprivatemsg.test270PrivatemsgTestCase->testWriteReplyPrivatemsg()
Message sent confirmation displayed.Otherprivatemsg.test271PrivatemsgTestCase->testWriteReplyPrivatemsg()
Failed to set field recipient to wmqeWUBW, gjPWkkcTOtherprivatemsg.test273PrivatemsgTestCase->testWriteReplyPrivatemsg()
Failed to set field subject to rZ9YP2hL0oXJSnsQSrY8Otherprivatemsg.test273PrivatemsgTestCase->testWriteReplyPrivatemsg()
Failed to set field body[value] to rIQfTmtTNoONtt8q245Rjb9CoKt89RcmZD7M2qaRwCOWrdmOgFqRw1kWOB5vPNbyacKC7pmvVoJEmai3j2iziybOG9jnQuVo4SGvOtherprivatemsg.test273PrivatemsgTestCase->testWriteReplyPrivatemsg()
Found the Send message buttonOtherprivatemsg.test273PrivatemsgTestCase->testWriteReplyPrivatemsg()
Found the requested form fields at messages/newOtherprivatemsg.test273PrivatemsgTestCase->testWriteReplyPrivatemsg()
Message sent confirmation displayed.Otherprivatemsg.test274PrivatemsgTestCase->testWriteReplyPrivatemsg()
Failed to set field recipient to Otherprivatemsg.test276PrivatemsgTestCase->testWriteReplyPrivatemsg()
Failed to set field subject to qVvZ5xV1FB3NkeBykSJNOtherprivatemsg.test276PrivatemsgTestCase->testWriteReplyPrivatemsg()
Failed to set field body[value] to kYBadVFBMOwv7WhETA9qc2DuHuIzn8l0st6XctDkPII6UdC7Oypb5gpiPAEcRnZYg8TMIdRozM7slt3RAjBCCh3NpnXTxcl8IvfAOtherprivatemsg.test276PrivatemsgTestCase->testWriteReplyPrivatemsg()
Found the Send message buttonOtherprivatemsg.test276PrivatemsgTestCase->testWriteReplyPrivatemsg()
Found the requested form fields at messages/newOtherprivatemsg.test276PrivatemsgTestCase->testWriteReplyPrivatemsg()
Message was not sent.Otherprivatemsg.test277PrivatemsgTestCase->testWriteReplyPrivatemsg()
Failed to set field recipient to rektgOtherprivatemsg.test279PrivatemsgTestCase->testWriteReplyPrivatemsg()
Failed to set field subject to lCoOhLAQSrJ72J5En5RUOtherprivatemsg.test279PrivatemsgTestCase->testWriteReplyPrivatemsg()
Failed to set field body[value] to kAJEMK6q4EfqVkd3s43QmpQoG6rgnY5JMO9d0waDD8fdxMFyBhNCCxs8d8J8Zaf6b8Z2VTDOl2tejxjqvG2EBDSOdKHgCmzYcG2nOtherprivatemsg.test279PrivatemsgTestCase->testWriteReplyPrivatemsg()
Found the Send message buttonOtherprivatemsg.test279PrivatemsgTestCase->testWriteReplyPrivatemsg()
Found the requested form fields at messages/newOtherprivatemsg.test279PrivatemsgTestCase->testWriteReplyPrivatemsg()
Message was not sent.Otherprivatemsg.test280PrivatemsgTestCase->testWriteReplyPrivatemsg()
Message about non-existing user displayed.Otherprivatemsg.test281PrivatemsgTestCase->testWriteReplyPrivatemsg()
Failed to set field recipient to wmqeWUBWOtherprivatemsg.test283PrivatemsgTestCase->testWriteReplyPrivatemsg()
Failed to set field subject to w53JE8qqkBNXaL6xixfcOtherprivatemsg.test283PrivatemsgTestCase->testWriteReplyPrivatemsg()
Failed to set field body[value] to Otherprivatemsg.test283PrivatemsgTestCase->testWriteReplyPrivatemsg()
Found the Send message buttonOtherprivatemsg.test283PrivatemsgTestCase->testWriteReplyPrivatemsg()
Found the requested form fields at messages/newOtherprivatemsg.test283PrivatemsgTestCase->testWriteReplyPrivatemsg()
Message sent confirmation displayed.Otherprivatemsg.test284PrivatemsgTestCase->testWriteReplyPrivatemsg()
Failed to set field recipient to wmqeWUBWOtherprivatemsg.test286PrivatemsgTestCase->testWriteReplyPrivatemsg()
Failed to set field subject to Otherprivatemsg.test286PrivatemsgTestCase->testWriteReplyPrivatemsg()
Failed to set field body[value] to pHhMhix4paXsmotflczTTlybmgUa9ZI0sWXMaJXQN94ZNkmiBQbQ78pTbuW0cjme2yfuq8khYdgxtmFRqUlss0vB3zJeqlwFSrQZOtherprivatemsg.test286PrivatemsgTestCase->testWriteReplyPrivatemsg()
Found the Send message buttonOtherprivatemsg.test286PrivatemsgTestCase->testWriteReplyPrivatemsg()
Found the requested form fields at messages/newOtherprivatemsg.test286PrivatemsgTestCase->testWriteReplyPrivatemsg()
Message sent confirmation displayed.Otherprivatemsg.test287PrivatemsgTestCase->testWriteReplyPrivatemsg()
Failed to set field recipient to wmqeWUBWOtherprivatemsg.test289PrivatemsgTestCase->testWriteReplyPrivatemsg()
Failed to set field subject to Otherprivatemsg.test289PrivatemsgTestCase->testWriteReplyPrivatemsg()
Failed to set field body[value] to Otherprivatemsg.test289PrivatemsgTestCase->testWriteReplyPrivatemsg()
Found the Send message buttonOtherprivatemsg.test289PrivatemsgTestCase->testWriteReplyPrivatemsg()
Found the requested form fields at messages/newOtherprivatemsg.test289PrivatemsgTestCase->testWriteReplyPrivatemsg()
Empty subject message displayed.Otherprivatemsg.test290PrivatemsgTestCase->testWriteReplyPrivatemsg()
Failed to set field recipient to hcGcz, wmqeWUBWOtherprivatemsg.test292PrivatemsgTestCase->testWriteReplyPrivatemsg()
Failed to set field subject to u3z9jBF2JnjxQ8EM3sajOtherprivatemsg.test292PrivatemsgTestCase->testWriteReplyPrivatemsg()
Failed to set field body[value] to p9iy4ZnjamBDzcP5DIfCRkWsVB2YRV6ICsk2ZTvaEUlcDq1QMTss6FQCGztf3wiVclwY3aqEfOS11ID5XKNxKuroKPBojdocQyc8Otherprivatemsg.test292PrivatemsgTestCase->testWriteReplyPrivatemsg()
Found the Send message buttonOtherprivatemsg.test292PrivatemsgTestCase->testWriteReplyPrivatemsg()
Found the requested form fields at messages/newOtherprivatemsg.test292PrivatemsgTestCase->testWriteReplyPrivatemsg()
Message sent confirmation displayed.Otherprivatemsg.test293PrivatemsgTestCase->testWriteReplyPrivatemsg()
Message about non-existing user displayed.Otherprivatemsg.test294PrivatemsgTestCase->testWriteReplyPrivatemsg()
Failed to set field recipient to gjPWkkcTOtherprivatemsg.test296PrivatemsgTestCase->testWriteReplyPrivatemsg()
Failed to set field subject to sR8r9FtzNmc2KlFhwGSPOtherprivatemsg.test296PrivatemsgTestCase->testWriteReplyPrivatemsg()
Failed to set field body[value] to xSGdWNxz3lCSifkQFlm3enrCyNYqTC9X6jKbdlYZGSUBKFc1vrG3HSd1l4wg4rtUFz6nAtkZ4OKrmNBoKKvDj8G1bbA4oAStjfmB<b>formatted message #1</b>Otherprivatemsg.test296PrivatemsgTestCase->testWriteReplyPrivatemsg()
Failed to set field body[format] to 3Otherprivatemsg.test296PrivatemsgTestCase->testWriteReplyPrivatemsg()
Found the Send message buttonOtherprivatemsg.test296PrivatemsgTestCase->testWriteReplyPrivatemsg()
Found the requested form fields at messages/newOtherprivatemsg.test296PrivatemsgTestCase->testWriteReplyPrivatemsg()
Message sent confirmation displayed.Otherprivatemsg.test297PrivatemsgTestCase->testWriteReplyPrivatemsg()
Sent message subject found.Otherprivatemsg.test304PrivatemsgTestCase->testWriteReplyPrivatemsg()
Undefined variable: url_targetNoticedrupal_web_test_case.php2318DrupalWebTestCase->clickLink()
Clicked link rZ9YP2hL0oXJSnsQSrY8 () from http://pifr-mysql/checkout/?q=messagesBrowserprivatemsg.test305PrivatemsgTestCase->testWriteReplyPrivatemsg()
Found message body.Otherprivatemsg.test307PrivatemsgTestCase->testWriteReplyPrivatemsg()
Failed to set field body[value] to nJ36zYB6Uj2my1QAbGCGIotofdBCxjk1uJE7pRozuIYF2bA2Tqfju3T3PCooWzhU8kBKH3Doitg4JvK0Gg8nn5f1UA5tLAiLMzEyOtherprivatemsg.test318PrivatemsgTestCase->testWriteReplyPrivatemsg()
Found the Send message buttonOtherprivatemsg.test318PrivatemsgTestCase->testWriteReplyPrivatemsg()
Found the requested form fields at Otherprivatemsg.test318PrivatemsgTestCase->testWriteReplyPrivatemsg()
New message body displayed.Otherprivatemsg.test319PrivatemsgTestCase->testWriteReplyPrivatemsg()
Failed to set field body[value] to Otherprivatemsg.test321PrivatemsgTestCase->testWriteReplyPrivatemsg()
Found the Send message buttonOtherprivatemsg.test321PrivatemsgTestCase->testWriteReplyPrivatemsg()
Found the requested form fields at Otherprivatemsg.test321PrivatemsgTestCase->testWriteReplyPrivatemsg()
"You must include a message in your reply." foundOtherprivatemsg.test322PrivatemsgTestCase->testWriteReplyPrivatemsg()
Undefined variable: url_targetNoticedrupal_web_test_case.php2318DrupalWebTestCase->clickLink()
Clicked link sR8r9FtzNmc2KlFhwGSP () from http://pifr-mysql/checkout/?q=messagesBrowserprivatemsg.test329PrivatemsgTestCase->testWriteReplyPrivatemsg()
Found formatted message body.Otherprivatemsg.test330PrivatemsgTestCase->testWriteReplyPrivatemsg()
Failed to set field body[value] to yQZFL8MIYGGnwSghYBY7PwNrqgsKUcbcLCsY90fcWO3Tra5tKPgd8DDGKU2B6ohfxnS3mzLXaGuiTWxqH5G4L6Z3XgfIAHU1BNS5<b>formatted message #2</b>Otherprivatemsg.test332PrivatemsgTestCase->testWriteReplyPrivatemsg()
Found the Send message buttonOtherprivatemsg.test332PrivatemsgTestCase->testWriteReplyPrivatemsg()
Found the requested form fields at Otherprivatemsg.test332PrivatemsgTestCase->testWriteReplyPrivatemsg()
New reply body displayed.Otherprivatemsg.test334PrivatemsgTestCase->testWriteReplyPrivatemsg()
Sent message subject found.Otherprivatemsg.test341PrivatemsgTestCase->testWriteReplyPrivatemsg()
Sent message subject found.Otherprivatemsg.test342PrivatemsgTestCase->testWriteReplyPrivatemsg()
Sent message subject found.Otherprivatemsg.test343PrivatemsgTestCase->testWriteReplyPrivatemsg()
Sent message subject found.Otherprivatemsg.test344PrivatemsgTestCase->testWriteReplyPrivatemsg()
Sent message subject found.Otherprivatemsg.test345PrivatemsgTestCase->testWriteReplyPrivatemsg()
Undefined variable: url_targetNoticedrupal_web_test_case.php2318DrupalWebTestCase->clickLink()
Clicked link v6JQYAtlTeLXPhFk48SY () from http://pifr-mysql/checkout/?q=messagesBrowserprivatemsg.test352PrivatemsgTestCase->testWriteReplyPrivatemsg()
Found message body.Otherprivatemsg.test354PrivatemsgTestCase->testWriteReplyPrivatemsg()
Trying to get property of non-objectNoticeprivatemsg.test358PrivatemsgTestCase->testWriteReplyPrivatemsg()
"Between you and " foundOtherprivatemsg.test358PrivatemsgTestCase->testWriteReplyPrivatemsg()
Undefined variable: url_targetNoticedrupal_web_test_case.php2318DrupalWebTestCase->clickLink()
Clicked link rZ9YP2hL0oXJSnsQSrY8 () from http://pifr-mysql/checkout/?q=messagesBrowserprivatemsg.test362PrivatemsgTestCase->testWriteReplyPrivatemsg()
Found message body.Otherprivatemsg.test364PrivatemsgTestCase->testWriteReplyPrivatemsg()
Found reply body.Otherprivatemsg.test366PrivatemsgTestCase->testWriteReplyPrivatemsg()
ExpandPrivatemsg Roles functionality (PrivatemsgRolesTestCase) [Privatemsg]6789931
MessageGroupFilenameLineFunctionStatus
PDOException: %message in _privatemsg_send() (line 1787 of /var/lib/drupaltestbot/sites/default/files/checkout/sites/default/modules/privatemsg/privatemsg.module).Uncaught exceptiondatabase.inc1970PDOStatement->execute()
PDOException: %message in _privatemsg_send() (line 1787 of /var/lib/drupaltestbot/sites/default/files/checkout/sites/default/modules/privatemsg/privatemsg.module).Uncaught exceptiondatabase.inc1970PDOStatement->execute()
"A message has been sent to nWg2JsEv (role)." foundOtherprivatemsg_roles.test122PrivatemsgRolesTestCase->testSendMessagetoRoleBatch()
Message is displayed as newOtherprivatemsg_roles.test128PrivatemsgRolesTestCase->testSendMessagetoRoleBatch()
Undefined variable: url_targetNoticedrupal_web_test_case.php2318DrupalWebTestCase->clickLink()
Clicked link zmvUpfIEEx () from http://pifr-mysql/checkout/?q=messagesBrowserprivatemsg_roles.test130PrivatemsgRolesTestCase->testSendMessagetoRoleBatch()
Thread starter body displayed.Otherprivatemsg_roles.test131PrivatemsgRolesTestCase->testSendMessagetoRoleBatch()
Message is displayed as newOtherprivatemsg_roles.test128PrivatemsgRolesTestCase->testSendMessagetoRoleBatch()
Undefined variable: url_targetNoticedrupal_web_test_case.php2318DrupalWebTestCase->clickLink()
Clicked link zmvUpfIEEx () from http://pifr-mysql/checkout/?q=messagesBrowserprivatemsg_roles.test130PrivatemsgRolesTestCase->testSendMessagetoRoleBatch()
Thread starter body displayed.Otherprivatemsg_roles.test131PrivatemsgRolesTestCase->testSendMessagetoRoleBatch()
Message is displayed as newOtherprivatemsg_roles.test128PrivatemsgRolesTestCase->testSendMessagetoRoleBatch()
Undefined variable: url_targetNoticedrupal_web_test_case.php2318DrupalWebTestCase->clickLink()
Clicked link zmvUpfIEEx () from http://pifr-mysql/checkout/?q=messagesBrowserprivatemsg_roles.test130PrivatemsgRolesTestCase->testSendMessagetoRoleBatch()
Thread starter body displayed.Otherprivatemsg_roles.test131PrivatemsgRolesTestCase->testSendMessagetoRoleBatch()
Message is displayed as newOtherprivatemsg_roles.test128PrivatemsgRolesTestCase->testSendMessagetoRoleBatch()
Undefined variable: url_targetNoticedrupal_web_test_case.php2318DrupalWebTestCase->clickLink()
Clicked link zmvUpfIEEx () from http://pifr-mysql/checkout/?q=messagesBrowserprivatemsg_roles.test130PrivatemsgRolesTestCase->testSendMessagetoRoleBatch()
Thread starter body displayed.Otherprivatemsg_roles.test131PrivatemsgRolesTestCase->testSendMessagetoRoleBatch()
Message is displayed as newOtherprivatemsg_roles.test128PrivatemsgRolesTestCase->testSendMessagetoRoleBatch()
Undefined variable: url_targetNoticedrupal_web_test_case.php2318DrupalWebTestCase->clickLink()
Clicked link zmvUpfIEEx () from http://pifr-mysql/checkout/?q=messagesBrowserprivatemsg_roles.test130PrivatemsgRolesTestCase->testSendMessagetoRoleBatch()
Thread starter body displayed.Otherprivatemsg_roles.test131PrivatemsgRolesTestCase->testSendMessagetoRoleBatch()
Message is displayed as newOtherprivatemsg_roles.test128PrivatemsgRolesTestCase->testSendMessagetoRoleBatch()
Undefined variable: url_targetNoticedrupal_web_test_case.php2318DrupalWebTestCase->clickLink()
Clicked link zmvUpfIEEx () from http://pifr-mysql/checkout/?q=messagesBrowserprivatemsg_roles.test130PrivatemsgRolesTestCase->testSendMessagetoRoleBatch()
Thread starter body displayed.Otherprivatemsg_roles.test131PrivatemsgRolesTestCase->testSendMessagetoRoleBatch()
Message is displayed as newOtherprivatemsg_roles.test128PrivatemsgRolesTestCase->testSendMessagetoRoleBatch()
Undefined variable: url_targetNoticedrupal_web_test_case.php2318DrupalWebTestCase->clickLink()
Clicked link zmvUpfIEEx () from http://pifr-mysql/checkout/?q=messagesBrowserprivatemsg_roles.test130PrivatemsgRolesTestCase->testSendMessagetoRoleBatch()
Thread starter body displayed.Otherprivatemsg_roles.test131PrivatemsgRolesTestCase->testSendMessagetoRoleBatch()
Message is displayed as newOtherprivatemsg_roles.test128PrivatemsgRolesTestCase->testSendMessagetoRoleBatch()
Undefined variable: url_targetNoticedrupal_web_test_case.php2318DrupalWebTestCase->clickLink()
Clicked link zmvUpfIEEx () from http://pifr-mysql/checkout/?q=messagesBrowserprivatemsg_roles.test130PrivatemsgRolesTestCase->testSendMessagetoRoleBatch()
Thread starter body displayed.Otherprivatemsg_roles.test131PrivatemsgRolesTestCase->testSendMessagetoRoleBatch()
Message is displayed as newOtherprivatemsg_roles.test128PrivatemsgRolesTestCase->testSendMessagetoRoleBatch()
Undefined variable: url_targetNoticedrupal_web_test_case.php2318DrupalWebTestCase->clickLink()
Clicked link zmvUpfIEEx () from http://pifr-mysql/checkout/?q=messagesBrowserprivatemsg_roles.test130PrivatemsgRolesTestCase->testSendMessagetoRoleBatch()
Thread starter body displayed.Otherprivatemsg_roles.test131PrivatemsgRolesTestCase->testSendMessagetoRoleBatch()
Message is displayed as newOtherprivatemsg_roles.test128PrivatemsgRolesTestCase->testSendMessagetoRoleBatch()
Undefined variable: url_targetNoticedrupal_web_test_case.php2318DrupalWebTestCase->clickLink()
Clicked link zmvUpfIEEx () from http://pifr-mysql/checkout/?q=messagesBrowserprivatemsg_roles.test130PrivatemsgRolesTestCase->testSendMessagetoRoleBatch()
Thread starter body displayed.Otherprivatemsg_roles.test131PrivatemsgRolesTestCase->testSendMessagetoRoleBatch()
Message is displayed as newOtherprivatemsg_roles.test128PrivatemsgRolesTestCase->testSendMessagetoRoleBatch()
Undefined variable: url_targetNoticedrupal_web_test_case.php2318DrupalWebTestCase->clickLink()
Clicked link zmvUpfIEEx () from http://pifr-mysql/checkout/?q=messagesBrowserprivatemsg_roles.test130PrivatemsgRolesTestCase->testSendMessagetoRoleBatch()
Thread starter body displayed.Otherprivatemsg_roles.test131PrivatemsgRolesTestCase->testSendMessagetoRoleBatch()
Message is displayed as newOtherprivatemsg_roles.test128PrivatemsgRolesTestCase->testSendMessagetoRoleBatch()
Undefined variable: url_targetNoticedrupal_web_test_case.php2318DrupalWebTestCase->clickLink()
Clicked link zmvUpfIEEx () from http://pifr-mysql/checkout/?q=messagesBrowserprivatemsg_roles.test130PrivatemsgRolesTestCase->testSendMessagetoRoleBatch()
Thread starter body displayed.Otherprivatemsg_roles.test131PrivatemsgRolesTestCase->testSendMessagetoRoleBatch()
Message is displayed as newOtherprivatemsg_roles.test128PrivatemsgRolesTestCase->testSendMessagetoRoleBatch()
Undefined variable: url_targetNoticedrupal_web_test_case.php2318DrupalWebTestCase->clickLink()
Clicked link zmvUpfIEEx () from http://pifr-mysql/checkout/?q=messagesBrowserprivatemsg_roles.test130PrivatemsgRolesTestCase->testSendMessagetoRoleBatch()
Thread starter body displayed.Otherprivatemsg_roles.test131PrivatemsgRolesTestCase->testSendMessagetoRoleBatch()
Message is displayed as newOtherprivatemsg_roles.test128PrivatemsgRolesTestCase->testSendMessagetoRoleBatch()
Undefined variable: url_targetNoticedrupal_web_test_case.php2318DrupalWebTestCase->clickLink()
Clicked link zmvUpfIEEx () from http://pifr-mysql/checkout/?q=messagesBrowserprivatemsg_roles.test130PrivatemsgRolesTestCase->testSendMessagetoRoleBatch()
Thread starter body displayed.Otherprivatemsg_roles.test131PrivatemsgRolesTestCase->testSendMessagetoRoleBatch()
Message is displayed as newOtherprivatemsg_roles.test128PrivatemsgRolesTestCase->testSendMessagetoRoleBatch()
Undefined variable: url_targetNoticedrupal_web_test_case.php2318DrupalWebTestCase->clickLink()
Clicked link zmvUpfIEEx () from http://pifr-mysql/checkout/?q=messagesBrowserprivatemsg_roles.test130PrivatemsgRolesTestCase->testSendMessagetoRoleBatch()
Thread starter body displayed.Otherprivatemsg_roles.test131PrivatemsgRolesTestCase->testSendMessagetoRoleBatch()
Message is displayed as newOtherprivatemsg_roles.test128PrivatemsgRolesTestCase->testSendMessagetoRoleBatch()
Undefined variable: url_targetNoticedrupal_web_test_case.php2318DrupalWebTestCase->clickLink()
Clicked link zmvUpfIEEx () from http://pifr-mysql/checkout/?q=messagesBrowserprivatemsg_roles.test130PrivatemsgRolesTestCase->testSendMessagetoRoleBatch()
Thread starter body displayed.Otherprivatemsg_roles.test131PrivatemsgRolesTestCase->testSendMessagetoRoleBatch()
Message is displayed as newOtherprivatemsg_roles.test128PrivatemsgRolesTestCase->testSendMessagetoRoleBatch()
Undefined variable: url_targetNoticedrupal_web_test_case.php2318DrupalWebTestCase->clickLink()
Clicked link zmvUpfIEEx () from http://pifr-mysql/checkout/?q=messagesBrowserprivatemsg_roles.test130PrivatemsgRolesTestCase->testSendMessagetoRoleBatch()
Thread starter body displayed.Otherprivatemsg_roles.test131PrivatemsgRolesTestCase->testSendMessagetoRoleBatch()
Message is displayed as newOtherprivatemsg_roles.test128PrivatemsgRolesTestCase->testSendMessagetoRoleBatch()
Undefined variable: url_targetNoticedrupal_web_test_case.php2318DrupalWebTestCase->clickLink()
Clicked link zmvUpfIEEx () from http://pifr-mysql/checkout/?q=messagesBrowserprivatemsg_roles.test130PrivatemsgRolesTestCase->testSendMessagetoRoleBatch()
Thread starter body displayed.Otherprivatemsg_roles.test131PrivatemsgRolesTestCase->testSendMessagetoRoleBatch()
Message is displayed as newOtherprivatemsg_roles.test128PrivatemsgRolesTestCase->testSendMessagetoRoleBatch()
Undefined variable: url_targetNoticedrupal_web_test_case.php2318DrupalWebTestCase->clickLink()
Clicked link zmvUpfIEEx () from http://pifr-mysql/checkout/?q=messagesBrowserprivatemsg_roles.test130PrivatemsgRolesTestCase->testSendMessagetoRoleBatch()
Thread starter body displayed.Otherprivatemsg_roles.test131PrivatemsgRolesTestCase->testSendMessagetoRoleBatch()
Message is displayed as newOtherprivatemsg_roles.test128PrivatemsgRolesTestCase->testSendMessagetoRoleBatch()
Undefined variable: url_targetNoticedrupal_web_test_case.php2318DrupalWebTestCase->clickLink()
Clicked link zmvUpfIEEx () from http://pifr-mysql/checkout/?q=messagesBrowserprivatemsg_roles.test130PrivatemsgRolesTestCase->testSendMessagetoRoleBatch()
Thread starter body displayed.Otherprivatemsg_roles.test131PrivatemsgRolesTestCase->testSendMessagetoRoleBatch()
Message is displayed as newOtherprivatemsg_roles.test128PrivatemsgRolesTestCase->testSendMessagetoRoleBatch()
Undefined variable: url_targetNoticedrupal_web_test_case.php2318DrupalWebTestCase->clickLink()
Clicked link zmvUpfIEEx () from http://pifr-mysql/checkout/?q=messagesBrowserprivatemsg_roles.test130PrivatemsgRolesTestCase->testSendMessagetoRoleBatch()
Thread starter body displayed.Otherprivatemsg_roles.test131PrivatemsgRolesTestCase->testSendMessagetoRoleBatch()
Message is displayed as newOtherprivatemsg_roles.test128PrivatemsgRolesTestCase->testSendMessagetoRoleBatch()
Undefined variable: url_targetNoticedrupal_web_test_case.php2318DrupalWebTestCase->clickLink()
Clicked link zmvUpfIEEx () from http://pifr-mysql/checkout/?q=messagesBrowserprivatemsg_roles.test130PrivatemsgRolesTestCase->testSendMessagetoRoleBatch()
Thread starter body displayed.Otherprivatemsg_roles.test131PrivatemsgRolesTestCase->testSendMessagetoRoleBatch()
Message is displayed as newOtherprivatemsg_roles.test128PrivatemsgRolesTestCase->testSendMessagetoRoleBatch()
Undefined variable: url_targetNoticedrupal_web_test_case.php2318DrupalWebTestCase->clickLink()
Clicked link zmvUpfIEEx () from http://pifr-mysql/checkout/?q=messagesBrowserprivatemsg_roles.test130PrivatemsgRolesTestCase->testSendMessagetoRoleBatch()
Thread starter body displayed.Otherprivatemsg_roles.test131PrivatemsgRolesTestCase->testSendMessagetoRoleBatch()
Message is displayed as newOtherprivatemsg_roles.test128PrivatemsgRolesTestCase->testSendMessagetoRoleBatch()
Undefined variable: url_targetNoticedrupal_web_test_case.php2318DrupalWebTestCase->clickLink()
Clicked link zmvUpfIEEx () from http://pifr-mysql/checkout/?q=messagesBrowserprivatemsg_roles.test130PrivatemsgRolesTestCase->testSendMessagetoRoleBatch()
Thread starter body displayed.Otherprivatemsg_roles.test131PrivatemsgRolesTestCase->testSendMessagetoRoleBatch()
Message is displayed as newOtherprivatemsg_roles.test128PrivatemsgRolesTestCase->testSendMessagetoRoleBatch()
Undefined variable: url_targetNoticedrupal_web_test_case.php2318DrupalWebTestCase->clickLink()
Clicked link zmvUpfIEEx () from http://pifr-mysql/checkout/?q=messagesBrowserprivatemsg_roles.test130PrivatemsgRolesTestCase->testSendMessagetoRoleBatch()
Thread starter body displayed.Otherprivatemsg_roles.test131PrivatemsgRolesTestCase->testSendMessagetoRoleBatch()
"A message has been sent to w34hcuch (role)." foundOtherprivatemsg_roles.test175PrivatemsgRolesTestCase->testSendMessageToRole()
Message is displayed as newOtherprivatemsg_roles.test181PrivatemsgRolesTestCase->testSendMessageToRole()
Undefined variable: url_targetNoticedrupal_web_test_case.php2318DrupalWebTestCase->clickLink()
Clicked link jqC5gTGLJN () from http://pifr-mysql/checkout/?q=messagesBrowserprivatemsg_roles.test183PrivatemsgRolesTestCase->testSendMessageToRole()
Thread starter body displayed.Otherprivatemsg_roles.test184PrivatemsgRolesTestCase->testSendMessageToRole()
Failed to set field body[value] to mpn2sWt2k0ZHRp8ePWJb1PAt52HeO85wHILK7e9iJ1HnDtiellOtherprivatemsg_roles.test193PrivatemsgRolesTestCase->testSendMessageToRole()
Found the Send message buttonOtherprivatemsg_roles.test193PrivatemsgRolesTestCase->testSendMessageToRole()
Found the requested form fields at Otherprivatemsg_roles.test193PrivatemsgRolesTestCase->testSendMessageToRole()
Message is displayed as newOtherprivatemsg_roles.test201PrivatemsgRolesTestCase->testSendMessageToRole()
Undefined variable: url_targetNoticedrupal_web_test_case.php2318DrupalWebTestCase->clickLink()
Clicked link jqC5gTGLJN () from http://pifr-mysql/checkout/?q=messagesBrowserprivatemsg_roles.test202PrivatemsgRolesTestCase->testSendMessageToRole()
Reply1 is displayedOtherprivatemsg_roles.test204PrivatemsgRolesTestCase->testSendMessageToRole()
Failed to set field body[value] to zts4eXhTd1PhrxzbyNqFeEDWhH722At3FTjEdUcoWrfoq6J19mOtherprivatemsg_roles.test210PrivatemsgRolesTestCase->testSendMessageToRole()
Found the Send message buttonOtherprivatemsg_roles.test210PrivatemsgRolesTestCase->testSendMessageToRole()
Found the requested form fields at Otherprivatemsg_roles.test210PrivatemsgRolesTestCase->testSendMessageToRole()
Message is displayed as newOtherprivatemsg_roles.test215PrivatemsgRolesTestCase->testSendMessageToRole()
Undefined variable: url_targetNoticedrupal_web_test_case.php2318DrupalWebTestCase->clickLink()
Clicked link jqC5gTGLJN () from http://pifr-mysql/checkout/?q=messagesBrowserprivatemsg_roles.test216PrivatemsgRolesTestCase->testSendMessageToRole()
"w34hcuch (role)" foundOtherprivatemsg_roles.test217PrivatemsgRolesTestCase->testSendMessageToRole()
Thread starter body is displayedOtherprivatemsg_roles.test219PrivatemsgRolesTestCase->testSendMessageToRole()
Reply2 is displayedOtherprivatemsg_roles.test221PrivatemsgRolesTestCase->testSendMessageToRole()
"A message has been sent to zy8cFB3A (role)." foundOtherprivatemsg_roles.test246PrivatemsgRolesTestCase->testSendMessageToRoleBlocked()
Message is displayed as newOtherprivatemsg_roles.test252PrivatemsgRolesTestCase->testSendMessageToRoleBlocked()
Undefined variable: url_targetNoticedrupal_web_test_case.php2318DrupalWebTestCase->clickLink()
Clicked link atxA4L5TGL () from http://pifr-mysql/checkout/?q=messagesBrowserprivatemsg_roles.test254PrivatemsgRolesTestCase->testSendMessageToRoleBlocked()
Thread starter body displayed.Otherprivatemsg_roles.test255PrivatemsgRolesTestCase->testSendMessageToRoleBlocked()
"A message has been sent to oFnPZ1lc (role)." foundOtherprivatemsg_roles.test279PrivatemsgRolesTestCase->testNewUser()
ExpandPrivatemsg Tags functionality. (PrivatemsgTagsTestCase) [Privatemsg]9303
MessageGroupFilenameLineFunctionStatus
PDOException: %message in _privatemsg_send() (line 1787 of /var/lib/drupaltestbot/sites/default/files/checkout/sites/default/modules/privatemsg/privatemsg.module).Uncaught exceptiondatabase.inc1970PDOStatement->execute()
PDOException: %message in _privatemsg_send() (line 1787 of /var/lib/drupaltestbot/sites/default/files/checkout/sites/default/modules/privatemsg/privatemsg.module).Uncaught exceptiondatabase.inc1970PDOStatement->execute()
PDOException: %message in _privatemsg_send() (line 1787 of /var/lib/drupaltestbot/sites/default/files/checkout/sites/default/modules/privatemsg/privatemsg.module).Uncaught exceptiondatabase.inc1970PDOStatement->execute()
ExpandUser blocking functionality. (PrivatemsgBlockUserCase) [Privatemsg]901
MessageGroupFilenameLineFunctionStatus
PDOException: %message in _privatemsg_send() (line 1787 of /var/lib/drupaltestbot/sites/default/files/checkout/sites/default/modules/privatemsg/privatemsg.module).Uncaught exceptiondatabase.inc1970PDOStatement->execute()

All

Test namePassFailException
ExpandPrivatemsg API functionality. (PrivatemsgAPITestCase) [Privatemsg]2402
MessageGroupFilenameLineFunctionStatus
PDOException: %message in _privatemsg_send() (line 1787 of /var/lib/drupaltestbot/sites/default/files/checkout/sites/default/modules/privatemsg/privatemsg.module).Uncaught exceptiondatabase.inc1970PDOStatement->execute()
PDOException: %message in _privatemsg_send() (line 1787 of /var/lib/drupaltestbot/sites/default/files/checkout/sites/default/modules/privatemsg/privatemsg.module).Uncaught exceptiondatabase.inc1970PDOStatement->execute()
ExpandPrivatemsg Filter functionality. (PrivatemsgFilterTestCase) [Privatemsg]85262
MessageGroupFilenameLineFunctionStatus
Message sent confirmation displayedOtherprivatemsg_filter.test39PrivatemsgFilterTestCase->testInboxSentHandling()
Thread displayed in "Sent messages" for author.Otherprivatemsg_filter.test46PrivatemsgFilterTestCase->testInboxSentHandling()
Thread displayed in "All messages" for author.Otherprivatemsg_filter.test48PrivatemsgFilterTestCase->testInboxSentHandling()
Thread displayed in inbox for recipient.Otherprivatemsg_filter.test53PrivatemsgFilterTestCase->testInboxSentHandling()
Thread displayed in "All messages." for recipient.Otherprivatemsg_filter.test57PrivatemsgFilterTestCase->testInboxSentHandling()
Undefined variable: url_targetNoticedrupal_web_test_case.php2318DrupalWebTestCase->clickLink()
Clicked link qmYgJNE3m3t6rAUx43vI () from http://pifr-mysql/checkout/?q=messages/listBrowserprivatemsg_filter.test60PrivatemsgFilterTestCase->testInboxSentHandling()
Failed to set field body[value] to e6xOoZnIv1nX0hTAlujtG8L7jNdAqSSJABRwbKDco3HiuWbh4VLSmm0mUGqf3ZSHwRYw88nJKnJhOySbXW2sEzfWEYaWH3ZPXSLbOtherprivatemsg_filter.test64PrivatemsgFilterTestCase->testInboxSentHandling()
Found the Send message buttonOtherprivatemsg_filter.test64PrivatemsgFilterTestCase->testInboxSentHandling()
Found the requested form fields at Otherprivatemsg_filter.test64PrivatemsgFilterTestCase->testInboxSentHandling()
Message sent confirmation displayedOtherprivatemsg_filter.test65PrivatemsgFilterTestCase->testInboxSentHandling()
Thread displayed in "Sent messages" for recipient.Otherprivatemsg_filter.test68PrivatemsgFilterTestCase->testInboxSentHandling()
Thread displayed in inbox for author.Otherprivatemsg_filter.test72PrivatemsgFilterTestCase->testInboxSentHandling()
Failed to set field list[1] to 1Otherprivatemsg_filter.test79PrivatemsgFilterTestCase->testInboxSentHandling()
Found the Delete buttonOtherprivatemsg_filter.test79PrivatemsgFilterTestCase->testInboxSentHandling()
Found the requested form fields at Otherprivatemsg_filter.test79PrivatemsgFilterTestCase->testInboxSentHandling()
Undefined variable: url_targetNoticedrupal_web_test_case.php2318DrupalWebTestCase->clickLink()
Clicked link qmYgJNE3m3t6rAUx43vI () from http://pifr-mysql/checkout/?q=messagesBrowserprivatemsg_filter.test87PrivatemsgFilterTestCase->testInboxSentHandling()
Failed to set field body[value] to yeMa26uNQ7FV2PLsfNqT3k8us4xd2zWbOIgB0t9C7MiBVH2y4DqSc8hMYQrhnr4isUz8v3um9SRyvq4OyWH3s4bwpx6wOfTVPhzkOtherprivatemsg_filter.test91PrivatemsgFilterTestCase->testInboxSentHandling()
Found the Send message buttonOtherprivatemsg_filter.test91PrivatemsgFilterTestCase->testInboxSentHandling()
Found the requested form fields at Otherprivatemsg_filter.test91PrivatemsgFilterTestCase->testInboxSentHandling()
Message sent confirmation displayedOtherprivatemsg_filter.test92PrivatemsgFilterTestCase->testInboxSentHandling()
Thread displayed again in inbox for author.Otherprivatemsg_filter.test97PrivatemsgFilterTestCase->testInboxSentHandling()
Failed to set field list[1] to 1Otherprivatemsg_filter.test104PrivatemsgFilterTestCase->testInboxSentHandling()
Found the Archive buttonOtherprivatemsg_filter.test104PrivatemsgFilterTestCase->testInboxSentHandling()
Found the requested form fields at Otherprivatemsg_filter.test104PrivatemsgFilterTestCase->testInboxSentHandling()
Confirmation message displayedOtherprivatemsg_filter.test105PrivatemsgFilterTestCase->testInboxSentHandling()
Thread still displayed in "All messages" list.Otherprivatemsg_filter.test109PrivatemsgFilterTestCase->testInboxSentHandling()
ExpandPrivatemsg filter widget (PrivatemsgFilterWidgetTestCase) [Privatemsg]1701
MessageGroupFilenameLineFunctionStatus
PDOException: %message in _privatemsg_send() (line 1787 of /var/lib/drupaltestbot/sites/default/files/checkout/sites/default/modules/privatemsg/privatemsg.module).Uncaught exceptiondatabase.inc1970PDOStatement->execute()
ExpandPrivatemsg functionality. (PrivatemsgTestCase) [Privatemsg]58909
MessageGroupFilenameLineFunctionStatus
Invalid permission .Roleprivatemsg.test204PrivatemsgTestCase->testWriteReplyPrivatemsg()
Argument 1 passed to DrupalWebTestCase::drupalLogin() must be an instance of stdClass, boolean given, called in /var/lib/drupaltestbot/sites/default/files/checkout/sites/default/modules/privatemsg/privatemsg.test on line 209 and definedRecoverable errordrupal_web_test_case.php1112DrupalWebTestCase->drupalLogin()
Trying to get property of non-objectNoticedrupal_web_test_case.php1118DrupalWebTestCase->drupalLogin()
Trying to get property of non-objectNoticedrupal_web_test_case.php1119DrupalWebTestCase->drupalLogin()
Failed to set field name to Otherprivatemsg.test209PrivatemsgTestCase->testWriteReplyPrivatemsg()
Failed to set field pass to Otherprivatemsg.test209PrivatemsgTestCase->testWriteReplyPrivatemsg()
Found the requested form fields at userOtherprivatemsg.test209PrivatemsgTestCase->testWriteReplyPrivatemsg()
Trying to get property of non-objectNoticedrupal_web_test_case.php1125DrupalWebTestCase->drupalLogin()
User successfully logged in.User loginprivatemsg.test209PrivatemsgTestCase->testWriteReplyPrivatemsg()
Failed to set field recipient to wmqeWUBW [user]Otherprivatemsg.test270PrivatemsgTestCase->testWriteReplyPrivatemsg()
Failed to set field subject to v6JQYAtlTeLXPhFk48SYOtherprivatemsg.test270PrivatemsgTestCase->testWriteReplyPrivatemsg()
Failed to set field body[value] to ow12hqFagZeWQdoyaUQCISkN1anTbyM7heAQG38iacnvT949n2v8vuce6cmh6kS2VLv9tPwamqI3yY5P0RvmxILfB43YEvLuMx4yOtherprivatemsg.test270PrivatemsgTestCase->testWriteReplyPrivatemsg()
Found the Send message buttonOtherprivatemsg.test270PrivatemsgTestCase->testWriteReplyPrivatemsg()
Found the requested form fields at messages/newOtherprivatemsg.test270PrivatemsgTestCase->testWriteReplyPrivatemsg()
Message sent confirmation displayed.Otherprivatemsg.test271PrivatemsgTestCase->testWriteReplyPrivatemsg()
Failed to set field recipient to wmqeWUBW, gjPWkkcTOtherprivatemsg.test273PrivatemsgTestCase->testWriteReplyPrivatemsg()
Failed to set field subject to rZ9YP2hL0oXJSnsQSrY8Otherprivatemsg.test273PrivatemsgTestCase->testWriteReplyPrivatemsg()
Failed to set field body[value] to rIQfTmtTNoONtt8q245Rjb9CoKt89RcmZD7M2qaRwCOWrdmOgFqRw1kWOB5vPNbyacKC7pmvVoJEmai3j2iziybOG9jnQuVo4SGvOtherprivatemsg.test273PrivatemsgTestCase->testWriteReplyPrivatemsg()
Found the Send message buttonOtherprivatemsg.test273PrivatemsgTestCase->testWriteReplyPrivatemsg()
Found the requested form fields at messages/newOtherprivatemsg.test273PrivatemsgTestCase->testWriteReplyPrivatemsg()
Message sent confirmation displayed.Otherprivatemsg.test274PrivatemsgTestCase->testWriteReplyPrivatemsg()
Failed to set field recipient to Otherprivatemsg.test276PrivatemsgTestCase->testWriteReplyPrivatemsg()
Failed to set field subject to qVvZ5xV1FB3NkeBykSJNOtherprivatemsg.test276PrivatemsgTestCase->testWriteReplyPrivatemsg()
Failed to set field body[value] to kYBadVFBMOwv7WhETA9qc2DuHuIzn8l0st6XctDkPII6UdC7Oypb5gpiPAEcRnZYg8TMIdRozM7slt3RAjBCCh3NpnXTxcl8IvfAOtherprivatemsg.test276PrivatemsgTestCase->testWriteReplyPrivatemsg()
Found the Send message buttonOtherprivatemsg.test276PrivatemsgTestCase->testWriteReplyPrivatemsg()
Found the requested form fields at messages/newOtherprivatemsg.test276PrivatemsgTestCase->testWriteReplyPrivatemsg()
Message was not sent.Otherprivatemsg.test277PrivatemsgTestCase->testWriteReplyPrivatemsg()
Failed to set field recipient to rektgOtherprivatemsg.test279PrivatemsgTestCase->testWriteReplyPrivatemsg()
Failed to set field subject to lCoOhLAQSrJ72J5En5RUOtherprivatemsg.test279PrivatemsgTestCase->testWriteReplyPrivatemsg()
Failed to set field body[value] to kAJEMK6q4EfqVkd3s43QmpQoG6rgnY5JMO9d0waDD8fdxMFyBhNCCxs8d8J8Zaf6b8Z2VTDOl2tejxjqvG2EBDSOdKHgCmzYcG2nOtherprivatemsg.test279PrivatemsgTestCase->testWriteReplyPrivatemsg()
Found the Send message buttonOtherprivatemsg.test279PrivatemsgTestCase->testWriteReplyPrivatemsg()
Found the requested form fields at messages/newOtherprivatemsg.test279PrivatemsgTestCase->testWriteReplyPrivatemsg()
Message was not sent.Otherprivatemsg.test280PrivatemsgTestCase->testWriteReplyPrivatemsg()
Message about non-existing user displayed.Otherprivatemsg.test281PrivatemsgTestCase->testWriteReplyPrivatemsg()
Failed to set field recipient to wmqeWUBWOtherprivatemsg.test283PrivatemsgTestCase->testWriteReplyPrivatemsg()
Failed to set field subject to w53JE8qqkBNXaL6xixfcOtherprivatemsg.test283PrivatemsgTestCase->testWriteReplyPrivatemsg()
Failed to set field body[value] to Otherprivatemsg.test283PrivatemsgTestCase->testWriteReplyPrivatemsg()
Found the Send message buttonOtherprivatemsg.test283PrivatemsgTestCase->testWriteReplyPrivatemsg()
Found the requested form fields at messages/newOtherprivatemsg.test283PrivatemsgTestCase->testWriteReplyPrivatemsg()
Message sent confirmation displayed.Otherprivatemsg.test284PrivatemsgTestCase->testWriteReplyPrivatemsg()
Failed to set field recipient to wmqeWUBWOtherprivatemsg.test286PrivatemsgTestCase->testWriteReplyPrivatemsg()
Failed to set field subject to Otherprivatemsg.test286PrivatemsgTestCase->testWriteReplyPrivatemsg()
Failed to set field body[value] to pHhMhix4paXsmotflczTTlybmgUa9ZI0sWXMaJXQN94ZNkmiBQbQ78pTbuW0cjme2yfuq8khYdgxtmFRqUlss0vB3zJeqlwFSrQZOtherprivatemsg.test286PrivatemsgTestCase->testWriteReplyPrivatemsg()
Found the Send message buttonOtherprivatemsg.test286PrivatemsgTestCase->testWriteReplyPrivatemsg()
Found the requested form fields at messages/newOtherprivatemsg.test286PrivatemsgTestCase->testWriteReplyPrivatemsg()
Message sent confirmation displayed.Otherprivatemsg.test287PrivatemsgTestCase->testWriteReplyPrivatemsg()
Failed to set field recipient to wmqeWUBWOtherprivatemsg.test289PrivatemsgTestCase->testWriteReplyPrivatemsg()
Failed to set field subject to Otherprivatemsg.test289PrivatemsgTestCase->testWriteReplyPrivatemsg()
Failed to set field body[value] to Otherprivatemsg.test289PrivatemsgTestCase->testWriteReplyPrivatemsg()
Found the Send message buttonOtherprivatemsg.test289PrivatemsgTestCase->testWriteReplyPrivatemsg()
Found the requested form fields at messages/newOtherprivatemsg.test289PrivatemsgTestCase->testWriteReplyPrivatemsg()
Empty subject message displayed.Otherprivatemsg.test290PrivatemsgTestCase->testWriteReplyPrivatemsg()
Failed to set field recipient to hcGcz, wmqeWUBWOtherprivatemsg.test292PrivatemsgTestCase->testWriteReplyPrivatemsg()
Failed to set field subject to u3z9jBF2JnjxQ8EM3sajOtherprivatemsg.test292PrivatemsgTestCase->testWriteReplyPrivatemsg()
Failed to set field body[value] to p9iy4ZnjamBDzcP5DIfCRkWsVB2YRV6ICsk2ZTvaEUlcDq1QMTss6FQCGztf3wiVclwY3aqEfOS11ID5XKNxKuroKPBojdocQyc8Otherprivatemsg.test292PrivatemsgTestCase->testWriteReplyPrivatemsg()
Found the Send message buttonOtherprivatemsg.test292PrivatemsgTestCase->testWriteReplyPrivatemsg()
Found the requested form fields at messages/newOtherprivatemsg.test292PrivatemsgTestCase->testWriteReplyPrivatemsg()
Message sent confirmation displayed.Otherprivatemsg.test293PrivatemsgTestCase->testWriteReplyPrivatemsg()
Message about non-existing user displayed.Otherprivatemsg.test294PrivatemsgTestCase->testWriteReplyPrivatemsg()
Failed to set field recipient to gjPWkkcTOtherprivatemsg.test296PrivatemsgTestCase->testWriteReplyPrivatemsg()
Failed to set field subject to sR8r9FtzNmc2KlFhwGSPOtherprivatemsg.test296PrivatemsgTestCase->testWriteReplyPrivatemsg()
Failed to set field body[value] to xSGdWNxz3lCSifkQFlm3enrCyNYqTC9X6jKbdlYZGSUBKFc1vrG3HSd1l4wg4rtUFz6nAtkZ4OKrmNBoKKvDj8G1bbA4oAStjfmB<b>formatted message #1</b>Otherprivatemsg.test296PrivatemsgTestCase->testWriteReplyPrivatemsg()
Failed to set field body[format] to 3Otherprivatemsg.test296PrivatemsgTestCase->testWriteReplyPrivatemsg()
Found the Send message buttonOtherprivatemsg.test296PrivatemsgTestCase->testWriteReplyPrivatemsg()
Found the requested form fields at messages/newOtherprivatemsg.test296PrivatemsgTestCase->testWriteReplyPrivatemsg()
Message sent confirmation displayed.Otherprivatemsg.test297PrivatemsgTestCase->testWriteReplyPrivatemsg()
Sent message subject found.Otherprivatemsg.test304PrivatemsgTestCase->testWriteReplyPrivatemsg()
Undefined variable: url_targetNoticedrupal_web_test_case.php2318DrupalWebTestCase->clickLink()
Clicked link rZ9YP2hL0oXJSnsQSrY8 () from http://pifr-mysql/checkout/?q=messagesBrowserprivatemsg.test305PrivatemsgTestCase->testWriteReplyPrivatemsg()
Found message body.Otherprivatemsg.test307PrivatemsgTestCase->testWriteReplyPrivatemsg()
Failed to set field body[value] to nJ36zYB6Uj2my1QAbGCGIotofdBCxjk1uJE7pRozuIYF2bA2Tqfju3T3PCooWzhU8kBKH3Doitg4JvK0Gg8nn5f1UA5tLAiLMzEyOtherprivatemsg.test318PrivatemsgTestCase->testWriteReplyPrivatemsg()
Found the Send message buttonOtherprivatemsg.test318PrivatemsgTestCase->testWriteReplyPrivatemsg()
Found the requested form fields at Otherprivatemsg.test318PrivatemsgTestCase->testWriteReplyPrivatemsg()
New message body displayed.Otherprivatemsg.test319PrivatemsgTestCase->testWriteReplyPrivatemsg()
Failed to set field body[value] to Otherprivatemsg.test321PrivatemsgTestCase->testWriteReplyPrivatemsg()
Found the Send message buttonOtherprivatemsg.test321PrivatemsgTestCase->testWriteReplyPrivatemsg()
Found the requested form fields at Otherprivatemsg.test321PrivatemsgTestCase->testWriteReplyPrivatemsg()
"You must include a message in your reply." foundOtherprivatemsg.test322PrivatemsgTestCase->testWriteReplyPrivatemsg()
Undefined variable: url_targetNoticedrupal_web_test_case.php2318DrupalWebTestCase->clickLink()
Clicked link sR8r9FtzNmc2KlFhwGSP () from http://pifr-mysql/checkout/?q=messagesBrowserprivatemsg.test329PrivatemsgTestCase->testWriteReplyPrivatemsg()
Found formatted message body.Otherprivatemsg.test330PrivatemsgTestCase->testWriteReplyPrivatemsg()
Failed to set field body[value] to yQZFL8MIYGGnwSghYBY7PwNrqgsKUcbcLCsY90fcWO3Tra5tKPgd8DDGKU2B6ohfxnS3mzLXaGuiTWxqH5G4L6Z3XgfIAHU1BNS5<b>formatted message #2</b>Otherprivatemsg.test332PrivatemsgTestCase->testWriteReplyPrivatemsg()
Found the Send message buttonOtherprivatemsg.test332PrivatemsgTestCase->testWriteReplyPrivatemsg()
Found the requested form fields at Otherprivatemsg.test332PrivatemsgTestCase->testWriteReplyPrivatemsg()
New reply body displayed.Otherprivatemsg.test334PrivatemsgTestCase->testWriteReplyPrivatemsg()
Sent message subject found.Otherprivatemsg.test341PrivatemsgTestCase->testWriteReplyPrivatemsg()
Sent message subject found.Otherprivatemsg.test342PrivatemsgTestCase->testWriteReplyPrivatemsg()
Sent message subject found.Otherprivatemsg.test343PrivatemsgTestCase->testWriteReplyPrivatemsg()
Sent message subject found.Otherprivatemsg.test344PrivatemsgTestCase->testWriteReplyPrivatemsg()
Sent message subject found.Otherprivatemsg.test345PrivatemsgTestCase->testWriteReplyPrivatemsg()
Undefined variable: url_targetNoticedrupal_web_test_case.php2318DrupalWebTestCase->clickLink()
Clicked link v6JQYAtlTeLXPhFk48SY () from http://pifr-mysql/checkout/?q=messagesBrowserprivatemsg.test352PrivatemsgTestCase->testWriteReplyPrivatemsg()
Found message body.Otherprivatemsg.test354PrivatemsgTestCase->testWriteReplyPrivatemsg()
Trying to get property of non-objectNoticeprivatemsg.test358PrivatemsgTestCase->testWriteReplyPrivatemsg()
"Between you and " foundOtherprivatemsg.test358PrivatemsgTestCase->testWriteReplyPrivatemsg()
Undefined variable: url_targetNoticedrupal_web_test_case.php2318DrupalWebTestCase->clickLink()
Clicked link rZ9YP2hL0oXJSnsQSrY8 () from http://pifr-mysql/checkout/?q=messagesBrowserprivatemsg.test362PrivatemsgTestCase->testWriteReplyPrivatemsg()
Found message body.Otherprivatemsg.test364PrivatemsgTestCase->testWriteReplyPrivatemsg()
Found reply body.Otherprivatemsg.test366PrivatemsgTestCase->testWriteReplyPrivatemsg()
ExpandPrivatemsg Roles functionality (PrivatemsgRolesTestCase) [Privatemsg]6789931
MessageGroupFilenameLineFunctionStatus
PDOException: %message in _privatemsg_send() (line 1787 of /var/lib/drupaltestbot/sites/default/files/checkout/sites/default/modules/privatemsg/privatemsg.module).Uncaught exceptiondatabase.inc1970PDOStatement->execute()
PDOException: %message in _privatemsg_send() (line 1787 of /var/lib/drupaltestbot/sites/default/files/checkout/sites/default/modules/privatemsg/privatemsg.module).Uncaught exceptiondatabase.inc1970PDOStatement->execute()
"A message has been sent to nWg2JsEv (role)." foundOtherprivatemsg_roles.test122PrivatemsgRolesTestCase->testSendMessagetoRoleBatch()
Message is displayed as newOtherprivatemsg_roles.test128PrivatemsgRolesTestCase->testSendMessagetoRoleBatch()
Undefined variable: url_targetNoticedrupal_web_test_case.php2318DrupalWebTestCase->clickLink()
Clicked link zmvUpfIEEx () from http://pifr-mysql/checkout/?q=messagesBrowserprivatemsg_roles.test130PrivatemsgRolesTestCase->testSendMessagetoRoleBatch()
Thread starter body displayed.Otherprivatemsg_roles.test131PrivatemsgRolesTestCase->testSendMessagetoRoleBatch()
Message is displayed as newOtherprivatemsg_roles.test128PrivatemsgRolesTestCase->testSendMessagetoRoleBatch()
Undefined variable: url_targetNoticedrupal_web_test_case.php2318DrupalWebTestCase->clickLink()
Clicked link zmvUpfIEEx () from http://pifr-mysql/checkout/?q=messagesBrowserprivatemsg_roles.test130PrivatemsgRolesTestCase->testSendMessagetoRoleBatch()
Thread starter body displayed.Otherprivatemsg_roles.test131PrivatemsgRolesTestCase->testSendMessagetoRoleBatch()
Message is displayed as newOtherprivatemsg_roles.test128PrivatemsgRolesTestCase->testSendMessagetoRoleBatch()
Undefined variable: url_targetNoticedrupal_web_test_case.php2318DrupalWebTestCase->clickLink()
Clicked link zmvUpfIEEx () from http://pifr-mysql/checkout/?q=messagesBrowserprivatemsg_roles.test130PrivatemsgRolesTestCase->testSendMessagetoRoleBatch()
Thread starter body displayed.Otherprivatemsg_roles.test131PrivatemsgRolesTestCase->testSendMessagetoRoleBatch()
Message is displayed as newOtherprivatemsg_roles.test128PrivatemsgRolesTestCase->testSendMessagetoRoleBatch()
Undefined variable: url_targetNoticedrupal_web_test_case.php2318DrupalWebTestCase->clickLink()
Clicked link zmvUpfIEEx () from http://pifr-mysql/checkout/?q=messagesBrowserprivatemsg_roles.test130PrivatemsgRolesTestCase->testSendMessagetoRoleBatch()
Thread starter body displayed.Otherprivatemsg_roles.test131PrivatemsgRolesTestCase->testSendMessagetoRoleBatch()
Message is displayed as newOtherprivatemsg_roles.test128PrivatemsgRolesTestCase->testSendMessagetoRoleBatch()
Undefined variable: url_targetNoticedrupal_web_test_case.php2318DrupalWebTestCase->clickLink()
Clicked link zmvUpfIEEx () from http://pifr-mysql/checkout/?q=messagesBrowserprivatemsg_roles.test130PrivatemsgRolesTestCase->testSendMessagetoRoleBatch()
Thread starter body displayed.Otherprivatemsg_roles.test131PrivatemsgRolesTestCase->testSendMessagetoRoleBatch()
Message is displayed as newOtherprivatemsg_roles.test128PrivatemsgRolesTestCase->testSendMessagetoRoleBatch()
Undefined variable: url_targetNoticedrupal_web_test_case.php2318DrupalWebTestCase->clickLink()
Clicked link zmvUpfIEEx () from http://pifr-mysql/checkout/?q=messagesBrowserprivatemsg_roles.test130PrivatemsgRolesTestCase->testSendMessagetoRoleBatch()
Thread starter body displayed.Otherprivatemsg_roles.test131PrivatemsgRolesTestCase->testSendMessagetoRoleBatch()
Message is displayed as newOtherprivatemsg_roles.test128PrivatemsgRolesTestCase->testSendMessagetoRoleBatch()
Undefined variable: url_targetNoticedrupal_web_test_case.php2318DrupalWebTestCase->clickLink()
Clicked link zmvUpfIEEx () from http://pifr-mysql/checkout/?q=messagesBrowserprivatemsg_roles.test130PrivatemsgRolesTestCase->testSendMessagetoRoleBatch()
Thread starter body displayed.Otherprivatemsg_roles.test131PrivatemsgRolesTestCase->testSendMessagetoRoleBatch()
Message is displayed as newOtherprivatemsg_roles.test128PrivatemsgRolesTestCase->testSendMessagetoRoleBatch()
Undefined variable: url_targetNoticedrupal_web_test_case.php2318DrupalWebTestCase->clickLink()
Clicked link zmvUpfIEEx () from http://pifr-mysql/checkout/?q=messagesBrowserprivatemsg_roles.test130PrivatemsgRolesTestCase->testSendMessagetoRoleBatch()
Thread starter body displayed.Otherprivatemsg_roles.test131PrivatemsgRolesTestCase->testSendMessagetoRoleBatch()
Message is displayed as newOtherprivatemsg_roles.test128PrivatemsgRolesTestCase->testSendMessagetoRoleBatch()
Undefined variable: url_targetNoticedrupal_web_test_case.php2318DrupalWebTestCase->clickLink()
Clicked link zmvUpfIEEx () from http://pifr-mysql/checkout/?q=messagesBrowserprivatemsg_roles.test130PrivatemsgRolesTestCase->testSendMessagetoRoleBatch()
Thread starter body displayed.Otherprivatemsg_roles.test131PrivatemsgRolesTestCase->testSendMessagetoRoleBatch()
Message is displayed as newOtherprivatemsg_roles.test128PrivatemsgRolesTestCase->testSendMessagetoRoleBatch()
Undefined variable: url_targetNoticedrupal_web_test_case.php2318DrupalWebTestCase->clickLink()
Clicked link zmvUpfIEEx () from http://pifr-mysql/checkout/?q=messagesBrowserprivatemsg_roles.test130PrivatemsgRolesTestCase->testSendMessagetoRoleBatch()
Thread starter body displayed.Otherprivatemsg_roles.test131PrivatemsgRolesTestCase->testSendMessagetoRoleBatch()
Message is displayed as newOtherprivatemsg_roles.test128PrivatemsgRolesTestCase->testSendMessagetoRoleBatch()
Undefined variable: url_targetNoticedrupal_web_test_case.php2318DrupalWebTestCase->clickLink()
Clicked link zmvUpfIEEx () from http://pifr-mysql/checkout/?q=messagesBrowserprivatemsg_roles.test130PrivatemsgRolesTestCase->testSendMessagetoRoleBatch()
Thread starter body displayed.Otherprivatemsg_roles.test131PrivatemsgRolesTestCase->testSendMessagetoRoleBatch()
Message is displayed as newOtherprivatemsg_roles.test128PrivatemsgRolesTestCase->testSendMessagetoRoleBatch()
Undefined variable: url_targetNoticedrupal_web_test_case.php2318DrupalWebTestCase->clickLink()
Clicked link zmvUpfIEEx () from http://pifr-mysql/checkout/?q=messagesBrowserprivatemsg_roles.test130PrivatemsgRolesTestCase->testSendMessagetoRoleBatch()
Thread starter body displayed.Otherprivatemsg_roles.test131PrivatemsgRolesTestCase->testSendMessagetoRoleBatch()
Message is displayed as newOtherprivatemsg_roles.test128PrivatemsgRolesTestCase->testSendMessagetoRoleBatch()
Undefined variable: url_targetNoticedrupal_web_test_case.php2318DrupalWebTestCase->clickLink()
Clicked link zmvUpfIEEx () from http://pifr-mysql/checkout/?q=messagesBrowserprivatemsg_roles.test130PrivatemsgRolesTestCase->testSendMessagetoRoleBatch()
Thread starter body displayed.Otherprivatemsg_roles.test131PrivatemsgRolesTestCase->testSendMessagetoRoleBatch()
Message is displayed as newOtherprivatemsg_roles.test128PrivatemsgRolesTestCase->testSendMessagetoRoleBatch()
Undefined variable: url_targetNoticedrupal_web_test_case.php2318DrupalWebTestCase->clickLink()
Clicked link zmvUpfIEEx () from http://pifr-mysql/checkout/?q=messagesBrowserprivatemsg_roles.test130PrivatemsgRolesTestCase->testSendMessagetoRoleBatch()
Thread starter body displayed.Otherprivatemsg_roles.test131PrivatemsgRolesTestCase->testSendMessagetoRoleBatch()
Message is displayed as newOtherprivatemsg_roles.test128PrivatemsgRolesTestCase->testSendMessagetoRoleBatch()
Undefined variable: url_targetNoticedrupal_web_test_case.php2318DrupalWebTestCase->clickLink()
Clicked link zmvUpfIEEx () from http://pifr-mysql/checkout/?q=messagesBrowserprivatemsg_roles.test130PrivatemsgRolesTestCase->testSendMessagetoRoleBatch()
Thread starter body displayed.Otherprivatemsg_roles.test131PrivatemsgRolesTestCase->testSendMessagetoRoleBatch()
Message is displayed as newOtherprivatemsg_roles.test128PrivatemsgRolesTestCase->testSendMessagetoRoleBatch()
Undefined variable: url_targetNoticedrupal_web_test_case.php2318DrupalWebTestCase->clickLink()
Clicked link zmvUpfIEEx () from http://pifr-mysql/checkout/?q=messagesBrowserprivatemsg_roles.test130PrivatemsgRolesTestCase->testSendMessagetoRoleBatch()
Thread starter body displayed.Otherprivatemsg_roles.test131PrivatemsgRolesTestCase->testSendMessagetoRoleBatch()
Message is displayed as newOtherprivatemsg_roles.test128PrivatemsgRolesTestCase->testSendMessagetoRoleBatch()
Undefined variable: url_targetNoticedrupal_web_test_case.php2318DrupalWebTestCase->clickLink()
Clicked link zmvUpfIEEx () from http://pifr-mysql/checkout/?q=messagesBrowserprivatemsg_roles.test130PrivatemsgRolesTestCase->testSendMessagetoRoleBatch()
Thread starter body displayed.Otherprivatemsg_roles.test131PrivatemsgRolesTestCase->testSendMessagetoRoleBatch()
Message is displayed as newOtherprivatemsg_roles.test128PrivatemsgRolesTestCase->testSendMessagetoRoleBatch()
Undefined variable: url_targetNoticedrupal_web_test_case.php2318DrupalWebTestCase->clickLink()
Clicked link zmvUpfIEEx () from http://pifr-mysql/checkout/?q=messagesBrowserprivatemsg_roles.test130PrivatemsgRolesTestCase->testSendMessagetoRoleBatch()
Thread starter body displayed.Otherprivatemsg_roles.test131PrivatemsgRolesTestCase->testSendMessagetoRoleBatch()
Message is displayed as newOtherprivatemsg_roles.test128PrivatemsgRolesTestCase->testSendMessagetoRoleBatch()
Undefined variable: url_targetNoticedrupal_web_test_case.php2318DrupalWebTestCase->clickLink()
Clicked link zmvUpfIEEx () from http://pifr-mysql/checkout/?q=messagesBrowserprivatemsg_roles.test130PrivatemsgRolesTestCase->testSendMessagetoRoleBatch()
Thread starter body displayed.Otherprivatemsg_roles.test131PrivatemsgRolesTestCase->testSendMessagetoRoleBatch()
Message is displayed as newOtherprivatemsg_roles.test128PrivatemsgRolesTestCase->testSendMessagetoRoleBatch()
Undefined variable: url_targetNoticedrupal_web_test_case.php2318DrupalWebTestCase->clickLink()
Clicked link zmvUpfIEEx () from http://pifr-mysql/checkout/?q=messagesBrowserprivatemsg_roles.test130PrivatemsgRolesTestCase->testSendMessagetoRoleBatch()
Thread starter body displayed.Otherprivatemsg_roles.test131PrivatemsgRolesTestCase->testSendMessagetoRoleBatch()
Message is displayed as newOtherprivatemsg_roles.test128PrivatemsgRolesTestCase->testSendMessagetoRoleBatch()
Undefined variable: url_targetNoticedrupal_web_test_case.php2318DrupalWebTestCase->clickLink()
Clicked link zmvUpfIEEx () from http://pifr-mysql/checkout/?q=messagesBrowserprivatemsg_roles.test130PrivatemsgRolesTestCase->testSendMessagetoRoleBatch()
Thread starter body displayed.Otherprivatemsg_roles.test131PrivatemsgRolesTestCase->testSendMessagetoRoleBatch()
Message is displayed as newOtherprivatemsg_roles.test128PrivatemsgRolesTestCase->testSendMessagetoRoleBatch()
Undefined variable: url_targetNoticedrupal_web_test_case.php2318DrupalWebTestCase->clickLink()
Clicked link zmvUpfIEEx () from http://pifr-mysql/checkout/?q=messagesBrowserprivatemsg_roles.test130PrivatemsgRolesTestCase->testSendMessagetoRoleBatch()
Thread starter body displayed.Otherprivatemsg_roles.test131PrivatemsgRolesTestCase->testSendMessagetoRoleBatch()
Message is displayed as newOtherprivatemsg_roles.test128PrivatemsgRolesTestCase->testSendMessagetoRoleBatch()
Undefined variable: url_targetNoticedrupal_web_test_case.php2318DrupalWebTestCase->clickLink()
Clicked link zmvUpfIEEx () from http://pifr-mysql/checkout/?q=messagesBrowserprivatemsg_roles.test130PrivatemsgRolesTestCase->testSendMessagetoRoleBatch()
Thread starter body displayed.Otherprivatemsg_roles.test131PrivatemsgRolesTestCase->testSendMessagetoRoleBatch()
Message is displayed as newOtherprivatemsg_roles.test128PrivatemsgRolesTestCase->testSendMessagetoRoleBatch()
Undefined variable: url_targetNoticedrupal_web_test_case.php2318DrupalWebTestCase->clickLink()
Clicked link zmvUpfIEEx () from http://pifr-mysql/checkout/?q=messagesBrowserprivatemsg_roles.test130PrivatemsgRolesTestCase->testSendMessagetoRoleBatch()
Thread starter body displayed.Otherprivatemsg_roles.test131PrivatemsgRolesTestCase->testSendMessagetoRoleBatch()
Message is displayed as newOtherprivatemsg_roles.test128PrivatemsgRolesTestCase->testSendMessagetoRoleBatch()
Undefined variable: url_targetNoticedrupal_web_test_case.php2318DrupalWebTestCase->clickLink()
Clicked link zmvUpfIEEx () from http://pifr-mysql/checkout/?q=messagesBrowserprivatemsg_roles.test130PrivatemsgRolesTestCase->testSendMessagetoRoleBatch()
Thread starter body displayed.Otherprivatemsg_roles.test131PrivatemsgRolesTestCase->testSendMessagetoRoleBatch()
"A message has been sent to w34hcuch (role)." foundOtherprivatemsg_roles.test175PrivatemsgRolesTestCase->testSendMessageToRole()
Message is displayed as newOtherprivatemsg_roles.test181PrivatemsgRolesTestCase->testSendMessageToRole()
Undefined variable: url_targetNoticedrupal_web_test_case.php2318DrupalWebTestCase->clickLink()
Clicked link jqC5gTGLJN () from http://pifr-mysql/checkout/?q=messagesBrowserprivatemsg_roles.test183PrivatemsgRolesTestCase->testSendMessageToRole()
Thread starter body displayed.Otherprivatemsg_roles.test184PrivatemsgRolesTestCase->testSendMessageToRole()
Failed to set field body[value] to mpn2sWt2k0ZHRp8ePWJb1PAt52HeO85wHILK7e9iJ1HnDtiellOtherprivatemsg_roles.test193PrivatemsgRolesTestCase->testSendMessageToRole()
Found the Send message buttonOtherprivatemsg_roles.test193PrivatemsgRolesTestCase->testSendMessageToRole()
Found the requested form fields at Otherprivatemsg_roles.test193PrivatemsgRolesTestCase->testSendMessageToRole()
Message is displayed as newOtherprivatemsg_roles.test201PrivatemsgRolesTestCase->testSendMessageToRole()
Undefined variable: url_targetNoticedrupal_web_test_case.php2318DrupalWebTestCase->clickLink()
Clicked link jqC5gTGLJN () from http://pifr-mysql/checkout/?q=messagesBrowserprivatemsg_roles.test202PrivatemsgRolesTestCase->testSendMessageToRole()
Reply1 is displayedOtherprivatemsg_roles.test204PrivatemsgRolesTestCase->testSendMessageToRole()
Failed to set field body[value] to zts4eXhTd1PhrxzbyNqFeEDWhH722At3FTjEdUcoWrfoq6J19mOtherprivatemsg_roles.test210PrivatemsgRolesTestCase->testSendMessageToRole()
Found the Send message buttonOtherprivatemsg_roles.test210PrivatemsgRolesTestCase->testSendMessageToRole()
Found the requested form fields at Otherprivatemsg_roles.test210PrivatemsgRolesTestCase->testSendMessageToRole()
Message is displayed as newOtherprivatemsg_roles.test215PrivatemsgRolesTestCase->testSendMessageToRole()
Undefined variable: url_targetNoticedrupal_web_test_case.php2318DrupalWebTestCase->clickLink()
Clicked link jqC5gTGLJN () from http://pifr-mysql/checkout/?q=messagesBrowserprivatemsg_roles.test216PrivatemsgRolesTestCase->testSendMessageToRole()
"w34hcuch (role)" foundOtherprivatemsg_roles.test217PrivatemsgRolesTestCase->testSendMessageToRole()
Thread starter body is displayedOtherprivatemsg_roles.test219PrivatemsgRolesTestCase->testSendMessageToRole()
Reply2 is displayedOtherprivatemsg_roles.test221PrivatemsgRolesTestCase->testSendMessageToRole()
"A message has been sent to zy8cFB3A (role)." foundOtherprivatemsg_roles.test246PrivatemsgRolesTestCase->testSendMessageToRoleBlocked()
Message is displayed as newOtherprivatemsg_roles.test252PrivatemsgRolesTestCase->testSendMessageToRoleBlocked()
Undefined variable: url_targetNoticedrupal_web_test_case.php2318DrupalWebTestCase->clickLink()
Clicked link atxA4L5TGL () from http://pifr-mysql/checkout/?q=messagesBrowserprivatemsg_roles.test254PrivatemsgRolesTestCase->testSendMessageToRoleBlocked()
Thread starter body displayed.Otherprivatemsg_roles.test255PrivatemsgRolesTestCase->testSendMessageToRoleBlocked()
"A message has been sent to oFnPZ1lc (role)." foundOtherprivatemsg_roles.test279PrivatemsgRolesTestCase->testNewUser()
ExpandPrivatemsg Tags functionality. (PrivatemsgTagsTestCase) [Privatemsg]9303
MessageGroupFilenameLineFunctionStatus
PDOException: %message in _privatemsg_send() (line 1787 of /var/lib/drupaltestbot/sites/default/files/checkout/sites/default/modules/privatemsg/privatemsg.module).Uncaught exceptiondatabase.inc1970PDOStatement->execute()
PDOException: %message in _privatemsg_send() (line 1787 of /var/lib/drupaltestbot/sites/default/files/checkout/sites/default/modules/privatemsg/privatemsg.module).Uncaught exceptiondatabase.inc1970PDOStatement->execute()
PDOException: %message in _privatemsg_send() (line 1787 of /var/lib/drupaltestbot/sites/default/files/checkout/sites/default/modules/privatemsg/privatemsg.module).Uncaught exceptiondatabase.inc1970PDOStatement->execute()
ExpandUser blocking functionality. (PrivatemsgBlockUserCase) [Privatemsg]901
MessageGroupFilenameLineFunctionStatus
PDOException: %message in _privatemsg_send() (line 1787 of /var/lib/drupaltestbot/sites/default/files/checkout/sites/default/modules/privatemsg/privatemsg.module).Uncaught exceptiondatabase.inc1970PDOStatement->execute()