drupal.rid_.2.patch

Test status
StatusResult
Last receivedFri, 10/08/2010 - 01:30:26
Last requestedFri, 10/08/2010 - 01:31:02
Last testedFri, 10/08/2010 - 01:51:25
Test count1
Environment status
MySQLfail
File information
Filedrupal.rid_.2.patch
BranchDrupal core - 7.x
LinkIssue Link
SummaryFAILED: [[SimpleTest]]: [MySQL] 7,558 pass(es), 281 fail(s), and 649 exception(s).
Details

MySQL

  1. Setup environment
  2. Detect an invalid patch URL
  3. Detect invalid repository information
  4. Detect invalid patch format
  5. Detect a non-applicable patch
  6. Detect invalid PHP syntax
  7. Detect a Drupal installation failure
  8. Detect a test run failure
  9. Detect a failing test
    Review the test failures below then if necessary run them locally until the problem has been fixed.
  10. Complete test suite with all tests passing
7,558 pass(es), 281 fail(s), and 649 exception(s)

Non-pass

Test namePassFailException
Leaf403 functionality (AccessDeniedTestCase) [System]012
Leaf404 functionality (PageNotFoundTestCase) [System]012
ExpandActions configuration (ActionsConfigurationTestCase) [Actions]003
MessageGroupFilenameLineFunctionStatus
Undefined property: stdClass::$ridNoticeuser.module2746user_role_save()
Undefined property: stdClass::$ridNoticedrupal_web_test_case.php1045DrupalWebTestCase->drupalCreateRole()
PDOException: SQLSTATE[23000]: Integrity constraint violation: 1048 Column 'rid' cannot be null: INSERT INTO {role_permission} (rid, permission, module) VALUES (:db_insert_placeholder_0, :db_insert_placeholder_1, :db_insert_placeholder_2); Array ( [:db_insert_placeholder_0] => [:db_insert_placeholder_1] => administer actions [:db_insert_placeholder_2] => system ) in user_role_grant_permissions() (line 2885 of /var/lib/drupaltestbot/sites/default/files/checkout/modules/user/user.module).Uncaught exceptiondatabase.inc1967PDOStatement->execute()
ExpandActions executing in a potentially infinite loop (ActionLoopTestCase) [Actions]003
MessageGroupFilenameLineFunctionStatus
Undefined property: stdClass::$ridNoticeuser.module2746user_role_save()
Undefined property: stdClass::$ridNoticedrupal_web_test_case.php1045DrupalWebTestCase->drupalCreateRole()
PDOException: SQLSTATE[23000]: Integrity constraint violation: 1048 Column 'rid' cannot be null: INSERT INTO {role_permission} (rid, permission, module) VALUES (:db_insert_placeholder_0, :db_insert_placeholder_1, :db_insert_placeholder_2); Array ( [:db_insert_placeholder_0] => [:db_insert_placeholder_1] => administer actions [:db_insert_placeholder_2] => system ) in user_role_grant_permissions() (line 2885 of /var/lib/drupaltestbot/sites/default/files/checkout/modules/user/user.module).Uncaught exceptiondatabase.inc1967PDOStatement->execute()
ExpandAdd feed functionality (AddFeedTestCase) [Aggregator]012
MessageGroupFilenameLineFunctionStatus
The test did not complete due to a fatal error.Completion checkaggregator.test294AddFeedTestCase->testAddFeed()
Undefined property: stdClass::$ridNoticeuser.module2746user_role_save()
Undefined property: stdClass::$ridNoticedrupal_web_test_case.php1045DrupalWebTestCase->drupalCreateRole()
ExpandAdmin theme block admin accessibility (BlockAdminThemeTestCase) [Block]003
MessageGroupFilenameLineFunctionStatus
Undefined property: stdClass::$ridNoticeuser.module2746user_role_save()
Undefined property: stdClass::$ridNoticedrupal_web_test_case.php1045DrupalWebTestCase->drupalCreateRole()
PDOException: SQLSTATE[23000]: Integrity constraint violation: 1048 Column 'rid' cannot be null: INSERT INTO {role_permission} (rid, permission, module) VALUES (:db_insert_placeholder_0, :db_insert_placeholder_1, :db_insert_placeholder_2); Array ( [:db_insert_placeholder_0] => [:db_insert_placeholder_1] => administer blocks [:db_insert_placeholder_2] => block ) in user_role_grant_permissions() (line 2885 of /var/lib/drupaltestbot/sites/default/files/checkout/modules/user/user.module).Uncaught exceptiondatabase.inc1967PDOStatement->execute()
LeafAdministrative pages (SystemAdminTestCase) [System]012
LeafAdvanced search form (SearchAdvancedSearchForm) [Search]012
ExpandAJAX command form values (AJAXFormValuesTestCase) [AJAX]012
MessageGroupFilenameLineFunctionStatus
The test did not complete due to a fatal error.Completion checkajax.test280AJAXFormValuesTestCase->testSimpleAJAXFormValue()
Undefined property: stdClass::$ridNoticeuser.module2746user_role_save()
Undefined property: stdClass::$ridNoticedrupal_web_test_case.php1045DrupalWebTestCase->drupalCreateRole()
ExpandAJAX commands (AJAXCommandsTestCase) [AJAX]003
MessageGroupFilenameLineFunctionStatus
Undefined property: stdClass::$ridNoticeuser.module2746user_role_save()
Undefined property: stdClass::$ridNoticedrupal_web_test_case.php1045DrupalWebTestCase->drupalCreateRole()
PDOException: SQLSTATE[23000]: Integrity constraint violation: 1048 Column 'rid' cannot be null: INSERT INTO {role_permission} (rid, permission, module) VALUES (:db_insert_placeholder_0, :db_insert_placeholder_1, :db_insert_placeholder_2); Array ( [:db_insert_placeholder_0] => [:db_insert_placeholder_1] => access content [:db_insert_placeholder_2] => node ) in user_role_grant_permissions() (line 2885 of /var/lib/drupaltestbot/sites/default/files/checkout/modules/user/user.module).Uncaught exceptiondatabase.inc1967PDOStatement->execute()
ExpandAJAX multi form (AJAXMultiFormTestCase) [AJAX]012
MessageGroupFilenameLineFunctionStatus
The test did not complete due to a fatal error.Completion checkajax.test347AJAXMultiFormTestCase->testMultiForm()
Undefined property: stdClass::$ridNoticeuser.module2746user_role_save()
Undefined property: stdClass::$ridNoticedrupal_web_test_case.php1045DrupalWebTestCase->drupalCreateRole()
ExpandAnonymous comments (CommentAnonymous) [Comment]012
MessageGroupFilenameLineFunctionStatus
The test did not complete due to a fatal error.Completion checkcomment.test492CommentAnonymous->testAnonymous()
Undefined property: stdClass::$ridNoticeuser.module2746user_role_save()
Undefined property: stdClass::$ridNoticedrupal_web_test_case.php1045DrupalWebTestCase->drupalCreateRole()
LeafAutocompletion (ProfileTestAutocomplete) [Profile]012
ExpandBlock availability (BookBlockTestCase) [Book]012
MessageGroupFilenameLineFunctionStatus
The test did not complete due to a fatal error.Completion checkbook.test267BookBlockTestCase->testBookNavigationBlock()
Undefined property: stdClass::$ridNoticeuser.module2746user_role_save()
Undefined property: stdClass::$ridNoticedrupal_web_test_case.php1045DrupalWebTestCase->drupalCreateRole()
ExpandBlock availability (NodeBlockTestCase) [Node]012
MessageGroupFilenameLineFunctionStatus
The test did not complete due to a fatal error.Completion checknode.test630NodeBlockTestCase->testSearchFormBlock()
Undefined property: stdClass::$ridNoticeuser.module2746user_role_save()
Undefined property: stdClass::$ridNoticedrupal_web_test_case.php1045DrupalWebTestCase->drupalCreateRole()
ExpandBlock availability (PollBlockTestCase) [Poll]012
MessageGroupFilenameLineFunctionStatus
The test did not complete due to a fatal error.Completion checkpoll.test261PollBlockTestCase->testRecentBlock()
LeafBlock availability (ProfileBlockTestCase) [Profile]012
LeafBlock availability (SearchBlockTestCase) [Search]012
ExpandBlock caching (BlockCacheTestCase) [Block]012
MessageGroupFilenameLineFunctionStatus
The test did not complete due to a fatal error.Completion checkblock.test428BlockCacheTestCase->testCachePerRole()
Undefined property: stdClass::$ridNoticeuser.module2746user_role_save()
Undefined property: stdClass::$ridNoticedrupal_web_test_case.php1045DrupalWebTestCase->drupalCreateRole()
ExpandBlock functionality (BlockTestCase) [Block]012
MessageGroupFilenameLineFunctionStatus
The test did not complete due to a fatal error.Completion checkblock.test46BlockTestCase->testCustomBlock()
Undefined property: stdClass::$ridNoticeuser.module2746user_role_save()
Undefined property: stdClass::$ridNoticedrupal_web_test_case.php1045DrupalWebTestCase->drupalCreateRole()
LeafBlock functionality (SystemBlockTestCase) [System]012
ExpandBlock HTML id (BlockHTMLIdTestCase) [Block]012
MessageGroupFilenameLineFunctionStatus
The test did not complete due to a fatal error.Completion checkblock.test608BlockHTMLIdTestCase->testHTMLId()
Undefined property: stdClass::$ridNoticeuser.module2746user_role_save()
Undefined property: stdClass::$ridNoticedrupal_web_test_case.php1045DrupalWebTestCase->drupalCreateRole()
ExpandBlog functionality (BlogTestCase) [Blog]012
MessageGroupFilenameLineFunctionStatus
The test did not complete due to a fatal error.Completion checkblog.test33BlogTestCase->testUnprivilegedUser()
Undefined property: stdClass::$ridNoticeuser.module2746user_role_save()
Undefined property: stdClass::$ridNoticedrupal_web_test_case.php1045DrupalWebTestCase->drupalCreateRole()
ExpandBook functionality (BookTestCase) [Book]012
MessageGroupFilenameLineFunctionStatus
The test did not complete due to a fatal error.Completion checkbook.test62BookTestCase->testBook()
Undefined property: stdClass::$ridNoticeuser.module2746user_role_save()
Undefined property: stdClass::$ridNoticedrupal_web_test_case.php1045DrupalWebTestCase->drupalCreateRole()
ExpandBreadcrumbs (MenuBreadcrumbTestCase) [Menu]012
MessageGroupFilenameLineFunctionStatus
The test did not complete due to a fatal error.Completion checkmenu.test551MenuBreadcrumbTestCase->testBreadCrumbs()
Undefined property: stdClass::$ridNoticeuser.module2746user_role_save()
Undefined property: stdClass::$ridNoticedrupal_web_test_case.php1045DrupalWebTestCase->drupalCreateRole()
LeafCancel account (UserCancelTestCase) [User]9843
ExpandCategorize feed functionality (CategorizeFeedTestCase) [Aggregator]012
MessageGroupFilenameLineFunctionStatus
The test did not complete due to a fatal error.Completion checkaggregator.test325CategorizeFeedTestCase->testCategorizeFeed()
Undefined property: stdClass::$ridNoticeuser.module2746user_role_save()
Undefined property: stdClass::$ridNoticedrupal_web_test_case.php1045DrupalWebTestCase->drupalCreateRole()
ExpandCategorize feed item functionality (CategorizeFeedItemTestCase) [Aggregator]012
MessageGroupFilenameLineFunctionStatus
The test did not complete due to a fatal error.Completion checkaggregator.test538CategorizeFeedItemTestCase->testCategorizeFeedItem()
Undefined property: stdClass::$ridNoticeuser.module2746user_role_save()
Undefined property: stdClass::$ridNoticedrupal_web_test_case.php1045DrupalWebTestCase->drupalCreateRole()
ExpandChecks display of aggregator items (AggregatorRenderingTestCase) [Aggregator]012
MessageGroupFilenameLineFunctionStatus
The test did not complete due to a fatal error.Completion checkaggregator.test766AggregatorRenderingTestCase->testBlockLinks()
Undefined property: stdClass::$ridNoticeuser.module2746user_role_save()
Undefined property: stdClass::$ridNoticedrupal_web_test_case.php1045DrupalWebTestCase->drupalCreateRole()
ExpandColor functionality (ColorTestCase) [Color]012
MessageGroupFilenameLineFunctionStatus
The test did not complete due to a fatal error.Completion checkcolor.test49ColorTestCase->testColor()
Undefined property: stdClass::$ridNoticeuser.module2746user_role_save()
Undefined property: stdClass::$ridNoticedrupal_web_test_case.php1045DrupalWebTestCase->drupalCreateRole()
ExpandComment approval (CommentApprovalTest) [Comment]012
MessageGroupFilenameLineFunctionStatus
The test did not complete due to a fatal error.Completion checkcomment.test888CommentApprovalTest->testApprovalAdminInterface()
Undefined property: stdClass::$ridNoticeuser.module2746user_role_save()
Undefined property: stdClass::$ridNoticedrupal_web_test_case.php1045DrupalWebTestCase->drupalCreateRole()
ExpandComment blocks (CommentBlockFunctionalTest) [Comment]012
MessageGroupFilenameLineFunctionStatus
The test did not complete due to a fatal error.Completion checkcomment.test1012CommentBlockFunctionalTest->testRecentCommentBlock()
Undefined property: stdClass::$ridNoticeuser.module2746user_role_save()
Undefined property: stdClass::$ridNoticedrupal_web_test_case.php1045DrupalWebTestCase->drupalCreateRole()
LeafComment count toggle (SearchCommentCountToggleTestCase) [Search]012
ExpandComment interface (CommentInterfaceTest) [Comment]012
MessageGroupFilenameLineFunctionStatus
The test did not complete due to a fatal error.Completion checkcomment.test264CommentInterfaceTest->testCommentInterface()
Undefined property: stdClass::$ridNoticeuser.module2746user_role_save()
Undefined property: stdClass::$ridNoticedrupal_web_test_case.php1045DrupalWebTestCase->drupalCreateRole()
ExpandComment paging settings (CommentPagerTest) [Comment]012
MessageGroupFilenameLineFunctionStatus
The test did not complete due to a fatal error.Completion checkcomment.test626CommentPagerTest->testCommentPaging()
Undefined property: stdClass::$ridNoticeuser.module2746user_role_save()
Undefined property: stdClass::$ridNoticedrupal_web_test_case.php1045DrupalWebTestCase->drupalCreateRole()
ExpandComment preview (CommentPreviewTest) [Comment]012
MessageGroupFilenameLineFunctionStatus
The test did not complete due to a fatal error.Completion checkcomment.test410CommentPreviewTest->testCommentPreview()
Undefined property: stdClass::$ridNoticeuser.module2746user_role_save()
Undefined property: stdClass::$ridNoticedrupal_web_test_case.php1045DrupalWebTestCase->drupalCreateRole()
ExpandComment Rebuild (CommentContentRebuild) [Comment]012
MessageGroupFilenameLineFunctionStatus
The test did not complete due to a fatal error.Completion checkcomment.test1137CommentContentRebuild->testCommentRebuild()
Undefined property: stdClass::$ridNoticeuser.module2746user_role_save()
Undefined property: stdClass::$ridNoticedrupal_web_test_case.php1045DrupalWebTestCase->drupalCreateRole()
ExpandComment RSS (CommentRSSUnitTest) [Comment]012
MessageGroupFilenameLineFunctionStatus
The test did not complete due to a fatal error.Completion checkcomment.test1104CommentRSSUnitTest->testCommentRSS()
Undefined property: stdClass::$ridNoticeuser.module2746user_role_save()
Undefined property: stdClass::$ridNoticedrupal_web_test_case.php1045DrupalWebTestCase->drupalCreateRole()
LeafComment Search tests (SearchCommentTestCase) [Search]012
ExpandComment token replacement (CommentTokenReplaceTestCase) [Comment]012
MessageGroupFilenameLineFunctionStatus
The test did not complete due to a fatal error.Completion checkcomment.test1176CommentTokenReplaceTestCase->testCommentTokenReplacement()
Undefined property: stdClass::$ridNoticeuser.module2746user_role_save()
Undefined property: stdClass::$ridNoticedrupal_web_test_case.php1045DrupalWebTestCase->drupalCreateRole()
LeafConfig settings form (SearchConfigSettingsForm) [Search]012
ExpandContent language settings (LocaleContentFunctionalTest) [Locale]003
MessageGroupFilenameLineFunctionStatus
Undefined property: stdClass::$ridNoticeuser.module2746user_role_save()
Undefined property: stdClass::$ridNoticedrupal_web_test_case.php1045DrupalWebTestCase->drupalCreateRole()
PDOException: SQLSTATE[23000]: Integrity constraint violation: 1048 Column 'rid' cannot be null: INSERT INTO {role_permission} (rid, permission, module) VALUES (:db_insert_placeholder_0, :db_insert_placeholder_1, :db_insert_placeholder_2); Array ( [:db_insert_placeholder_0] => [:db_insert_placeholder_1] => administer languages [:db_insert_placeholder_2] => locale ) in user_role_grant_permissions() (line 2885 of /var/lib/drupaltestbot/sites/default/files/checkout/modules/user/user.module).Uncaught exceptiondatabase.inc1967PDOStatement->execute()
LeafCron run (CronRunTestCase) [System]2303
ExpandDashboard blocks (DashboardBlocksTestCase) [Dashboard]012
MessageGroupFilenameLineFunctionStatus
The test did not complete due to a fatal error.Completion checkdashboard.test39DashboardBlocksTestCase->testDashboardAccess()
Undefined property: stdClass::$ridNoticeuser.module2746user_role_save()
Undefined property: stdClass::$ridNoticedrupal_web_test_case.php1045DrupalWebTestCase->drupalCreateRole()
LeafDate and time (DateTimeFunctionalTest) [System]012
ExpandDBLog functionality (DBLogTestCase) [DBLog]012
MessageGroupFilenameLineFunctionStatus
The test did not complete due to a fatal error.Completion checkdblog.test29DBLogTestCase->testDBLog()
Undefined property: stdClass::$ridNoticeuser.module2746user_role_save()
Undefined property: stdClass::$ridNoticedrupal_web_test_case.php1045DrupalWebTestCase->drupalCreateRole()
ExpandDefault text format functionality (FilterDefaultFormatTestCase) [Filter]003
MessageGroupFilenameLineFunctionStatus
Undefined property: stdClass::$ridNoticeuser.module2746user_role_save()
Undefined property: stdClass::$ridNoticedrupal_web_test_case.php1045DrupalWebTestCase->drupalCreateRole()
PDOException: SQLSTATE[23000]: Integrity constraint violation: 1048 Column 'rid' cannot be null: INSERT INTO {role_permission} (rid, permission, module) VALUES (:db_insert_placeholder_0, :db_insert_placeholder_1, :db_insert_placeholder_2); Array ( [:db_insert_placeholder_0] => [:db_insert_placeholder_1] => administer filters [:db_insert_placeholder_2] => filter ) in user_role_grant_permissions() (line 2885 of /var/lib/drupaltestbot/sites/default/files/checkout/modules/user/user.module).Uncaught exceptiondatabase.inc1967PDOStatement->execute()
LeafEmbedded forms (SearchEmbedForm) [Search]012
ExpandEnable/disable modules (EnableDisableTestCase) [Module]012
MessageGroupFilenameLineFunctionStatus
The test did not complete due to a fatal error.Completion checksystem.test108EnableDisableTestCase->testEnableDisable()
Undefined property: stdClass::$ridNoticeuser.module2746user_role_save()
Undefined property: stdClass::$ridNoticedrupal_web_test_case.php1045DrupalWebTestCase->drupalCreateRole()
ExpandFeed parser functionality (FeedParserTestCase) [Aggregator]012
MessageGroupFilenameLineFunctionStatus
The test did not complete due to a fatal error.Completion checkaggregator.test836FeedParserTestCase->testRSS091Sample()
Undefined property: stdClass::$ridNoticeuser.module2746user_role_save()
Undefined property: stdClass::$ridNoticedrupal_web_test_case.php1045DrupalWebTestCase->drupalCreateRole()
ExpandField form tests (FieldFormTestCase) [Field API]012
MessageGroupFilenameLineFunctionStatus
The test did not complete due to a fatal error.Completion checkfield.test1238FieldFormTestCase->testFieldFormSingle()
Undefined property: stdClass::$ridNoticeuser.module2746user_role_save()
Undefined property: stdClass::$ridNoticedrupal_web_test_case.php1045DrupalWebTestCase->drupalCreateRole()
ExpandField translations tests (FieldTranslationsTestCase) [Field API]2803
MessageGroupFilenameLineFunctionStatus
Undefined property: stdClass::$ridNoticeuser.module2746user_role_save()
Undefined property: stdClass::$ridNoticedrupal_web_test_case.php1045DrupalWebTestCase->drupalCreateRole()
PDOException: SQLSTATE[23000]: Integrity constraint violation: 1048 Column 'rid' cannot be null: INSERT INTO {role_permission} (rid, permission, module) VALUES (:db_insert_placeholder_0, :db_insert_placeholder_1, :db_insert_placeholder_2); Array ( [:db_insert_placeholder_0] => [:db_insert_placeholder_1] => access field_test content [:db_insert_placeholder_2] => field_test ) in user_role_grant_permissions() (line 2885 of /var/lib/drupaltestbot/sites/default/files/checkout/modules/user/user.module).Uncaught exceptiondatabase.inc1967PDOStatement->execute()
ExpandField UI tests (FieldUITestCase) [Field UI]012
MessageGroupFilenameLineFunctionStatus
The test did not complete due to a fatal error.Completion checkfield_ui.test47FieldUITestCase->testCRUDFields()
Undefined property: stdClass::$ridNoticeuser.module2746user_role_save()
Undefined property: stdClass::$ridNoticedrupal_web_test_case.php1045DrupalWebTestCase->drupalCreateRole()
ExpandFile field display tests (FileFieldDisplayTestCase) [File]012
MessageGroupFilenameLineFunctionStatus
The test did not complete due to a fatal error.Completion checkfile.test509FileFieldDisplayTestCase->testNodeDisplay()
Undefined property: stdClass::$ridNoticeuser.module2746user_role_save()
Undefined property: stdClass::$ridNoticedrupal_web_test_case.php1045DrupalWebTestCase->drupalCreateRole()
ExpandFile field file path tests (FileFieldPathTestCase) [File]012
MessageGroupFilenameLineFunctionStatus
The test did not complete due to a fatal error.Completion checkfile.test721FileFieldPathTestCase->testUploadPath()
Undefined property: stdClass::$ridNoticeuser.module2746user_role_save()
Undefined property: stdClass::$ridNoticedrupal_web_test_case.php1045DrupalWebTestCase->drupalCreateRole()
ExpandFile field revision test (FileFieldRevisionTestCase) [File]012
MessageGroupFilenameLineFunctionStatus
The test did not complete due to a fatal error.Completion checkfile.test402FileFieldRevisionTestCase->testRevisions()
Undefined property: stdClass::$ridNoticeuser.module2746user_role_save()
Undefined property: stdClass::$ridNoticedrupal_web_test_case.php1045DrupalWebTestCase->drupalCreateRole()
ExpandFile field validation tests (FileFieldValidateTestCase) [File]012
MessageGroupFilenameLineFunctionStatus
The test did not complete due to a fatal error.Completion checkfile.test563FileFieldValidateTestCase->testRequired()
Undefined property: stdClass::$ridNoticeuser.module2746user_role_save()
Undefined property: stdClass::$ridNoticedrupal_web_test_case.php1045DrupalWebTestCase->drupalCreateRole()
ExpandFile field widget test (FileFieldWidgetTestCase) [File]012
MessageGroupFilenameLineFunctionStatus
The test did not complete due to a fatal error.Completion checkfile.test228FileFieldWidgetTestCase->testWidget()
Undefined property: stdClass::$ridNoticeuser.module2746user_role_save()
Undefined property: stdClass::$ridNoticedrupal_web_test_case.php1045DrupalWebTestCase->drupalCreateRole()
ExpandFile token replacement (FileTokenReplaceTestCase) [File]012
MessageGroupFilenameLineFunctionStatus
The test did not complete due to a fatal error.Completion checkfile.test799FileTokenReplaceTestCase->testFileTokenReplacement()
Undefined property: stdClass::$ridNoticeuser.module2746user_role_save()
Undefined property: stdClass::$ridNoticedrupal_web_test_case.php1045DrupalWebTestCase->drupalCreateRole()
ExpandFile uploading (FileSaveUploadTest) [File API]012
MessageGroupFilenameLineFunctionStatus
The test did not complete due to a fatal error.Completion checkfile.test607FileSaveUploadTest->testNormal()
Undefined property: stdClass::$ridNoticeuser.module2746user_role_save()
Undefined property: stdClass::$ridNoticedrupal_web_test_case.php1045DrupalWebTestCase->drupalCreateRole()
ExpandFile validator tests (FileValidatorTest) [File API]2003
MessageGroupFilenameLineFunctionStatus
Undefined property: stdClass::$ridNoticeuser.module2746user_role_save()
Undefined property: stdClass::$ridNoticedrupal_web_test_case.php1045DrupalWebTestCase->drupalCreateRole()
PDOException: SQLSTATE[23000]: Integrity constraint violation: 1048 Column 'rid' cannot be null: INSERT INTO {role_permission} (rid, permission, module) VALUES (:db_insert_placeholder_0, :db_insert_placeholder_1, :db_insert_placeholder_2); Array ( [:db_insert_placeholder_0] => [:db_insert_placeholder_1] => access comments [:db_insert_placeholder_2] => comment ) in user_role_grant_permissions() (line 2885 of /var/lib/drupaltestbot/sites/default/files/checkout/modules/user/user.module).Uncaught exceptiondatabase.inc1967PDOStatement->execute()
ExpandFilter administration functionality (FilterAdminTestCase) [Filter]012
MessageGroupFilenameLineFunctionStatus
The test did not complete due to a fatal error.Completion checkfilter.test182FilterAdminTestCase->testFormatAdmin()
Undefined property: stdClass::$ridNoticeuser.module2746user_role_save()
Undefined property: stdClass::$ridNoticedrupal_web_test_case.php1045DrupalWebTestCase->drupalCreateRole()
ExpandFilter format access (FilterFormatAccessTestCase) [Filter]012
MessageGroupFilenameLineFunctionStatus
The test did not complete due to a fatal error.Completion checkfilter.test453FilterFormatAccessTestCase->testFormatPermissions()
Undefined property: stdClass::$ridNoticeuser.module2746user_role_save()
Undefined property: stdClass::$ridNoticedrupal_web_test_case.php1045DrupalWebTestCase->drupalCreateRole()
ExpandFilter format hooks (FilterHooksTestCase) [Filter]012
MessageGroupFilenameLineFunctionStatus
The test did not complete due to a fatal error.Completion checkfilter.test1683FilterHooksTestCase->testFilterHooks()
Undefined property: stdClass::$ridNoticeuser.module2746user_role_save()
Undefined property: stdClass::$ridNoticedrupal_web_test_case.php1045DrupalWebTestCase->drupalCreateRole()
ExpandForm rebuilding (FormsRebuildTestCase) [Form API]012
MessageGroupFilenameLineFunctionStatus
The test did not complete due to a fatal error.Completion checkform.test1008FormsRebuildTestCase->testRebuildPreservesValues()
Undefined property: stdClass::$ridNoticeuser.module2746user_role_save()
Undefined property: stdClass::$ridNoticedrupal_web_test_case.php1045DrupalWebTestCase->drupalCreateRole()
LeafFormat date (FormatDateUnitTest) [System]603
ExpandForum functionality (ForumTestCase) [Forum]012
MessageGroupFilenameLineFunctionStatus
The test did not complete due to a fatal error.Completion checkforum.test53ForumTestCase->testForum()
Undefined property: stdClass::$ridNoticeuser.module2746user_role_save()
Undefined property: stdClass::$ridNoticedrupal_web_test_case.php1045DrupalWebTestCase->drupalCreateRole()
LeafFront page (FrontPageTestCase) [System]012
ExpandHelp functionality (HelpTestCase) [Help]012
MessageGroupFilenameLineFunctionStatus
The test did not complete due to a fatal error.Completion checkhelp.test32HelpTestCase->testHelp()
Undefined property: stdClass::$ridNoticeuser.module2746user_role_save()
Undefined property: stdClass::$ridNoticedrupal_web_test_case.php1045DrupalWebTestCase->drupalCreateRole()
LeafHTML in page titles (PageTitleFiltering) [System]012
ExpandImage field display tests (ImageFieldDisplayTestCase) [Image]012
MessageGroupFilenameLineFunctionStatus
The test did not complete due to a fatal error.Completion checkimage.test625ImageFieldDisplayTestCase->testImageFieldFormattersPublic()
Undefined property: stdClass::$ridNoticeuser.module2746user_role_save()
Undefined property: stdClass::$ridNoticedrupal_web_test_case.php1045DrupalWebTestCase->drupalCreateRole()
ExpandImage field validation tests (ImageFieldValidateTestCase) [Image]012
MessageGroupFilenameLineFunctionStatus
The test did not complete due to a fatal error.Completion checkimage.test836ImageFieldValidateTestCase->testResolution()
Undefined property: stdClass::$ridNoticeuser.module2746user_role_save()
Undefined property: stdClass::$ridNoticedrupal_web_test_case.php1045DrupalWebTestCase->drupalCreateRole()
ExpandImage styles and effects UI configuration (ImageAdminStylesUnitTest) [Image]012
MessageGroupFilenameLineFunctionStatus
The test did not complete due to a fatal error.Completion checkimage.test343ImageAdminStylesUnitTest->testStyle()
Undefined property: stdClass::$ridNoticeuser.module2746user_role_save()
Undefined property: stdClass::$ridNoticedrupal_web_test_case.php1045DrupalWebTestCase->drupalCreateRole()
ExpandImport feeds from OPML functionality (ImportOPMLTestCase) [Aggregator]012
MessageGroupFilenameLineFunctionStatus
The test did not complete due to a fatal error.Completion checkaggregator.test699ImportOPMLTestCase->testOPMLImport()
Undefined property: stdClass::$ridNoticeuser.module2746user_role_save()
Undefined property: stdClass::$ridNoticedrupal_web_test_case.php1045DrupalWebTestCase->drupalCreateRole()
LeafIP address blocking (IPAddressBlockingTestCase) [System]012
LeafKeywords and conditions (SearchKeywordsConditions) [Search]012
ExpandLanguage configuration (LocaleConfigurationTest) [Locale]003
MessageGroupFilenameLineFunctionStatus
Undefined property: stdClass::$ridNoticeuser.module2746user_role_save()
Undefined property: stdClass::$ridNoticedrupal_web_test_case.php1045DrupalWebTestCase->drupalCreateRole()
PDOException: SQLSTATE[23000]: Integrity constraint violation: 1048 Column 'rid' cannot be null: INSERT INTO {role_permission} (rid, permission, module) VALUES (:db_insert_placeholder_0, :db_insert_placeholder_1, :db_insert_placeholder_2); Array ( [:db_insert_placeholder_0] => [:db_insert_placeholder_1] => administer languages [:db_insert_placeholder_2] => locale ) in user_role_grant_permissions() (line 2885 of /var/lib/drupaltestbot/sites/default/files/checkout/modules/user/user.module).Uncaught exceptiondatabase.inc1967PDOStatement->execute()
ExpandLanguage switching (LocaleLanguageSwitchingFunctionalTest) [Locale]012
MessageGroupFilenameLineFunctionStatus
The test did not complete due to a fatal error.Completion checklocale.test1159LocaleLanguageSwitchingFunctionalTest->testLanguageBlock()
Undefined property: stdClass::$ridNoticeuser.module2746user_role_save()
Undefined property: stdClass::$ridNoticedrupal_web_test_case.php1045DrupalWebTestCase->drupalCreateRole()
ExpandList field UI (ListFieldUITestCase) [Field types]012
MessageGroupFilenameLineFunctionStatus
The test did not complete due to a fatal error.Completion checklist.test134ListFieldUITestCase->testAllowedValues()
Undefined property: stdClass::$ridNoticeuser.module2746user_role_save()
Undefined property: stdClass::$ridNoticedrupal_web_test_case.php1045DrupalWebTestCase->drupalCreateRole()
ExpandLoad multiple nodes (NodeLoadMultipleUnitTest) [Node]012
MessageGroupFilenameLineFunctionStatus
The test did not complete due to a fatal error.Completion checknode.test26NodeLoadMultipleUnitTest->testNodeMultipleLoad()
Undefined property: stdClass::$ridNoticeuser.module2746user_role_save()
Undefined property: stdClass::$ridNoticedrupal_web_test_case.php1045DrupalWebTestCase->drupalCreateRole()
ExpandLocale uninstall (EN) (LocaleUninstallFunctionalTest) [Locale]103
MessageGroupFilenameLineFunctionStatus
Undefined property: stdClass::$ridNoticeuser.module2746user_role_save()
Undefined property: stdClass::$ridNoticedrupal_web_test_case.php1045DrupalWebTestCase->drupalCreateRole()
PDOException: SQLSTATE[23000]: Integrity constraint violation: 1048 Column 'rid' cannot be null: INSERT INTO {role_permission} (rid, permission, module) VALUES (:db_insert_placeholder_0, :db_insert_placeholder_1, :db_insert_placeholder_2); Array ( [:db_insert_placeholder_0] => [:db_insert_placeholder_1] => translate interface [:db_insert_placeholder_2] => locale ) in user_role_grant_permissions() (line 2885 of /var/lib/drupaltestbot/sites/default/files/checkout/modules/user/user.module).Uncaught exceptiondatabase.inc1967PDOStatement->execute()
ExpandLocale uninstall (FR) (LocaleUninstallFrenchFunctionalTest) [Locale]103
MessageGroupFilenameLineFunctionStatus
Undefined property: stdClass::$ridNoticeuser.module2746user_role_save()
Undefined property: stdClass::$ridNoticedrupal_web_test_case.php1045DrupalWebTestCase->drupalCreateRole()
PDOException: SQLSTATE[23000]: Integrity constraint violation: 1048 Column 'rid' cannot be null: INSERT INTO {role_permission} (rid, permission, module) VALUES (:db_insert_placeholder_0, :db_insert_placeholder_1, :db_insert_placeholder_2); Array ( [:db_insert_placeholder_0] => [:db_insert_placeholder_1] => translate interface [:db_insert_placeholder_2] => locale ) in user_role_grant_permissions() (line 2885 of /var/lib/drupaltestbot/sites/default/files/checkout/modules/user/user.module).Uncaught exceptiondatabase.inc1967PDOStatement->execute()
ExpandLocalize date formats (LocaleDateFormatsFunctionalTest) [Locale]012
MessageGroupFilenameLineFunctionStatus
The test did not complete due to a fatal error.Completion checklocale.test1957LocaleDateFormatsFunctionalTest->testLocalizeDateFormats()
Undefined property: stdClass::$ridNoticeuser.module2746user_role_save()
Undefined property: stdClass::$ridNoticedrupal_web_test_case.php1045DrupalWebTestCase->drupalCreateRole()
LeafMain content rendering fallback (SystemMainContentFallback) [System]012
ExpandMenu link creation/deletion (MenuTestCase) [Menu]012
MessageGroupFilenameLineFunctionStatus
The test did not complete due to a fatal error.Completion checkmenu.test33MenuTestCase->testMenu()
Undefined property: stdClass::$ridNoticeuser.module2746user_role_save()
Undefined property: stdClass::$ridNoticedrupal_web_test_case.php1045DrupalWebTestCase->drupalCreateRole()
ExpandMenu router (MenuRouterTestCase) [Menu]105716
MessageGroupFilenameLineFunctionStatus
Undefined property: stdClass::$ridNoticeuser.module2746user_role_save()
Undefined property: stdClass::$ridNoticedrupal_web_test_case.php1045DrupalWebTestCase->drupalCreateRole()
PDOException: SQLSTATE[23000]: Integrity constraint violation: 1048 Column 'rid' cannot be null: INSERT INTO {role_permission} (rid, permission, module) VALUES (:db_insert_placeholder_0, :db_insert_placeholder_1, :db_insert_placeholder_2); Array ( [:db_insert_placeholder_0] => [:db_insert_placeholder_1] => access site in maintenance mode [:db_insert_placeholder_2] => system ) in user_role_grant_permissions() (line 2885 of /var/lib/drupaltestbot/sites/default/files/checkout/modules/user/user.module).Uncaught exceptiondatabase.inc1967PDOStatement->execute()
Undefined property: stdClass::$ridNoticeuser.module2746user_role_save()
Undefined property: stdClass::$ridNoticedrupal_web_test_case.php1045DrupalWebTestCase->drupalCreateRole()
Created role of name: eXsqSE6T, id: -n/a-Rolemenu.test115MenuRouterTestCase->testAuthUserUserLogin()
Argument 1 passed to DrupalWebTestCase::drupalLogin() must be an instance of stdClass, boolean given, called in /var/lib/drupaltestbot/sites/default/files/checkout/modules/simpletest/tests/menu.test on line 116 and definedRecoverable errordrupal_web_test_case.php1112DrupalWebTestCase->drupalLogin()
Trying to get property of non-objectNoticedrupal_web_test_case.php1118DrupalWebTestCase->drupalLogin()
Trying to get property of non-objectNoticedrupal_web_test_case.php1119DrupalWebTestCase->drupalLogin()
Failed to set field name to Othermenu.test116MenuRouterTestCase->testAuthUserUserLogin()
Failed to set field pass to Othermenu.test116MenuRouterTestCase->testAuthUserUserLogin()
Found the requested form fields at userOthermenu.test116MenuRouterTestCase->testAuthUserUserLogin()
Trying to get property of non-objectNoticedrupal_web_test_case.php1125DrupalWebTestCase->drupalLogin()
User successfully logged in.User loginmenu.test116MenuRouterTestCase->testAuthUserUserLogin()
Logged-in user redirected to q=user on accessing q=user/loginOthermenu.test120MenuRouterTestCase->testAuthUserUserLogin()
Trying to get property of non-objectNoticemenu.test124MenuRouterTestCase->testAuthUserUserLogin()
Logged-in user redirected to q=user/UID/edit on accessing q=user/registerOthermenu.test124MenuRouterTestCase->testAuthUserUserLogin()
ExpandMenu settings for nodes (MenuNodeTestCase) [Menu]012
MessageGroupFilenameLineFunctionStatus
The test did not complete due to a fatal error.Completion checkmenu.test603MenuNodeTestCase->testMenuNodeFormWidget()
Undefined property: stdClass::$ridNoticeuser.module2746user_role_save()
Undefined property: stdClass::$ridNoticedrupal_web_test_case.php1045DrupalWebTestCase->drupalCreateRole()
ExpandMiscellaneous AJAX tests (AJAXElementValidation) [AJAX]003
MessageGroupFilenameLineFunctionStatus
Undefined property: stdClass::$ridNoticeuser.module2746user_role_save()
Undefined property: stdClass::$ridNoticedrupal_web_test_case.php1045DrupalWebTestCase->drupalCreateRole()
PDOException: SQLSTATE[23000]: Integrity constraint violation: 1048 Column 'rid' cannot be null: INSERT INTO {role_permission} (rid, permission, module) VALUES (:db_insert_placeholder_0, :db_insert_placeholder_1, :db_insert_placeholder_2); Array ( [:db_insert_placeholder_0] => [:db_insert_placeholder_1] => access comments [:db_insert_placeholder_2] => comment ) in user_role_grant_permissions() (line 2885 of /var/lib/drupaltestbot/sites/default/files/checkout/modules/user/user.module).Uncaught exceptiondatabase.inc1967PDOStatement->execute()
ExpandModule API (ModuleUnitTest) [Module]2003
MessageGroupFilenameLineFunctionStatus
Undefined property: stdClass::$ridNoticeuser.module2746user_role_save()
Undefined property: stdClass::$ridNoticedrupal_web_test_case.php1045DrupalWebTestCase->drupalCreateRole()
PDOException: SQLSTATE[23000]: Integrity constraint violation: 1048 Column 'rid' cannot be null: INSERT INTO {role_permission} (rid, permission, module) VALUES (:db_insert_placeholder_0, :db_insert_placeholder_1, :db_insert_placeholder_2); Array ( [:db_insert_placeholder_0] => [:db_insert_placeholder_1] => access comments [:db_insert_placeholder_2] => comment ) in user_role_grant_permissions() (line 2885 of /var/lib/drupaltestbot/sites/default/files/checkout/modules/user/user.module).Uncaught exceptiondatabase.inc1967PDOStatement->execute()
ExpandModule dependencies (ModuleDependencyTestCase) [Module]012
MessageGroupFilenameLineFunctionStatus
The test did not complete due to a fatal error.Completion checksystem.test216ModuleDependencyTestCase->testEnableWithoutDependency()
Undefined property: stdClass::$ridNoticeuser.module2746user_role_save()
Undefined property: stdClass::$ridNoticedrupal_web_test_case.php1045DrupalWebTestCase->drupalCreateRole()
ExpandModule versions (ModuleVersionTestCase) [Module]012
MessageGroupFilenameLineFunctionStatus
The test did not complete due to a fatal error.Completion checksystem.test371ModuleVersionTestCase->testModuleVersions()
Undefined property: stdClass::$ridNoticeuser.module2746user_role_save()
Undefined property: stdClass::$ridNoticedrupal_web_test_case.php1045DrupalWebTestCase->drupalCreateRole()
ExpandMultilingual fields (LocaleMultilingualFieldsFunctionalTest) [Locale]012
MessageGroupFilenameLineFunctionStatus
The test did not complete due to a fatal error.Completion checklocale.test1858LocaleMultilingualFieldsFunctionalTest->testMultilingualNodeForm()
Undefined property: stdClass::$ridNoticeuser.module2746user_role_save()
Undefined property: stdClass::$ridNoticedrupal_web_test_case.php1045DrupalWebTestCase->drupalCreateRole()
ExpandMultistep form using form storage (FormsFormStorageTestCase) [Form API]012
MessageGroupFilenameLineFunctionStatus
The test did not complete due to a fatal error.Completion checkform.test789FormsFormStorageTestCase->testForm()
Undefined property: stdClass::$ridNoticeuser.module2746user_role_save()
Undefined property: stdClass::$ridNoticedrupal_web_test_case.php1045DrupalWebTestCase->drupalCreateRole()
ExpandMultistep node form basic options (MultiStepNodeFormBasicOptionsTest) [Node]012
MessageGroupFilenameLineFunctionStatus
The test did not complete due to a fatal error.Completion checknode.test1634MultiStepNodeFormBasicOptionsTest->testMultiStepNodeFormBasicOptions()
Undefined property: stdClass::$ridNoticeuser.module2746user_role_save()
Undefined property: stdClass::$ridNoticedrupal_web_test_case.php1045DrupalWebTestCase->drupalCreateRole()
ExpandNew default theme blocks (NewDefaultThemeBlocks) [Block]003
MessageGroupFilenameLineFunctionStatus
Undefined property: stdClass::$ridNoticeuser.module2746user_role_save()
Undefined property: stdClass::$ridNoticedrupal_web_test_case.php1045DrupalWebTestCase->drupalCreateRole()
PDOException: SQLSTATE[23000]: Integrity constraint violation: 1048 Column 'rid' cannot be null: INSERT INTO {role_permission} (rid, permission, module) VALUES (:db_insert_placeholder_0, :db_insert_placeholder_1, :db_insert_placeholder_2); Array ( [:db_insert_placeholder_0] => [:db_insert_placeholder_1] => administer themes [:db_insert_placeholder_2] => system ) in user_role_grant_permissions() (line 2885 of /var/lib/drupaltestbot/sites/default/files/checkout/modules/user/user.module).Uncaught exceptiondatabase.inc1967PDOStatement->execute()
ExpandNo help (NoHelpTestCase) [Help]012
MessageGroupFilenameLineFunctionStatus
The test did not complete due to a fatal error.Completion checkhelp.test115NoHelpTestCase->testMainPageNoHelp()
Undefined property: stdClass::$ridNoticeuser.module2746user_role_save()
Undefined property: stdClass::$ridNoticedrupal_web_test_case.php1045DrupalWebTestCase->drupalCreateRole()
ExpandNode access (NodeAccessUnitTest) [Node]003
MessageGroupFilenameLineFunctionStatus
Undefined property: stdClass::$ridNoticeuser.module2746user_role_save()
Undefined property: stdClass::$ridNoticedrupal_web_test_case.php1045DrupalWebTestCase->drupalCreateRole()
PDOException: SQLSTATE[23000]: Integrity constraint violation: 1048 Column 'rid' cannot be null: INSERT INTO {role_permission} (rid, permission, module) VALUES (:db_insert_placeholder_0, :db_insert_placeholder_1, :db_insert_placeholder_2); Array ( [:db_insert_placeholder_0] => [:db_insert_placeholder_1] => create page content [:db_insert_placeholder_2] => node ) in user_role_grant_permissions() (line 2885 of /var/lib/drupaltestbot/sites/default/files/checkout/modules/user/user.module).Uncaught exceptiondatabase.inc1967PDOStatement->execute()
ExpandNode access rebuild (NodeAccessRebuildTestCase) [Node]012
MessageGroupFilenameLineFunctionStatus
The test did not complete due to a fatal error.Completion checknode.test1247NodeAccessRebuildTestCase->testNodeAccessRebuild()
Undefined property: stdClass::$ridNoticeuser.module2746user_role_save()
Undefined property: stdClass::$ridNoticedrupal_web_test_case.php1045DrupalWebTestCase->drupalCreateRole()
ExpandNode access records (NodeAccessRecordsUnitTest) [Node]1603
MessageGroupFilenameLineFunctionStatus
Undefined property: stdClass::$ridNoticeuser.module2746user_role_save()
Undefined property: stdClass::$ridNoticedrupal_web_test_case.php1045DrupalWebTestCase->drupalCreateRole()
PDOException: SQLSTATE[23000]: Integrity constraint violation: 1048 Column 'rid' cannot be null: INSERT INTO {role_permission} (rid, permission, module) VALUES (:db_insert_placeholder_0, :db_insert_placeholder_1, :db_insert_placeholder_2); Array ( [:db_insert_placeholder_0] => [:db_insert_placeholder_1] => access content [:db_insert_placeholder_2] => node ) in user_role_grant_permissions() (line 2885 of /var/lib/drupaltestbot/sites/default/files/checkout/modules/user/user.module).Uncaught exceptiondatabase.inc1967PDOStatement->execute()
ExpandNode administration (NodeAdminTestCase) [Node]012
MessageGroupFilenameLineFunctionStatus
The test did not complete due to a fatal error.Completion checknode.test1284NodeAdminTestCase->testContentAdminSort()
Undefined property: stdClass::$ridNoticeuser.module2746user_role_save()
Undefined property: stdClass::$ridNoticedrupal_web_test_case.php1045DrupalWebTestCase->drupalCreateRole()
ExpandNode blocks (NodeBlockFunctionalTest) [Node]012
MessageGroupFilenameLineFunctionStatus
The test did not complete due to a fatal error.Completion checknode.test1503NodeBlockFunctionalTest->testRecentNodeBlock()
Undefined property: stdClass::$ridNoticeuser.module2746user_role_save()
Undefined property: stdClass::$ridNoticedrupal_web_test_case.php1045DrupalWebTestCase->drupalCreateRole()
ExpandNode creation (NodeCreationTestCase) [Node]012
MessageGroupFilenameLineFunctionStatus
The test did not complete due to a fatal error.Completion checknode.test440NodeCreationTestCase->testNodeCreation()
Undefined property: stdClass::$ridNoticeuser.module2746user_role_save()
Undefined property: stdClass::$ridNoticedrupal_web_test_case.php1045DrupalWebTestCase->drupalCreateRole()
ExpandNode edit (PageEditTestCase) [Node]012
MessageGroupFilenameLineFunctionStatus
The test did not complete due to a fatal error.Completion checknode.test239PageEditTestCase->testPageEdit()
Undefined property: stdClass::$ridNoticeuser.module2746user_role_save()
Undefined property: stdClass::$ridNoticedrupal_web_test_case.php1045DrupalWebTestCase->drupalCreateRole()
ExpandNode edit permissions (PageViewTestCase) [Node]403
MessageGroupFilenameLineFunctionStatus
Undefined property: stdClass::$ridNoticeuser.module2746user_role_save()
Undefined property: stdClass::$ridNoticedrupal_web_test_case.php1045DrupalWebTestCase->drupalCreateRole()
PDOException: SQLSTATE[23000]: Integrity constraint violation: 1048 Column 'rid' cannot be null: INSERT INTO {role_permission} (rid, permission, module) VALUES (:db_insert_placeholder_0, :db_insert_placeholder_1, :db_insert_placeholder_2); Array ( [:db_insert_placeholder_0] => [:db_insert_placeholder_1] => access content [:db_insert_placeholder_2] => node ) in user_role_grant_permissions() (line 2885 of /var/lib/drupaltestbot/sites/default/files/checkout/modules/user/user.module).Uncaught exceptiondatabase.inc1967PDOStatement->execute()
ExpandNode entity query alter (NodeEntityFieldQueryAlter) [Node]012
MessageGroupFilenameLineFunctionStatus
The test did not complete due to a fatal error.Completion checknode.test1856NodeEntityFieldQueryAlter->testNodeQueryAlterWithUI()
Undefined property: stdClass::$ridNoticeuser.module2746user_role_save()
Undefined property: stdClass::$ridNoticedrupal_web_test_case.php1045DrupalWebTestCase->drupalCreateRole()
ExpandNode post information display (NodePostSettingsTestCase) [Node]012
MessageGroupFilenameLineFunctionStatus
The test did not complete due to a fatal error.Completion checknode.test665NodePostSettingsTestCase->testPagePostInfo()
Undefined property: stdClass::$ridNoticeuser.module2746user_role_save()
Undefined property: stdClass::$ridNoticedrupal_web_test_case.php1045DrupalWebTestCase->drupalCreateRole()
ExpandNode preview (PagePreviewTestCase) [Node]012
MessageGroupFilenameLineFunctionStatus
The test did not complete due to a fatal error.Completion checknode.test368PagePreviewTestCase->testPagePreview()
Undefined property: stdClass::$ridNoticeuser.module2746user_role_save()
Undefined property: stdClass::$ridNoticedrupal_web_test_case.php1045DrupalWebTestCase->drupalCreateRole()
ExpandNode query alter (NodeQueryAlter) [Node]012
MessageGroupFilenameLineFunctionStatus
The test did not complete due to a fatal error.Completion checknode.test1720NodeQueryAlter->testNodeQueryAlterWithUI()
Undefined property: stdClass::$ridNoticeuser.module2746user_role_save()
Undefined property: stdClass::$ridNoticedrupal_web_test_case.php1045DrupalWebTestCase->drupalCreateRole()
ExpandNode revisions (NodeRevisionsTestCase) [Node]012
MessageGroupFilenameLineFunctionStatus
The test did not complete due to a fatal error.Completion checknode.test135NodeRevisionsTestCase->testRevisions()
Undefined property: stdClass::$ridNoticeuser.module2746user_role_save()
Undefined property: stdClass::$ridNoticedrupal_web_test_case.php1045DrupalWebTestCase->drupalCreateRole()
ExpandNode RSS Content (NodeRSSContentTestCase) [Node]012
MessageGroupFilenameLineFunctionStatus
The test did not complete due to a fatal error.Completion checknode.test739NodeRSSContentTestCase->testNodeRSSContent()
Undefined property: stdClass::$ridNoticeuser.module2746user_role_save()
Undefined property: stdClass::$ridNoticedrupal_web_test_case.php1045DrupalWebTestCase->drupalCreateRole()
ExpandNode save (NodeSaveTestCase) [Node]012
MessageGroupFilenameLineFunctionStatus
The test did not complete due to a fatal error.Completion checknode.test951NodeSaveTestCase->testImport()
Undefined property: stdClass::$ridNoticeuser.module2746user_role_save()
Undefined property: stdClass::$ridNoticedrupal_web_test_case.php1045DrupalWebTestCase->drupalCreateRole()
ExpandNode title (NodeTitleTestCase) [Node]012
MessageGroupFilenameLineFunctionStatus
The test did not complete due to a fatal error.Completion checknode.test1428NodeTitleTestCase->testNodeTitle()
Undefined property: stdClass::$ridNoticeuser.module2746user_role_save()
Undefined property: stdClass::$ridNoticedrupal_web_test_case.php1045DrupalWebTestCase->drupalCreateRole()
ExpandNode title XSS filtering (NodeTitleXSSTestCase) [Node]003
MessageGroupFilenameLineFunctionStatus
Undefined property: stdClass::$ridNoticeuser.module2746user_role_save()
Undefined property: stdClass::$ridNoticedrupal_web_test_case.php1045DrupalWebTestCase->drupalCreateRole()
PDOException: SQLSTATE[23000]: Integrity constraint violation: 1048 Column 'rid' cannot be null: INSERT INTO {role_permission} (rid, permission, module) VALUES (:db_insert_placeholder_0, :db_insert_placeholder_1, :db_insert_placeholder_2); Array ( [:db_insert_placeholder_0] => [:db_insert_placeholder_1] => create page content [:db_insert_placeholder_2] => node ) in user_role_grant_permissions() (line 2885 of /var/lib/drupaltestbot/sites/default/files/checkout/modules/user/user.module).Uncaught exceptiondatabase.inc1967PDOStatement->execute()
ExpandNode token replacement (NodeTokenReplaceTestCase) [Node]003
MessageGroupFilenameLineFunctionStatus
Undefined property: stdClass::$ridNoticeuser.module2746user_role_save()
Undefined property: stdClass::$ridNoticedrupal_web_test_case.php1045DrupalWebTestCase->drupalCreateRole()
PDOException: SQLSTATE[23000]: Integrity constraint violation: 1048 Column 'rid' cannot be null: INSERT INTO {role_permission} (rid, permission, module) VALUES (:db_insert_placeholder_0, :db_insert_placeholder_1, :db_insert_placeholder_2); Array ( [:db_insert_placeholder_0] => [:db_insert_placeholder_1] => access comments [:db_insert_placeholder_2] => comment ) in user_role_grant_permissions() (line 2885 of /var/lib/drupaltestbot/sites/default/files/checkout/modules/user/user.module).Uncaught exceptiondatabase.inc1967PDOStatement->execute()
ExpandNode type persist (NodeTypePersistenceTestCase) [Node]003
MessageGroupFilenameLineFunctionStatus
Undefined property: stdClass::$ridNoticeuser.module2746user_role_save()
Undefined property: stdClass::$ridNoticedrupal_web_test_case.php1045DrupalWebTestCase->drupalCreateRole()
PDOException: SQLSTATE[23000]: Integrity constraint violation: 1048 Column 'rid' cannot be null: INSERT INTO {role_permission} (rid, permission, module) VALUES (:db_insert_placeholder_0, :db_insert_placeholder_1, :db_insert_placeholder_2); Array ( [:db_insert_placeholder_0] => [:db_insert_placeholder_1] => bypass node access [:db_insert_placeholder_2] => node ) in user_role_grant_permissions() (line 2885 of /var/lib/drupaltestbot/sites/default/files/checkout/modules/user/user.module).Uncaught exceptiondatabase.inc1967PDOStatement->execute()
ExpandNode types (NodeTypeTestCase) [Node]806
MessageGroupFilenameLineFunctionStatus
Undefined property: stdClass::$ridNoticeuser.module2746user_role_save()
Undefined property: stdClass::$ridNoticedrupal_web_test_case.php1045DrupalWebTestCase->drupalCreateRole()
PDOException: SQLSTATE[23000]: Integrity constraint violation: 1048 Column 'rid' cannot be null: INSERT INTO {role_permission} (rid, permission, module) VALUES (:db_insert_placeholder_0, :db_insert_placeholder_1, :db_insert_placeholder_2); Array ( [:db_insert_placeholder_0] => [:db_insert_placeholder_1] => create cdeyh2lm content [:db_insert_placeholder_2] => node ) in user_role_grant_permissions() (line 2885 of /var/lib/drupaltestbot/sites/default/files/checkout/modules/user/user.module).Uncaught exceptiondatabase.inc1967PDOStatement->execute()
Undefined property: stdClass::$ridNoticeuser.module2746user_role_save()
Undefined property: stdClass::$ridNoticedrupal_web_test_case.php1045DrupalWebTestCase->drupalCreateRole()
PDOException: SQLSTATE[23000]: Integrity constraint violation: 1048 Column 'rid' cannot be null: INSERT INTO {role_permission} (rid, permission, module) VALUES (:db_insert_placeholder_0, :db_insert_placeholder_1, :db_insert_placeholder_2); Array ( [:db_insert_placeholder_0] => [:db_insert_placeholder_1] => bypass node access [:db_insert_placeholder_2] => node ) in user_role_grant_permissions() (line 2885 of /var/lib/drupaltestbot/sites/default/files/checkout/modules/user/user.module).Uncaught exceptiondatabase.inc1967PDOStatement->execute()
ExpandNon default theme admin (NonDefaultBlockAdmin) [Block]003
MessageGroupFilenameLineFunctionStatus
Undefined property: stdClass::$ridNoticeuser.module2746user_role_save()
Undefined property: stdClass::$ridNoticedrupal_web_test_case.php1045DrupalWebTestCase->drupalCreateRole()
PDOException: SQLSTATE[23000]: Integrity constraint violation: 1048 Column 'rid' cannot be null: INSERT INTO {role_permission} (rid, permission, module) VALUES (:db_insert_placeholder_0, :db_insert_placeholder_1, :db_insert_placeholder_2); Array ( [:db_insert_placeholder_0] => [:db_insert_placeholder_1] => administer blocks [:db_insert_placeholder_2] => block ) in user_role_grant_permissions() (line 2885 of /var/lib/drupaltestbot/sites/default/files/checkout/modules/user/user.module).Uncaught exceptiondatabase.inc1967PDOStatement->execute()
LeafOpenID account registration (OpenIDRegistrationTestCase) [OpenID]12544
ExpandOpenID discovery and login (OpenIDFunctionalTestCase) [OpenID]8610751
MessageGroupFilenameLineFunctionStatus
Undefined property: stdClass::$ridNoticeuser.module2746user_role_save()
Undefined property: stdClass::$ridNoticedrupal_web_test_case.php1045DrupalWebTestCase->drupalCreateRole()
Created role of name: sROU59JV, id: -n/a-Roleopenid.test43OpenIDFunctionalTestCase->setUp()
Argument 1 passed to DrupalWebTestCase::drupalLogin() must be an instance of stdClass, boolean given, called in /var/lib/drupaltestbot/sites/default/files/checkout/modules/openid/openid.test on line 50 and definedRecoverable errordrupal_web_test_case.php1112DrupalWebTestCase->drupalLogin()
Trying to get property of non-objectNoticedrupal_web_test_case.php1118DrupalWebTestCase->drupalLogin()
Trying to get property of non-objectNoticedrupal_web_test_case.php1119DrupalWebTestCase->drupalLogin()
Failed to set field name to Otheropenid.test50OpenIDFunctionalTestCase->testDiscovery()
Failed to set field pass to Otheropenid.test50OpenIDFunctionalTestCase->testDiscovery()
Found the requested form fields at userOtheropenid.test50OpenIDFunctionalTestCase->testDiscovery()
Trying to get property of non-objectNoticedrupal_web_test_case.php1125DrupalWebTestCase->drupalLogin()
User successfully logged in.User loginopenid.test50OpenIDFunctionalTestCase->testDiscovery()
Trying to get property of non-objectNoticeopenid.test246OpenIDFunctionalTestCase->addIdentity()
Failed to set field openid_identifier to pifr-mysql/checkout/?q=openid-test/yadis/xrdsOtheropenid.test246OpenIDFunctionalTestCase->addIdentity()
Found the Add an OpenID buttonOtheropenid.test246OpenIDFunctionalTestCase->addIdentity()
Found the requested form fields at user//openidOtheropenid.test246OpenIDFunctionalTestCase->addIdentity()
OpenID redirect page was displayed.Otheropenid.test256OpenIDFunctionalTestCase->addIdentity()
Found the Send buttonOtheropenid.test259OpenIDFunctionalTestCase->addIdentity()
Found the requested form fields at Otheropenid.test259OpenIDFunctionalTestCase->addIdentity()
Identity pifr-mysql/checkout/?q=openid-test/yadis/xrds was added.Otheropenid.test265OpenIDFunctionalTestCase->addIdentity()
Trying to get property of non-objectNoticeopenid.test246OpenIDFunctionalTestCase->addIdentity()
Failed to set field openid_identifier to pifr-mysql/checkout/?q=openid-test/yadis/xrds/delegateOtheropenid.test246OpenIDFunctionalTestCase->addIdentity()
Found the Add an OpenID buttonOtheropenid.test246OpenIDFunctionalTestCase->addIdentity()
Found the requested form fields at user//openidOtheropenid.test246OpenIDFunctionalTestCase->addIdentity()
OpenID redirect page was displayed.Otheropenid.test256OpenIDFunctionalTestCase->addIdentity()
Found the Send buttonOtheropenid.test259OpenIDFunctionalTestCase->addIdentity()
Found the requested form fields at Otheropenid.test259OpenIDFunctionalTestCase->addIdentity()
Identity pifr-mysql/checkout/?q=openid-test/yadis/xrds/delegate was added.Otheropenid.test265OpenIDFunctionalTestCase->addIdentity()
Trying to get property of non-objectNoticeopenid.test246OpenIDFunctionalTestCase->addIdentity()
Failed to set field openid_identifier to http://pifr-mysql/checkout/?q=openid-test/yadis/xrds/serverOtheropenid.test246OpenIDFunctionalTestCase->addIdentity()
Found the Add an OpenID buttonOtheropenid.test246OpenIDFunctionalTestCase->addIdentity()
Found the requested form fields at user//openidOtheropenid.test246OpenIDFunctionalTestCase->addIdentity()
OpenID redirect page was displayed.Otheropenid.test256OpenIDFunctionalTestCase->addIdentity()
Found the Send buttonOtheropenid.test259OpenIDFunctionalTestCase->addIdentity()
Found the requested form fields at Otheropenid.test259OpenIDFunctionalTestCase->addIdentity()
Identity http://pifr-mysql/checkout/?q=openid-test/yadis/xrds/server was added.Otheropenid.test265OpenIDFunctionalTestCase->addIdentity()
Trying to get property of non-objectNoticeopenid.test246OpenIDFunctionalTestCase->addIdentity()
Failed to set field openid_identifier to http://pifr-mysql/checkout/?q=openid-test/yadis/x-xrds-locationOtheropenid.test246OpenIDFunctionalTestCase->addIdentity()
Found the Add an OpenID buttonOtheropenid.test246OpenIDFunctionalTestCase->addIdentity()
Found the requested form fields at user//openidOtheropenid.test246OpenIDFunctionalTestCase->addIdentity()
OpenID redirect page was displayed.Otheropenid.test256OpenIDFunctionalTestCase->addIdentity()
Found the Send buttonOtheropenid.test259OpenIDFunctionalTestCase->addIdentity()
Found the requested form fields at Otheropenid.test259OpenIDFunctionalTestCase->addIdentity()
Identity http://pifr-mysql/checkout/?q=openid-test/yadis/x-xrds-location was added.Otheropenid.test265OpenIDFunctionalTestCase->addIdentity()
Trying to get property of non-objectNoticeopenid.test246OpenIDFunctionalTestCase->addIdentity()
Failed to set field openid_identifier to http://pifr-mysql/checkout/?q=openid-test/yadis/http-equivOtheropenid.test246OpenIDFunctionalTestCase->addIdentity()
Found the Add an OpenID buttonOtheropenid.test246OpenIDFunctionalTestCase->addIdentity()
Found the requested form fields at user//openidOtheropenid.test246OpenIDFunctionalTestCase->addIdentity()
OpenID redirect page was displayed.Otheropenid.test256OpenIDFunctionalTestCase->addIdentity()
Found the Send buttonOtheropenid.test259OpenIDFunctionalTestCase->addIdentity()
Found the requested form fields at Otheropenid.test259OpenIDFunctionalTestCase->addIdentity()
Identity http://pifr-mysql/checkout/?q=openid-test/yadis/http-equiv was added.Otheropenid.test265OpenIDFunctionalTestCase->addIdentity()
Trying to get property of non-objectNoticeopenid.test246OpenIDFunctionalTestCase->addIdentity()
Failed to set field openid_identifier to @example*résumé;%25Otheropenid.test246OpenIDFunctionalTestCase->addIdentity()
Found the Add an OpenID buttonOtheropenid.test246OpenIDFunctionalTestCase->addIdentity()
Found the requested form fields at user//openidOtheropenid.test246OpenIDFunctionalTestCase->addIdentity()
OpenID redirect page was displayed.Otheropenid.test256OpenIDFunctionalTestCase->addIdentity()
Found the Send buttonOtheropenid.test259OpenIDFunctionalTestCase->addIdentity()
Found the requested form fields at Otheropenid.test259OpenIDFunctionalTestCase->addIdentity()
Identity @example*résumé;%25 was added.Otheropenid.test265OpenIDFunctionalTestCase->addIdentity()
Trying to get property of non-objectNoticeopenid.test246OpenIDFunctionalTestCase->addIdentity()
Failed to set field openid_identifier to @example*résumé;%25Otheropenid.test246OpenIDFunctionalTestCase->addIdentity()
Found the Add an OpenID buttonOtheropenid.test246OpenIDFunctionalTestCase->addIdentity()
Found the requested form fields at user//openidOtheropenid.test246OpenIDFunctionalTestCase->addIdentity()
Invalid identity was rejected.Otheropenid.test249OpenIDFunctionalTestCase->addIdentity()
Trying to get property of non-objectNoticeopenid.test246OpenIDFunctionalTestCase->addIdentity()
Failed to set field openid_identifier to http://pifr-mysql/checkout/?q=openid-test/html/openid1Otheropenid.test246OpenIDFunctionalTestCase->addIdentity()
Found the Add an OpenID buttonOtheropenid.test246OpenIDFunctionalTestCase->addIdentity()
Found the requested form fields at user//openidOtheropenid.test246OpenIDFunctionalTestCase->addIdentity()
Identity http://pifr-mysql/checkout/?q=openid-test/html/openid1 was added.Otheropenid.test265OpenIDFunctionalTestCase->addIdentity()
Trying to get property of non-objectNoticeopenid.test246OpenIDFunctionalTestCase->addIdentity()
Failed to set field openid_identifier to http://pifr-mysql/checkout/?q=openid-test/html/openid2Otheropenid.test246OpenIDFunctionalTestCase->addIdentity()
Found the Add an OpenID buttonOtheropenid.test246OpenIDFunctionalTestCase->addIdentity()
Found the requested form fields at user//openidOtheropenid.test246OpenIDFunctionalTestCase->addIdentity()
OpenID redirect page was displayed.Otheropenid.test256OpenIDFunctionalTestCase->addIdentity()
Found the Send buttonOtheropenid.test259OpenIDFunctionalTestCase->addIdentity()
Found the requested form fields at Otheropenid.test259OpenIDFunctionalTestCase->addIdentity()
Identity http://pifr-mysql/checkout/?q=openid-test/html/openid2 was added.Otheropenid.test265OpenIDFunctionalTestCase->addIdentity()
Undefined property: stdClass::$ridNoticeuser.module2746user_role_save()
Undefined property: stdClass::$ridNoticedrupal_web_test_case.php1045DrupalWebTestCase->drupalCreateRole()
Created role of name: itcHc81k, id: -n/a-Roleopenid.test43OpenIDFunctionalTestCase->setUp()
Argument 1 passed to DrupalWebTestCase::drupalLogin() must be an instance of stdClass, boolean given, called in /var/lib/drupaltestbot/sites/default/files/checkout/modules/openid/openid.test on line 119 and definedRecoverable errordrupal_web_test_case.php1112DrupalWebTestCase->drupalLogin()
Trying to get property of non-objectNoticedrupal_web_test_case.php1118DrupalWebTestCase->drupalLogin()
Trying to get property of non-objectNoticedrupal_web_test_case.php1119DrupalWebTestCase->drupalLogin()
Failed to set field name to Otheropenid.test119OpenIDFunctionalTestCase->testLogin()
Failed to set field pass to Otheropenid.test119OpenIDFunctionalTestCase->testLogin()
Found the requested form fields at userOtheropenid.test119OpenIDFunctionalTestCase->testLogin()
Trying to get property of non-objectNoticedrupal_web_test_case.php1125DrupalWebTestCase->drupalLogin()
User successfully logged in.User loginopenid.test119OpenIDFunctionalTestCase->testLogin()
Trying to get property of non-objectNoticeopenid.test246OpenIDFunctionalTestCase->addIdentity()
Failed to set field openid_identifier to http://pifr-mysql/checkout/?q=openid-test/yadis/xrdsOtheropenid.test246OpenIDFunctionalTestCase->addIdentity()
Found the Add an OpenID buttonOtheropenid.test246OpenIDFunctionalTestCase->addIdentity()
Found the requested form fields at user//openidOtheropenid.test246OpenIDFunctionalTestCase->addIdentity()
OpenID redirect page was displayed.Otheropenid.test256OpenIDFunctionalTestCase->addIdentity()
Found the Send buttonOtheropenid.test259OpenIDFunctionalTestCase->addIdentity()
Found the requested form fields at Otheropenid.test259OpenIDFunctionalTestCase->addIdentity()
Identity http://pifr-mysql/checkout/?q=openid-test/yadis/xrds was added.Otheropenid.test265OpenIDFunctionalTestCase->addIdentity()
ExpandOptions widgets (OptionsWidgetsTestCase) [Field types]012
MessageGroupFilenameLineFunctionStatus
The test did not complete due to a fatal error.Completion checkoptions.test60OptionsWidgetsTestCase->testRadioButtons()
Undefined property: stdClass::$ridNoticeuser.module2746user_role_save()
Undefined property: stdClass::$ridNoticedrupal_web_test_case.php1045DrupalWebTestCase->drupalCreateRole()
ExpandPage cache test (BootstrapPageCacheTestCase) [Bootstrap]5106
MessageGroupFilenameLineFunctionStatus
Undefined property: stdClass::$ridNoticeuser.module2746user_role_save()
Undefined property: stdClass::$ridNoticedrupal_web_test_case.php1045DrupalWebTestCase->drupalCreateRole()
PDOException: SQLSTATE[23000]: Integrity constraint violation: 1048 Column 'rid' cannot be null: INSERT INTO {role_permission} (rid, permission, module) VALUES (:db_insert_placeholder_0, :db_insert_placeholder_1, :db_insert_placeholder_2); Array ( [:db_insert_placeholder_0] => [:db_insert_placeholder_1] => access comments [:db_insert_placeholder_2] => comment ) in user_role_grant_permissions() (line 2885 of /var/lib/drupaltestbot/sites/default/files/checkout/modules/user/user.module).Uncaught exceptiondatabase.inc1967PDOStatement->execute()
Undefined property: stdClass::$ridNoticeuser.module2746user_role_save()
Undefined property: stdClass::$ridNoticedrupal_web_test_case.php1045DrupalWebTestCase->drupalCreateRole()
PDOException: SQLSTATE[23000]: Integrity constraint violation: 1048 Column 'rid' cannot be null: INSERT INTO {role_permission} (rid, permission, module) VALUES (:db_insert_placeholder_0, :db_insert_placeholder_1, :db_insert_placeholder_2); Array ( [:db_insert_placeholder_0] => [:db_insert_placeholder_1] => access comments [:db_insert_placeholder_2] => comment ) in user_role_grant_permissions() (line 2885 of /var/lib/drupaltestbot/sites/default/files/checkout/modules/user/user.module).Uncaught exceptiondatabase.inc1967PDOStatement->execute()
ExpandPath alias functionality (PathTestCase) [Path]012
MessageGroupFilenameLineFunctionStatus
The test did not complete due to a fatal error.Completion checkpath.test29PathTestCase->testPathCache()
Undefined property: stdClass::$ridNoticeuser.module2746user_role_save()
Undefined property: stdClass::$ridNoticedrupal_web_test_case.php1045DrupalWebTestCase->drupalCreateRole()
ExpandPath aliases with languages (PathLanguageUITestCase) [Path]012
MessageGroupFilenameLineFunctionStatus
The test did not complete due to a fatal error.Completion checkpath.test401PathLanguageUITestCase->testLanguageNeutralURLs()
Undefined property: stdClass::$ridNoticeuser.module2746user_role_save()
Undefined property: stdClass::$ridNoticedrupal_web_test_case.php1045DrupalWebTestCase->drupalCreateRole()
ExpandPath aliases with translated nodes (PathLanguageTestCase) [Path]012
MessageGroupFilenameLineFunctionStatus
The test did not complete due to a fatal error.Completion checkpath.test262PathLanguageTestCase->testAliasTranslation()
Undefined property: stdClass::$ridNoticeuser.module2746user_role_save()
Undefined property: stdClass::$ridNoticedrupal_web_test_case.php1045DrupalWebTestCase->drupalCreateRole()
ExpandPath language settings (LocalePathFunctionalTest) [Locale]003
MessageGroupFilenameLineFunctionStatus
Undefined property: stdClass::$ridNoticeuser.module2746user_role_save()
Undefined property: stdClass::$ridNoticedrupal_web_test_case.php1045DrupalWebTestCase->drupalCreateRole()
PDOException: SQLSTATE[23000]: Integrity constraint violation: 1048 Column 'rid' cannot be null: INSERT INTO {role_permission} (rid, permission, module) VALUES (:db_insert_placeholder_0, :db_insert_placeholder_1, :db_insert_placeholder_2); Array ( [:db_insert_placeholder_0] => [:db_insert_placeholder_1] => administer languages [:db_insert_placeholder_2] => locale ) in user_role_grant_permissions() (line 2885 of /var/lib/drupaltestbot/sites/default/files/checkout/modules/user/user.module).Uncaught exceptiondatabase.inc1967PDOStatement->execute()
ExpandPaths on non-English monolingual sites (PathMonolingualTestCase) [Path]012
MessageGroupFilenameLineFunctionStatus
The test did not complete due to a fatal error.Completion checkpath.test492PathMonolingualTestCase->testPageLinks()
Undefined property: stdClass::$ridNoticeuser.module2746user_role_save()
Undefined property: stdClass::$ridNoticedrupal_web_test_case.php1045DrupalWebTestCase->drupalCreateRole()
ExpandPersonal contact form (ContactPersonalTestCase) [Contact]012
MessageGroupFilenameLineFunctionStatus
The test did not complete due to a fatal error.Completion checkcontact.test310ContactPersonalTestCase->testPersonalContactAccess()
Undefined property: stdClass::$ridNoticeuser.module2746user_role_save()
Undefined property: stdClass::$ridNoticedrupal_web_test_case.php1045DrupalWebTestCase->drupalCreateRole()
ExpandPHP filter access check (PHPAccessTestCase) [PHP]012
MessageGroupFilenameLineFunctionStatus
The test did not complete due to a fatal error.Completion checkphp.test105PHPAccessTestCase->testNoPrivileges()
ExpandPHP filter functionality (PHPFilterTestCase) [PHP]012
MessageGroupFilenameLineFunctionStatus
The test did not complete due to a fatal error.Completion checkphp.test64PHPFilterTestCase->testPHPFilter()
LeafPoll add choice (PollJSAddChoice) [Poll]003
LeafPoll create (PollCreateTestCase) [Poll]106
LeafPoll expiration (PollExpirationTestCase) [Poll]103
LeafPoll token replacement (PollTokenReplaceTestCase) [Poll]103
LeafPoll vote (PollVoteTestCase) [Poll]103
LeafProfile browsing (ProfileTestBrowsing) [Profile]012
LeafRDF comment mapping (RdfCommentAttributesTestCase) [RDF]012
LeafRDF mapping definition functionality (RdfMappingDefinitionTestCase) [RDF]1703
LeafRDFa markup (RdfRdfaMarkupTestCase) [RDF]503
ExpandRemove feed functionality (RemoveFeedTestCase) [Aggregator]012
MessageGroupFilenameLineFunctionStatus
The test did not complete due to a fatal error.Completion checkaggregator.test410RemoveFeedTestCase->testRemoveFeed()
Undefined property: stdClass::$ridNoticeuser.module2746user_role_save()
Undefined property: stdClass::$ridNoticedrupal_web_test_case.php1045DrupalWebTestCase->drupalCreateRole()
ExpandRemove feed item functionality (RemoveFeedItemTestCase) [Aggregator]012
MessageGroupFilenameLineFunctionStatus
The test did not complete due to a fatal error.Completion checkaggregator.test499RemoveFeedItemTestCase->testRemoveFeedItem()
Undefined property: stdClass::$ridNoticeuser.module2746user_role_save()
Undefined property: stdClass::$ridNoticedrupal_web_test_case.php1045DrupalWebTestCase->drupalCreateRole()
ExpandRequired modules (ModuleRequiredTestCase) [Module]012
MessageGroupFilenameLineFunctionStatus
The test did not complete due to a fatal error.Completion checksystem.test428ModuleRequiredTestCase->testDisableRequired()
Undefined property: stdClass::$ridNoticeuser.module2746user_role_save()
Undefined property: stdClass::$ridNoticedrupal_web_test_case.php1045DrupalWebTestCase->drupalCreateRole()
ExpandRequirements hook failure (HookRequirementsTestCase) [Module]012
MessageGroupFilenameLineFunctionStatus
The test did not complete due to a fatal error.Completion checksystem.test187HookRequirementsTestCase->testHookRequirementsFailure()
Undefined property: stdClass::$ridNoticeuser.module2746user_role_save()
Undefined property: stdClass::$ridNoticedrupal_web_test_case.php1045DrupalWebTestCase->drupalCreateRole()
LeafRole assignment (UserRolesAssignmentTestCase) [User]012
LeafRole permissions (UserPermissionsTestCase) [User]012
LeafSearch engine phrase queries (SearchExactTestCase) [Search]003
LeafSearch engine ranking (SearchRankingTestCase) [Search]009
LeafSearch page override (SearchPageOverride) [Search]012
LeafSearch page text (SearchPageText) [Search]012
ExpandSecurity (FilterSecurityTestCase) [Filter]012
MessageGroupFilenameLineFunctionStatus
The test did not complete due to a fatal error.Completion checkfilter.test742FilterSecurityTestCase->testDisableFilterModule()
Undefined property: stdClass::$ridNoticeuser.module2746user_role_save()
Undefined property: stdClass::$ridNoticedrupal_web_test_case.php1045DrupalWebTestCase->drupalCreateRole()
ExpandSelect tests, complex 2 (DatabaseSelectComplexTestCase2) [Database]503
MessageGroupFilenameLineFunctionStatus
Undefined property: stdClass::$ridNoticeuser.module2746user_role_save()
Undefined property: stdClass::$ridNoticedrupal_web_test_case.php1045DrupalWebTestCase->drupalCreateRole()
PDOException: SQLSTATE[23000]: Integrity constraint violation: 1048 Column 'rid' cannot be null: INSERT INTO {role_permission} (rid, permission, module) VALUES (:db_insert_placeholder_0, :db_insert_placeholder_1, :db_insert_placeholder_2); Array ( [:db_insert_placeholder_0] => [:db_insert_placeholder_1] => access content [:db_insert_placeholder_2] => node ) in user_role_grant_permissions() (line 2885 of /var/lib/drupaltestbot/sites/default/files/checkout/modules/user/user.module).Uncaught exceptiondatabase.inc1967PDOStatement->execute()
LeafSession https handling (SessionHttpsTestCase) [Session]003
LeafSession tests (SessionTestCase) [Session]3906
LeafShortcut link functionality (ShortcutLinksTestCase) [Shortcut]012
LeafShortcut set functionality (ShortcutSetsTestCase) [Shortcut]012
LeafSimpleTest functionality (SimpleTestFunctionalTest) [SimpleTest]012
LeafSite maintenance mode functionality (SiteMaintenanceTestCase) [System]012
ExpandSite-wide contact form (ContactSitewideTestCase) [Contact]006
MessageGroupFilenameLineFunctionStatus
Undefined property: stdClass::$ridNoticeuser.module2746user_role_save()
Undefined property: stdClass::$ridNoticedrupal_web_test_case.php1045DrupalWebTestCase->drupalCreateRole()
PDOException: SQLSTATE[23000]: Integrity constraint violation: 1048 Column 'rid' cannot be null: INSERT INTO {role_permission} (rid, permission, module) VALUES (:db_insert_placeholder_0, :db_insert_placeholder_1, :db_insert_placeholder_2); Array ( [:db_insert_placeholder_0] => [:db_insert_placeholder_1] => access site-wide contact form [:db_insert_placeholder_2] => contact ) in user_role_grant_permissions() (line 2885 of /var/lib/drupaltestbot/sites/default/files/checkout/modules/user/user.module).Uncaught exceptiondatabase.inc1967PDOStatement->execute()
Undefined property: stdClass::$ridNoticeuser.module2746user_role_save()
Undefined property: stdClass::$ridNoticedrupal_web_test_case.php1045DrupalWebTestCase->drupalCreateRole()
PDOException: SQLSTATE[23000]: Integrity constraint violation: 1048 Column 'rid' cannot be null: INSERT INTO {role_permission} (rid, permission, module) VALUES (:db_insert_placeholder_0, :db_insert_placeholder_1, :db_insert_placeholder_2); Array ( [:db_insert_placeholder_0] => [:db_insert_placeholder_1] => access site-wide contact form [:db_insert_placeholder_2] => contact ) in user_role_grant_permissions() (line 2885 of /var/lib/drupaltestbot/sites/default/files/checkout/modules/user/user.module).Uncaught exceptiondatabase.inc1967PDOStatement->execute()
LeafStatistics reports tests (StatisticsReportsTestCase) [Statistics]012
LeafStatistics token replacement (StatisticsTokenReplaceTestCase) [Statistics]012
ExpandString translate, search and validate (LocaleTranslationFunctionalTest) [Locale]0012
MessageGroupFilenameLineFunctionStatus
Undefined property: stdClass::$ridNoticeuser.module2746user_role_save()
Undefined property: stdClass::$ridNoticedrupal_web_test_case.php1045DrupalWebTestCase->drupalCreateRole()
PDOException: SQLSTATE[23000]: Integrity constraint violation: 1048 Column 'rid' cannot be null: INSERT INTO {role_permission} (rid, permission, module) VALUES (:db_insert_placeholder_0, :db_insert_placeholder_1, :db_insert_placeholder_2); Array ( [:db_insert_placeholder_0] => [:db_insert_placeholder_1] => administer languages [:db_insert_placeholder_2] => locale ) in user_role_grant_permissions() (line 2885 of /var/lib/drupaltestbot/sites/default/files/checkout/modules/user/user.module).Uncaught exceptiondatabase.inc1967PDOStatement->execute()
Undefined property: stdClass::$ridNoticeuser.module2746user_role_save()
Undefined property: stdClass::$ridNoticedrupal_web_test_case.php1045DrupalWebTestCase->drupalCreateRole()
PDOException: SQLSTATE[23000]: Integrity constraint violation: 1048 Column 'rid' cannot be null: INSERT INTO {role_permission} (rid, permission, module) VALUES (:db_insert_placeholder_0, :db_insert_placeholder_1, :db_insert_placeholder_2); Array ( [:db_insert_placeholder_0] => [:db_insert_placeholder_1] => translate interface [:db_insert_placeholder_2] => locale ) in user_role_grant_permissions() (line 2885 of /var/lib/drupaltestbot/sites/default/files/checkout/modules/user/user.module).Uncaught exceptiondatabase.inc1967PDOStatement->execute()
Undefined property: stdClass::$ridNoticeuser.module2746user_role_save()
Undefined property: stdClass::$ridNoticedrupal_web_test_case.php1045DrupalWebTestCase->drupalCreateRole()
PDOException: SQLSTATE[23000]: Integrity constraint violation: 1048 Column 'rid' cannot be null: INSERT INTO {role_permission} (rid, permission, module) VALUES (:db_insert_placeholder_0, :db_insert_placeholder_1, :db_insert_placeholder_2); Array ( [:db_insert_placeholder_0] => [:db_insert_placeholder_1] => administer languages [:db_insert_placeholder_2] => locale ) in user_role_grant_permissions() (line 2885 of /var/lib/drupaltestbot/sites/default/files/checkout/modules/user/user.module).Uncaught exceptiondatabase.inc1967PDOStatement->execute()
Undefined property: stdClass::$ridNoticeuser.module2746user_role_save()
Undefined property: stdClass::$ridNoticedrupal_web_test_case.php1045DrupalWebTestCase->drupalCreateRole()
PDOException: SQLSTATE[23000]: Integrity constraint violation: 1048 Column 'rid' cannot be null: INSERT INTO {role_permission} (rid, permission, module) VALUES (:db_insert_placeholder_0, :db_insert_placeholder_1, :db_insert_placeholder_2); Array ( [:db_insert_placeholder_0] => [:db_insert_placeholder_1] => administer languages [:db_insert_placeholder_2] => locale ) in user_role_grant_permissions() (line 2885 of /var/lib/drupaltestbot/sites/default/files/checkout/modules/user/user.module).Uncaught exceptiondatabase.inc1967PDOStatement->execute()
ExpandSummary length (SummaryLengthTestCase) [Node]103
MessageGroupFilenameLineFunctionStatus
Undefined property: stdClass::$ridNoticeuser.module2746user_role_save()
Undefined property: stdClass::$ridNoticedrupal_web_test_case.php1045DrupalWebTestCase->drupalCreateRole()
PDOException: SQLSTATE[23000]: Integrity constraint violation: 1048 Column 'rid' cannot be null: INSERT INTO {role_permission} (rid, permission, module) VALUES (:db_insert_placeholder_0, :db_insert_placeholder_1, :db_insert_placeholder_2); Array ( [:db_insert_placeholder_0] => [:db_insert_placeholder_1] => access content [:db_insert_placeholder_2] => node ) in user_role_grant_permissions() (line 2885 of /var/lib/drupaltestbot/sites/default/files/checkout/modules/user/user.module).Uncaught exceptiondatabase.inc1967PDOStatement->execute()
LeafSyslog functionality (SyslogTestCase) [Syslog]003
LeafTaxonomy term functions and forms. (TaxonomyTermTestCase) [Taxonomy]012
LeafTaxonomy term hooks (TaxonomyHooksTestCase) [Taxonomy]012
LeafTaxonomy term multiple loading (TaxonomyLoadMultipleUnitTest) [Taxonomy]012
LeafTaxonomy term reference field (TaxonomyTermFieldTestCase) [Taxonomy]012
ExpandTaxonomy term URL aliases (PathTaxonomyTermTestCase) [Path]012
MessageGroupFilenameLineFunctionStatus
The test did not complete due to a fatal error.Completion checkpath.test191PathTaxonomyTermTestCase->testTermAlias()
Undefined property: stdClass::$ridNoticeuser.module2746user_role_save()
Undefined property: stdClass::$ridNoticedrupal_web_test_case.php1045DrupalWebTestCase->drupalCreateRole()
LeafTaxonomy token replacement (TaxonomyTokenReplaceTestCase) [Taxonomy]012
LeafTaxonomy vocabularies (TaxonomyVocabularyUnitTest) [Taxonomy]012
LeafTaxonomy vocabulary interface (TaxonomyVocabularyFunctionalTest) [Taxonomy]012
LeafTest date field (ProfileTestDate) [Profile]012
LeafTest field weights (ProfileTestWeights) [Profile]012
LeafTest select field (ProfileTestSelect) [Profile]012
LeafTest single fields (ProfileTestFields) [Profile]012
LeafTest statistics admin. (StatisticsAdminTestCase) [Statistics]012
LeafTest user actions (TriggerUserActionTestCase) [Trigger]003
LeafTest user triggers (TriggerUserTokenTestCase) [Trigger]003
ExpandText field (TextFieldTestCase) [Field types]012
MessageGroupFilenameLineFunctionStatus
The test did not complete due to a fatal error.Completion checktext.test30TextFieldTestCase->testTextFieldValidation()
Undefined property: stdClass::$ridNoticeuser.module2746user_role_save()
Undefined property: stdClass::$ridNoticedrupal_web_test_case.php1045DrupalWebTestCase->drupalCreateRole()
ExpandText translation (TextTranslationTestCase) [Field types]012
MessageGroupFilenameLineFunctionStatus
The test did not complete due to a fatal error.Completion checktext.test407TextTranslationTestCase->testTextField()
Undefined property: stdClass::$ridNoticeuser.module2746user_role_save()
Undefined property: stdClass::$ridNoticedrupal_web_test_case.php1045DrupalWebTestCase->drupalCreateRole()
LeafTheme fast initialization (ThemeFastTestCase) [Theme]012
LeafTheme interface functionality (SystemThemeFunctionalTest) [System]012
LeafToken replacement (TokenReplaceTestCase) [System]2003
LeafTop visitor blocking (StatisticsBlockVisitorsTestCase) [Statistics]012
LeafTracker (TrackerTest) [Tracker]012
ExpandTranslation export (LocaleExportFunctionalTest) [Locale]012
MessageGroupFilenameLineFunctionStatus
The test did not complete due to a fatal error.Completion checklocale.test905LocaleExportFunctionalTest->testExportTranslation()
Undefined property: stdClass::$ridNoticeuser.module2746user_role_save()
Undefined property: stdClass::$ridNoticedrupal_web_test_case.php1045DrupalWebTestCase->drupalCreateRole()
LeafTranslation functionality (TranslationTestCase) [Translation]003
ExpandTranslation import (LocaleImportFunctionalTest) [Locale]012
MessageGroupFilenameLineFunctionStatus
The test did not complete due to a fatal error.Completion checklocale.test604LocaleImportFunctionalTest->testStandalonePoFile()
Undefined property: stdClass::$ridNoticeuser.module2746user_role_save()
Undefined property: stdClass::$ridNoticedrupal_web_test_case.php1045DrupalWebTestCase->drupalCreateRole()
LeafTrigger content (node) actions (TriggerContentTestCase) [Trigger]006
LeafTrigger cron (system) actions (TriggerCronTestCase) [Trigger]003
LeafTrigger orphaned actions (TriggerOrphanedActionsTestCase) [Trigger]003
LeafTrigger other actions (TriggerOtherTestCase) [Trigger]009
ExpandUI language negotiation (LocaleUILanguageNegotiationTest) [Locale]003
MessageGroupFilenameLineFunctionStatus
Undefined property: stdClass::$ridNoticeuser.module2746user_role_save()
Undefined property: stdClass::$ridNoticedrupal_web_test_case.php1045DrupalWebTestCase->drupalCreateRole()
PDOException: SQLSTATE[23000]: Integrity constraint violation: 1048 Column 'rid' cannot be null: INSERT INTO {role_permission} (rid, permission, module) VALUES (:db_insert_placeholder_0, :db_insert_placeholder_1, :db_insert_placeholder_2); Array ( [:db_insert_placeholder_0] => [:db_insert_placeholder_1] => administer languages [:db_insert_placeholder_2] => locale ) in user_role_grant_permissions() (line 2885 of /var/lib/drupaltestbot/sites/default/files/checkout/modules/user/user.module).Uncaught exceptiondatabase.inc1967PDOStatement->execute()
LeafUpdate contrib functionality (UpdateTestContribCase) [Update]012
LeafUpdate core functionality (UpdateCoreTestCase) [Update]012
ExpandUpdate feed functionality (UpdateFeedTestCase) [Aggregator]012
MessageGroupFilenameLineFunctionStatus
The test did not complete due to a fatal error.Completion checkaggregator.test368UpdateFeedTestCase->testUpdateFeed()
Undefined property: stdClass::$ridNoticeuser.module2746user_role_save()
Undefined property: stdClass::$ridNoticedrupal_web_test_case.php1045DrupalWebTestCase->drupalCreateRole()
ExpandUpdate feed item functionality (UpdateFeedItemTestCase) [Aggregator]012
MessageGroupFilenameLineFunctionStatus
The test did not complete due to a fatal error.Completion checkaggregator.test438UpdateFeedItemTestCase->testUpdateFeedItem()
Undefined property: stdClass::$ridNoticeuser.module2746user_role_save()
Undefined property: stdClass::$ridNoticedrupal_web_test_case.php1045DrupalWebTestCase->drupalCreateRole()
LeafUpdate functionality (UpdateScriptFunctionalTest) [System]012
ExpandUpdate on cron functionality (AggregatorCronTestCase) [Aggregator]012
MessageGroupFilenameLineFunctionStatus
The test did not complete due to a fatal error.Completion checkaggregator.test718AggregatorCronTestCase->testCron()
Undefined property: stdClass::$ridNoticeuser.module2746user_role_save()
Undefined property: stdClass::$ridNoticedrupal_web_test_case.php1045DrupalWebTestCase->drupalCreateRole()
LeafUpload and extract module functionality (UpdateTestUploadCase) [Update]012
LeafUpload user picture (UserPictureTestCase) [User]012
LeafURL altering (UrlAlterFunctionalTest) [Path API]303
LeafUser administration (UserAdminTestCase) [User]014
LeafUser autocompletion (UserAutocompleteTestCase) [User]012
LeafUser blocks (UserBlocksUnitTests) [User]017
LeafUser create (UserCreateTestCase) [User]003
ExpandUser creation (LocaleUserCreationTest) [Locale]003
MessageGroupFilenameLineFunctionStatus
Undefined property: stdClass::$ridNoticeuser.module2746user_role_save()
Undefined property: stdClass::$ridNoticedrupal_web_test_case.php1045DrupalWebTestCase->drupalCreateRole()
PDOException: SQLSTATE[23000]: Integrity constraint violation: 1048 Column 'rid' cannot be null: INSERT INTO {role_permission} (rid, permission, module) VALUES (:db_insert_placeholder_0, :db_insert_placeholder_1, :db_insert_placeholder_2); Array ( [:db_insert_placeholder_0] => [:db_insert_placeholder_1] => administer languages [:db_insert_placeholder_2] => locale ) in user_role_grant_permissions() (line 2885 of /var/lib/drupaltestbot/sites/default/files/checkout/modules/user/user.module).Uncaught exceptiondatabase.inc1967PDOStatement->execute()
LeafUser edit (UserEditTestCase) [User]003
LeafUser edited own account (UserEditedOwnAccountTestCase) [User]003
ExpandUser language settings (LocaleUserLanguageFunctionalTest) [Locale]003
MessageGroupFilenameLineFunctionStatus
Undefined property: stdClass::$ridNoticeuser.module2746user_role_save()
Undefined property: stdClass::$ridNoticedrupal_web_test_case.php1045DrupalWebTestCase->drupalCreateRole()
PDOException: SQLSTATE[23000]: Integrity constraint violation: 1048 Column 'rid' cannot be null: INSERT INTO {role_permission} (rid, permission, module) VALUES (:db_insert_placeholder_0, :db_insert_placeholder_1, :db_insert_placeholder_2); Array ( [:db_insert_placeholder_0] => [:db_insert_placeholder_1] => administer languages [:db_insert_placeholder_2] => locale ) in user_role_grant_permissions() (line 2885 of /var/lib/drupaltestbot/sites/default/files/checkout/modules/user/user.module).Uncaught exceptiondatabase.inc1967PDOStatement->execute()
LeafUser login (UserLoginTestCase) [User]022
LeafUser poll vote capability. (PollVoteCheckHostname) [Poll]012
LeafUser registration (UserRegistrationTestCase) [User]5803
LeafUser role administration (UserRoleAdminTestCase) [User]012
LeafUser search (UserUserSearchTestCase) [User]003
LeafUser signatures (UserSignatureTestCase) [User]023
LeafUser time zones (UserTimeZoneFunctionalTest) [User]003
LeafUser token replacement (UserTokenReplaceTestCase) [User]014

All

Test namePassFailException
Leaf403 functionality (AccessDeniedTestCase) [System]012
Leaf404 functionality (PageNotFoundTestCase) [System]012
ExpandActions configuration (ActionsConfigurationTestCase) [Actions]003
MessageGroupFilenameLineFunctionStatus
Undefined property: stdClass::$ridNoticeuser.module2746user_role_save()
Undefined property: stdClass::$ridNoticedrupal_web_test_case.php1045DrupalWebTestCase->drupalCreateRole()
PDOException: SQLSTATE[23000]: Integrity constraint violation: 1048 Column 'rid' cannot be null: INSERT INTO {role_permission} (rid, permission, module) VALUES (:db_insert_placeholder_0, :db_insert_placeholder_1, :db_insert_placeholder_2); Array ( [:db_insert_placeholder_0] => [:db_insert_placeholder_1] => administer actions [:db_insert_placeholder_2] => system ) in user_role_grant_permissions() (line 2885 of /var/lib/drupaltestbot/sites/default/files/checkout/modules/user/user.module).Uncaught exceptiondatabase.inc1967PDOStatement->execute()
ExpandActions executing in a potentially infinite loop (ActionLoopTestCase) [Actions]003
MessageGroupFilenameLineFunctionStatus
Undefined property: stdClass::$ridNoticeuser.module2746user_role_save()
Undefined property: stdClass::$ridNoticedrupal_web_test_case.php1045DrupalWebTestCase->drupalCreateRole()
PDOException: SQLSTATE[23000]: Integrity constraint violation: 1048 Column 'rid' cannot be null: INSERT INTO {role_permission} (rid, permission, module) VALUES (:db_insert_placeholder_0, :db_insert_placeholder_1, :db_insert_placeholder_2); Array ( [:db_insert_placeholder_0] => [:db_insert_placeholder_1] => administer actions [:db_insert_placeholder_2] => system ) in user_role_grant_permissions() (line 2885 of /var/lib/drupaltestbot/sites/default/files/checkout/modules/user/user.module).Uncaught exceptiondatabase.inc1967PDOStatement->execute()
ExpandAdd feed functionality (AddFeedTestCase) [Aggregator]012
MessageGroupFilenameLineFunctionStatus
The test did not complete due to a fatal error.Completion checkaggregator.test294AddFeedTestCase->testAddFeed()
Undefined property: stdClass::$ridNoticeuser.module2746user_role_save()
Undefined property: stdClass::$ridNoticedrupal_web_test_case.php1045DrupalWebTestCase->drupalCreateRole()
ExpandAdmin theme block admin accessibility (BlockAdminThemeTestCase) [Block]003
MessageGroupFilenameLineFunctionStatus
Undefined property: stdClass::$ridNoticeuser.module2746user_role_save()
Undefined property: stdClass::$ridNoticedrupal_web_test_case.php1045DrupalWebTestCase->drupalCreateRole()
PDOException: SQLSTATE[23000]: Integrity constraint violation: 1048 Column 'rid' cannot be null: INSERT INTO {role_permission} (rid, permission, module) VALUES (:db_insert_placeholder_0, :db_insert_placeholder_1, :db_insert_placeholder_2); Array ( [:db_insert_placeholder_0] => [:db_insert_placeholder_1] => administer blocks [:db_insert_placeholder_2] => block ) in user_role_grant_permissions() (line 2885 of /var/lib/drupaltestbot/sites/default/files/checkout/modules/user/user.module).Uncaught exceptiondatabase.inc1967PDOStatement->execute()
LeafAdministrative pages (SystemAdminTestCase) [System]012
LeafAdvanced search form (SearchAdvancedSearchForm) [Search]012
ExpandAJAX command form values (AJAXFormValuesTestCase) [AJAX]012
MessageGroupFilenameLineFunctionStatus
The test did not complete due to a fatal error.Completion checkajax.test280AJAXFormValuesTestCase->testSimpleAJAXFormValue()
Undefined property: stdClass::$ridNoticeuser.module2746user_role_save()
Undefined property: stdClass::$ridNoticedrupal_web_test_case.php1045DrupalWebTestCase->drupalCreateRole()
ExpandAJAX commands (AJAXCommandsTestCase) [AJAX]003
MessageGroupFilenameLineFunctionStatus
Undefined property: stdClass::$ridNoticeuser.module2746user_role_save()
Undefined property: stdClass::$ridNoticedrupal_web_test_case.php1045DrupalWebTestCase->drupalCreateRole()
PDOException: SQLSTATE[23000]: Integrity constraint violation: 1048 Column 'rid' cannot be null: INSERT INTO {role_permission} (rid, permission, module) VALUES (:db_insert_placeholder_0, :db_insert_placeholder_1, :db_insert_placeholder_2); Array ( [:db_insert_placeholder_0] => [:db_insert_placeholder_1] => access content [:db_insert_placeholder_2] => node ) in user_role_grant_permissions() (line 2885 of /var/lib/drupaltestbot/sites/default/files/checkout/modules/user/user.module).Uncaught exceptiondatabase.inc1967PDOStatement->execute()
LeafAJAX framework (AJAXFrameworkTestCase) [AJAX]600
ExpandAJAX multi form (AJAXMultiFormTestCase) [AJAX]012
MessageGroupFilenameLineFunctionStatus
The test did not complete due to a fatal error.Completion checkajax.test347AJAXMultiFormTestCase->testMultiForm()
Undefined property: stdClass::$ridNoticeuser.module2746user_role_save()
Undefined property: stdClass::$ridNoticedrupal_web_test_case.php1045DrupalWebTestCase->drupalCreateRole()
ExpandAnonymous comments (CommentAnonymous) [Comment]012
MessageGroupFilenameLineFunctionStatus
The test did not complete due to a fatal error.Completion checkcomment.test492CommentAnonymous->testAnonymous()
Undefined property: stdClass::$ridNoticeuser.module2746user_role_save()
Undefined property: stdClass::$ridNoticedrupal_web_test_case.php1045DrupalWebTestCase->drupalCreateRole()
LeafAutocompletion (ProfileTestAutocomplete) [Profile]012
LeafBasic SQL syntax tests (DatabaseBasicSyntaxTestCase) [Database]2600
LeafBasic upgrade path (BasicUpgradePath) [Upgrade path]7300
LeafBatch percentages (BatchPercentagesUnitTestCase) [Batch API]1300
LeafBatch processing (BatchProcessingTestCase) [Batch API]15600
LeafBatch progress page (BatchPageTestCase) [Batch API]700
ExpandBlock availability (BookBlockTestCase) [Book]012
MessageGroupFilenameLineFunctionStatus
The test did not complete due to a fatal error.Completion checkbook.test267BookBlockTestCase->testBookNavigationBlock()
Undefined property: stdClass::$ridNoticeuser.module2746user_role_save()
Undefined property: stdClass::$ridNoticedrupal_web_test_case.php1045DrupalWebTestCase->drupalCreateRole()
ExpandBlock availability (NodeBlockTestCase) [Node]012
MessageGroupFilenameLineFunctionStatus
The test did not complete due to a fatal error.Completion checknode.test630NodeBlockTestCase->testSearchFormBlock()
Undefined property: stdClass::$ridNoticeuser.module2746user_role_save()
Undefined property: stdClass::$ridNoticedrupal_web_test_case.php1045DrupalWebTestCase->drupalCreateRole()
ExpandBlock availability (PollBlockTestCase) [Poll]012
MessageGroupFilenameLineFunctionStatus
The test did not complete due to a fatal error.Completion checkpoll.test261PollBlockTestCase->testRecentBlock()
LeafBlock availability (ProfileBlockTestCase) [Profile]012
LeafBlock availability (SearchBlockTestCase) [Search]012
ExpandBlock caching (BlockCacheTestCase) [Block]012
MessageGroupFilenameLineFunctionStatus
The test did not complete due to a fatal error.Completion checkblock.test428BlockCacheTestCase->testCachePerRole()
Undefined property: stdClass::$ridNoticeuser.module2746user_role_save()
Undefined property: stdClass::$ridNoticedrupal_web_test_case.php1045DrupalWebTestCase->drupalCreateRole()
ExpandBlock functionality (BlockTestCase) [Block]012
MessageGroupFilenameLineFunctionStatus
The test did not complete due to a fatal error.Completion checkblock.test46BlockTestCase->testCustomBlock()
Undefined property: stdClass::$ridNoticeuser.module2746user_role_save()
Undefined property: stdClass::$ridNoticedrupal_web_test_case.php1045DrupalWebTestCase->drupalCreateRole()
LeafBlock functionality (SystemBlockTestCase) [System]012
ExpandBlock HTML id (BlockHTMLIdTestCase) [Block]012
MessageGroupFilenameLineFunctionStatus
The test did not complete due to a fatal error.Completion checkblock.test608BlockHTMLIdTestCase->testHTMLId()
Undefined property: stdClass::$ridNoticeuser.module2746user_role_save()
Undefined property: stdClass::$ridNoticedrupal_web_test_case.php1045DrupalWebTestCase->drupalCreateRole()
ExpandBlog functionality (BlogTestCase) [Blog]012
MessageGroupFilenameLineFunctionStatus
The test did not complete due to a fatal error.Completion checkblog.test33BlogTestCase->testUnprivilegedUser()
Undefined property: stdClass::$ridNoticeuser.module2746user_role_save()
Undefined property: stdClass::$ridNoticedrupal_web_test_case.php1045DrupalWebTestCase->drupalCreateRole()
ExpandBook functionality (BookTestCase) [Book]012
MessageGroupFilenameLineFunctionStatus
The test did not complete due to a fatal error.Completion checkbook.test62BookTestCase->testBook()
Undefined property: stdClass::$ridNoticeuser.module2746user_role_save()
Undefined property: stdClass::$ridNoticedrupal_web_test_case.php1045DrupalWebTestCase->drupalCreateRole()
LeafBoot and exit hook invocation (HookBootExitTestCase) [Bootstrap]1800
ExpandBreadcrumbs (MenuBreadcrumbTestCase) [Menu]012
MessageGroupFilenameLineFunctionStatus
The test did not complete due to a fatal error.Completion checkmenu.test551MenuBreadcrumbTestCase->testBreadCrumbs()
Undefined property: stdClass::$ridNoticeuser.module2746user_role_save()
Undefined property: stdClass::$ridNoticedrupal_web_test_case.php1045DrupalWebTestCase->drupalCreateRole()
LeafCache clear test (CacheClearCase) [Cache]1300
LeafCache emptiness test (CacheIsEmptyCase) [Cache]500
LeafCache saving test (CacheSavingCase) [Cache]500
LeafCancel account (UserCancelTestCase) [User]9843
LeafCascading stylesheets (CascadingStylesheetsTestCase) [System]2500
ExpandCategorize feed functionality (CategorizeFeedTestCase) [Aggregator]012
MessageGroupFilenameLineFunctionStatus
The test did not complete due to a fatal error.Completion checkaggregator.test325CategorizeFeedTestCase->testCategorizeFeed()
Undefined property: stdClass::$ridNoticeuser.module2746user_role_save()
Undefined property: stdClass::$ridNoticedrupal_web_test_case.php1045DrupalWebTestCase->drupalCreateRole()
ExpandCategorize feed item functionality (CategorizeFeedItemTestCase) [Aggregator]012
MessageGroupFilenameLineFunctionStatus
The test did not complete due to a fatal error.Completion checkaggregator.test538CategorizeFeedItemTestCase->testCategorizeFeedItem()
Undefined property: stdClass::$ridNoticeuser.module2746user_role_save()
Undefined property: stdClass::$ridNoticedrupal_web_test_case.php1045DrupalWebTestCase->drupalCreateRole()
ExpandChecks display of aggregator items (AggregatorRenderingTestCase) [Aggregator]012
MessageGroupFilenameLineFunctionStatus
The test did not complete due to a fatal error.Completion checkaggregator.test766AggregatorRenderingTestCase->testBlockLinks()
Undefined property: stdClass::$ridNoticeuser.module2746user_role_save()
Undefined property: stdClass::$ridNoticedrupal_web_test_case.php1045DrupalWebTestCase->drupalCreateRole()
LeafCJK tokenizer (SearchTokenizerTestCase) [Search]200
ExpandColor functionality (ColorTestCase) [Color]012
MessageGroupFilenameLineFunctionStatus
The test did not complete due to a fatal error.Completion checkcolor.test49ColorTestCase->testColor()
Undefined property: stdClass::$ridNoticeuser.module2746user_role_save()
Undefined property: stdClass::$ridNoticedrupal_web_test_case.php1045DrupalWebTestCase->drupalCreateRole()
ExpandComment approval (CommentApprovalTest) [Comment]012
MessageGroupFilenameLineFunctionStatus
The test did not complete due to a fatal error.Completion checkcomment.test888CommentApprovalTest->testApprovalAdminInterface()
Undefined property: stdClass::$ridNoticeuser.module2746user_role_save()
Undefined property: stdClass::$ridNoticedrupal_web_test_case.php1045DrupalWebTestCase->drupalCreateRole()
ExpandComment blocks (CommentBlockFunctionalTest) [Comment]012
MessageGroupFilenameLineFunctionStatus
The test did not complete due to a fatal error.Completion checkcomment.test1012CommentBlockFunctionalTest->testRecentCommentBlock()
Undefined property: stdClass::$ridNoticeuser.module2746user_role_save()
Undefined property: stdClass::$ridNoticedrupal_web_test_case.php1045DrupalWebTestCase->drupalCreateRole()
LeafComment count toggle (SearchCommentCountToggleTestCase) [Search]012
ExpandComment interface (CommentInterfaceTest) [Comment]012
MessageGroupFilenameLineFunctionStatus
The test did not complete due to a fatal error.Completion checkcomment.test264CommentInterfaceTest->testCommentInterface()
Undefined property: stdClass::$ridNoticeuser.module2746user_role_save()
Undefined property: stdClass::$ridNoticedrupal_web_test_case.php1045DrupalWebTestCase->drupalCreateRole()
ExpandComment paging settings (CommentPagerTest) [Comment]012
MessageGroupFilenameLineFunctionStatus
The test did not complete due to a fatal error.Completion checkcomment.test626CommentPagerTest->testCommentPaging()
Undefined property: stdClass::$ridNoticeuser.module2746user_role_save()
Undefined property: stdClass::$ridNoticedrupal_web_test_case.php1045DrupalWebTestCase->drupalCreateRole()
ExpandComment preview (CommentPreviewTest) [Comment]012
MessageGroupFilenameLineFunctionStatus
The test did not complete due to a fatal error.Completion checkcomment.test410CommentPreviewTest->testCommentPreview()
Undefined property: stdClass::$ridNoticeuser.module2746user_role_save()
Undefined property: stdClass::$ridNoticedrupal_web_test_case.php1045DrupalWebTestCase->drupalCreateRole()
ExpandComment Rebuild (CommentContentRebuild) [Comment]012
MessageGroupFilenameLineFunctionStatus
The test did not complete due to a fatal error.Completion checkcomment.test1137CommentContentRebuild->testCommentRebuild()
Undefined property: stdClass::$ridNoticeuser.module2746user_role_save()
Undefined property: stdClass::$ridNoticedrupal_web_test_case.php1045DrupalWebTestCase->drupalCreateRole()
ExpandComment RSS (CommentRSSUnitTest) [Comment]012
MessageGroupFilenameLineFunctionStatus
The test did not complete due to a fatal error.Completion checkcomment.test1104CommentRSSUnitTest->testCommentRSS()
Undefined property: stdClass::$ridNoticeuser.module2746user_role_save()
Undefined property: stdClass::$ridNoticedrupal_web_test_case.php1045DrupalWebTestCase->drupalCreateRole()
LeafComment Search tests (SearchCommentTestCase) [Search]012
ExpandComment token replacement (CommentTokenReplaceTestCase) [Comment]012
MessageGroupFilenameLineFunctionStatus
The test did not complete due to a fatal error.Completion checkcomment.test1176CommentTokenReplaceTestCase->testCommentTokenReplacement()
Undefined property: stdClass::$ridNoticeuser.module2746user_role_save()
Undefined property: stdClass::$ridNoticedrupal_web_test_case.php1045DrupalWebTestCase->drupalCreateRole()
LeafComment upgrade path (CommentUpgradePathTestCase) [Upgrade path]2600
LeafConfig settings form (SearchConfigSettingsForm) [Search]012
LeafConnection tests (DatabaseConnectionTestCase) [Database]3400
ExpandContent language settings (LocaleContentFunctionalTest) [Locale]003
MessageGroupFilenameLineFunctionStatus
Undefined property: stdClass::$ridNoticeuser.module2746user_role_save()
Undefined property: stdClass::$ridNoticedrupal_web_test_case.php1045DrupalWebTestCase->drupalCreateRole()
PDOException: SQLSTATE[23000]: Integrity constraint violation: 1048 Column 'rid' cannot be null: INSERT INTO {role_permission} (rid, permission, module) VALUES (:db_insert_placeholder_0, :db_insert_placeholder_1, :db_insert_placeholder_2); Array ( [:db_insert_placeholder_0] => [:db_insert_placeholder_1] => administer languages [:db_insert_placeholder_2] => locale ) in user_role_grant_permissions() (line 2885 of /var/lib/drupaltestbot/sites/default/files/checkout/modules/user/user.module).Uncaught exceptiondatabase.inc1967PDOStatement->execute()
LeafCron run (CronRunTestCase) [System]2303
LeafCSS Unit Tests (CascadingStylesheetsUnitTest) [System]600
LeafCustom query syntax tests (DatabaseQueryTestCase) [Database]600
ExpandDashboard blocks (DashboardBlocksTestCase) [Dashboard]012
MessageGroupFilenameLineFunctionStatus
The test did not complete due to a fatal error.Completion checkdashboard.test39DashboardBlocksTestCase->testDashboardAccess()
Undefined property: stdClass::$ridNoticeuser.module2746user_role_save()
Undefined property: stdClass::$ridNoticedrupal_web_test_case.php1045DrupalWebTestCase->drupalCreateRole()
LeafData API functions (DrupalDataApiTest) [System]3200
LeafDate and time (DateTimeFunctionalTest) [System]012
ExpandDBLog functionality (DBLogTestCase) [DBLog]012
MessageGroupFilenameLineFunctionStatus
The test did not complete due to a fatal error.Completion checkdblog.test29DBLogTestCase->testDBLog()
Undefined property: stdClass::$ridNoticeuser.module2746user_role_save()
Undefined property: stdClass::$ridNoticedrupal_web_test_case.php1045DrupalWebTestCase->drupalCreateRole()
ExpandDefault text format functionality (FilterDefaultFormatTestCase) [Filter]003
MessageGroupFilenameLineFunctionStatus
Undefined property: stdClass::$ridNoticeuser.module2746user_role_save()
Undefined property: stdClass::$ridNoticedrupal_web_test_case.php1045DrupalWebTestCase->drupalCreateRole()
PDOException: SQLSTATE[23000]: Integrity constraint violation: 1048 Column 'rid' cannot be null: INSERT INTO {role_permission} (rid, permission, module) VALUES (:db_insert_placeholder_0, :db_insert_placeholder_1, :db_insert_placeholder_2); Array ( [:db_insert_placeholder_0] => [:db_insert_placeholder_1] => administer filters [:db_insert_placeholder_2] => filter ) in user_role_grant_permissions() (line 2885 of /var/lib/drupaltestbot/sites/default/files/checkout/modules/user/user.module).Uncaught exceptiondatabase.inc1967PDOStatement->execute()
LeafDelete/Truncate tests (DatabaseDeleteTruncateTestCase) [Database]2000
LeafDrupal error handlers (DrupalErrorHandlerUnitTest) [System]2800
LeafDrupal goto (DrupalGotoTest) [System]1800
LeafDrupal HTTP request (DrupalHTTPRequestTestCase) [System]2700
LeafDrupal match path (DrupalMatchPathTestCase) [Path API]4100
LeafDrupal set/get regions (DrupalSetContentTestCase) [System]3800
LeafDrupal tags handling (DrupalTagsHandlingTestCase) [System]800
Leafdrupal_alter() tests (DrupalAlterTestCase) [System]500
Leafdrupal_render() (DrupalRenderTestCase) [System]3300
LeafEmbedded forms (SearchEmbedForm) [Search]012
LeafEmpty statement (DatabaseEmptyStatementTestCase) [Database]400
ExpandEnable/disable modules (EnableDisableTestCase) [Module]012
MessageGroupFilenameLineFunctionStatus
The test did not complete due to a fatal error.Completion checksystem.test108EnableDisableTestCase->testEnableDisable()
Undefined property: stdClass::$ridNoticeuser.module2746user_role_save()
Undefined property: stdClass::$ridNoticedrupal_web_test_case.php1045DrupalWebTestCase->drupalCreateRole()
LeafEntity properties (EntityPropertiesTestCase) [Entity API]300
LeafEntity query (EntityFieldQueryTestCase) [Entity API]8500
ExpandFeed parser functionality (FeedParserTestCase) [Aggregator]012
MessageGroupFilenameLineFunctionStatus
The test did not complete due to a fatal error.Completion checkaggregator.test836FeedParserTestCase->testRSS091Sample()
Undefined property: stdClass::$ridNoticeuser.module2746user_role_save()
Undefined property: stdClass::$ridNoticedrupal_web_test_case.php1045DrupalWebTestCase->drupalCreateRole()
LeafFetch tests (DatabaseFetchTestCase) [Database]3300
LeafFetch tests, part 2 (DatabaseFetch2TestCase) [Database]2600
LeafFetching multiple cache items (CacheGetMultipleUnitTest) [Cache]700
LeafField attach tests (other) (FieldAttachOtherTestCase) [Field API]4400
LeafField attach tests (storage-related) (FieldAttachStorageTestCase) [Field API]8300
LeafField bulk delete tests (FieldBulkDeleteTestCase) [Field API]4000
LeafField CRUD tests (FieldCrudTestCase) [Field API]5900
LeafField Display API tests (FieldDisplayAPITestCase) [Field API]4200
ExpandField form tests (FieldFormTestCase) [Field API]012
MessageGroupFilenameLineFunctionStatus
The test did not complete due to a fatal error.Completion checkfield.test1238FieldFormTestCase->testFieldFormSingle()
Undefined property: stdClass::$ridNoticeuser.module2746user_role_save()
Undefined property: stdClass::$ridNoticedrupal_web_test_case.php1045DrupalWebTestCase->drupalCreateRole()
LeafField info tests (FieldInfoTestCase) [Field API]7900
LeafField instance CRUD tests (FieldInstanceCrudTestCase) [Field API]3200
LeafField SQL storage tests (FieldSqlStorageTestCase) [Field API]8800
ExpandField translations tests (FieldTranslationsTestCase) [Field API]2803
MessageGroupFilenameLineFunctionStatus
Undefined property: stdClass::$ridNoticeuser.module2746user_role_save()
Undefined property: stdClass::$ridNoticedrupal_web_test_case.php1045DrupalWebTestCase->drupalCreateRole()
PDOException: SQLSTATE[23000]: Integrity constraint violation: 1048 Column 'rid' cannot be null: INSERT INTO {role_permission} (rid, permission, module) VALUES (:db_insert_placeholder_0, :db_insert_placeholder_1, :db_insert_placeholder_2); Array ( [:db_insert_placeholder_0] => [:db_insert_placeholder_1] => access field_test content [:db_insert_placeholder_2] => field_test ) in user_role_grant_permissions() (line 2885 of /var/lib/drupaltestbot/sites/default/files/checkout/modules/user/user.module).Uncaught exceptiondatabase.inc1967PDOStatement->execute()
ExpandField UI tests (FieldUITestCase) [Field UI]012
MessageGroupFilenameLineFunctionStatus
The test did not complete due to a fatal error.Completion checkfield_ui.test47FieldUITestCase->testCRUDFields()
Undefined property: stdClass::$ridNoticeuser.module2746user_role_save()
Undefined property: stdClass::$ridNoticedrupal_web_test_case.php1045DrupalWebTestCase->drupalCreateRole()
LeafFile copying (FileCopyTest) [File API]10600
LeafFile delete (FileDeleteTest) [File API]1800
LeafFile download (FileDownloadTest) [File API]3500
ExpandFile field display tests (FileFieldDisplayTestCase) [File]012
MessageGroupFilenameLineFunctionStatus
The test did not complete due to a fatal error.Completion checkfile.test509FileFieldDisplayTestCase->testNodeDisplay()
Undefined property: stdClass::$ridNoticeuser.module2746user_role_save()
Undefined property: stdClass::$ridNoticedrupal_web_test_case.php1045DrupalWebTestCase->drupalCreateRole()
ExpandFile field file path tests (FileFieldPathTestCase) [File]012
MessageGroupFilenameLineFunctionStatus
The test did not complete due to a fatal error.Completion checkfile.test721FileFieldPathTestCase->testUploadPath()
Undefined property: stdClass::$ridNoticeuser.module2746user_role_save()
Undefined property: stdClass::$ridNoticedrupal_web_test_case.php1045DrupalWebTestCase->drupalCreateRole()
ExpandFile field revision test (FileFieldRevisionTestCase) [File]012
MessageGroupFilenameLineFunctionStatus
The test did not complete due to a fatal error.Completion checkfile.test402FileFieldRevisionTestCase->testRevisions()
Undefined property: stdClass::$ridNoticeuser.module2746user_role_save()
Undefined property: stdClass::$ridNoticedrupal_web_test_case.php1045DrupalWebTestCase->drupalCreateRole()
ExpandFile field validation tests (FileFieldValidateTestCase) [File]012
MessageGroupFilenameLineFunctionStatus
The test did not complete due to a fatal error.Completion checkfile.test563FileFieldValidateTestCase->testRequired()
Undefined property: stdClass::$ridNoticeuser.module2746user_role_save()
Undefined property: stdClass::$ridNoticedrupal_web_test_case.php1045DrupalWebTestCase->drupalCreateRole()
ExpandFile field widget test (FileFieldWidgetTestCase) [File]012
MessageGroupFilenameLineFunctionStatus
The test did not complete due to a fatal error.Completion checkfile.test228FileFieldWidgetTestCase->testWidget()
Undefined property: stdClass::$ridNoticeuser.module2746user_role_save()
Undefined property: stdClass::$ridNoticedrupal_web_test_case.php1045DrupalWebTestCase->drupalCreateRole()
LeafFile loading (FileLoadTest) [File API]2900
LeafFile mimetypes (FileMimeTypeTest) [File API]3800
LeafFile moving (FileMoveTest) [File API]10500
LeafFile naming (FileNameMungingTest) [File API]500
LeafFile paths and directories (FileDirectoryTest) [File API]2000
LeafFile save data (FileSaveDataTest) [File API]8800
LeafFile saving (FileSaveTest) [File API]1400
LeafFile scan directory (FileScanDirectoryTest) [File API]2300
LeafFile space used tests (FileSpaceUsedTest) [File API]1100
ExpandFile token replacement (FileTokenReplaceTestCase) [File]012
MessageGroupFilenameLineFunctionStatus
The test did not complete due to a fatal error.Completion checkfile.test799FileTokenReplaceTestCase->testFileTokenReplacement()
Undefined property: stdClass::$ridNoticeuser.module2746user_role_save()
Undefined property: stdClass::$ridNoticedrupal_web_test_case.php1045DrupalWebTestCase->drupalCreateRole()
ExpandFile uploading (FileSaveUploadTest) [File API]012
MessageGroupFilenameLineFunctionStatus
The test did not complete due to a fatal error.Completion checkfile.test607FileSaveUploadTest->testNormal()
Undefined property: stdClass::$ridNoticeuser.module2746user_role_save()
Undefined property: stdClass::$ridNoticedrupal_web_test_case.php1045DrupalWebTestCase->drupalCreateRole()
LeafFile URL rewriting (FileURLRewritingTest) [File]1500
LeafFile usage (FileUsageTest) [File]2100
LeafFile validate (FileValidateTest) [File API]1100
ExpandFile validator tests (FileValidatorTest) [File API]2003
MessageGroupFilenameLineFunctionStatus
Undefined property: stdClass::$ridNoticeuser.module2746user_role_save()
Undefined property: stdClass::$ridNoticedrupal_web_test_case.php1045DrupalWebTestCase->drupalCreateRole()
PDOException: SQLSTATE[23000]: Integrity constraint violation: 1048 Column 'rid' cannot be null: INSERT INTO {role_permission} (rid, permission, module) VALUES (:db_insert_placeholder_0, :db_insert_placeholder_1, :db_insert_placeholder_2); Array ( [:db_insert_placeholder_0] => [:db_insert_placeholder_1] => access comments [:db_insert_placeholder_2] => comment ) in user_role_grant_permissions() (line 2885 of /var/lib/drupaltestbot/sites/default/files/checkout/modules/user/user.module).Uncaught exceptiondatabase.inc1967PDOStatement->execute()
LeafFileTransfer unit tests (FileTranferTest) [System]200
ExpandFilter administration functionality (FilterAdminTestCase) [Filter]012
MessageGroupFilenameLineFunctionStatus
The test did not complete due to a fatal error.Completion checkfilter.test182FilterAdminTestCase->testFormatAdmin()
Undefined property: stdClass::$ridNoticeuser.module2746user_role_save()
Undefined property: stdClass::$ridNoticedrupal_web_test_case.php1045DrupalWebTestCase->drupalCreateRole()
LeafFilter CRUD operations (FilterCRUDTestCase) [Filter]21400
ExpandFilter format access (FilterFormatAccessTestCase) [Filter]012
MessageGroupFilenameLineFunctionStatus
The test did not complete due to a fatal error.Completion checkfilter.test453FilterFormatAccessTestCase->testFormatPermissions()
Undefined property: stdClass::$ridNoticeuser.module2746user_role_save()
Undefined property: stdClass::$ridNoticedrupal_web_test_case.php1045DrupalWebTestCase->drupalCreateRole()
ExpandFilter format hooks (FilterHooksTestCase) [Filter]012
MessageGroupFilenameLineFunctionStatus
The test did not complete due to a fatal error.Completion checkfilter.test1683FilterHooksTestCase->testFilterHooks()
Undefined property: stdClass::$ridNoticeuser.module2746user_role_save()
Undefined property: stdClass::$ridNoticedrupal_web_test_case.php1045DrupalWebTestCase->drupalCreateRole()
LeafFilter module filters (FilterUnitTestCase) [Filter]20200
LeafFingerprinting meta tag (AdminMetaTagTestCase) [System]300
LeafFlood control mechanism (FloodFunctionalTest) [System]600
LeafForm alter hooks (FormAlterTestCase) [Form API]300
LeafForm API file inclusion (FormsFileInclusionTestCase) [Form API]900
LeafForm element and label output test (FormsElementsLabelsTestCase) [Form API]1500
LeafForm element validation (FormsTestCase) [Form API]27000
ExpandForm rebuilding (FormsRebuildTestCase) [Form API]012
MessageGroupFilenameLineFunctionStatus
The test did not complete due to a fatal error.Completion checkform.test1008FormsRebuildTestCase->testRebuildPreservesValues()
Undefined property: stdClass::$ridNoticeuser.module2746user_role_save()
Undefined property: stdClass::$ridNoticedrupal_web_test_case.php1045DrupalWebTestCase->drupalCreateRole()
LeafForm state values clearance (FormStateValuesCleanTestCase) [Form API]1300
LeafForm triggering element determination (FormsTriggeringElementTestCase) [Form API]4800
LeafForm validation handlers (FormValidationTestCase) [Form API]3500
LeafForm wrapper callback (FormsFormWrapperTestCase) [Form API]400
LeafFormat date (FormatDateUnitTest) [System]603
ExpandForum functionality (ForumTestCase) [Forum]012
MessageGroupFilenameLineFunctionStatus
The test did not complete due to a fatal error.Completion checkforum.test53ForumTestCase->testForum()
Undefined property: stdClass::$ridNoticeuser.module2746user_role_save()
Undefined property: stdClass::$ridNoticedrupal_web_test_case.php1045DrupalWebTestCase->drupalCreateRole()
LeafFront page (FrontPageTestCase) [System]012
LeafGet filename test (BootstrapGetFilenameTestCase) [Bootstrap]400
LeafGraph (GraphUnitTest) [System]2800
ExpandHelp functionality (HelpTestCase) [Help]012
MessageGroupFilenameLineFunctionStatus
The test did not complete due to a fatal error.Completion checkhelp.test32HelpTestCase->testHelp()
Undefined property: stdClass::$ridNoticeuser.module2746user_role_save()
Undefined property: stdClass::$ridNoticedrupal_web_test_case.php1045DrupalWebTestCase->drupalCreateRole()
LeafHTML Attributes (DrupalAttributesUnitTest) [System]600
LeafHTML identifiers (DrupalHTMLIdentifierTestCase) [System]1000
LeafHTML in page titles (PageTitleFiltering) [System]012
LeafHTTP file retrieval (RetrieveFileTestCase) [System]700
LeafImage effects (ImageEffectsUnitTest) [Image]3300
ExpandImage field display tests (ImageFieldDisplayTestCase) [Image]012
MessageGroupFilenameLineFunctionStatus
The test did not complete due to a fatal error.Completion checkimage.test625ImageFieldDisplayTestCase->testImageFieldFormattersPublic()
Undefined property: stdClass::$ridNoticeuser.module2746user_role_save()
Undefined property: stdClass::$ridNoticedrupal_web_test_case.php1045DrupalWebTestCase->drupalCreateRole()
ExpandImage field validation tests (ImageFieldValidateTestCase) [Image]012
MessageGroupFilenameLineFunctionStatus
The test did not complete due to a fatal error.Completion checkimage.test836ImageFieldValidateTestCase->testResolution()
Undefined property: stdClass::$ridNoticeuser.module2746user_role_save()
Undefined property: stdClass::$ridNoticedrupal_web_test_case.php1045DrupalWebTestCase->drupalCreateRole()
LeafImage GD manipulation tests (ImageToolkitGdTestCase) [Image]100
ExpandImage styles and effects UI configuration (ImageAdminStylesUnitTest) [Image]012
MessageGroupFilenameLineFunctionStatus
The test did not complete due to a fatal error.Completion checkimage.test343ImageAdminStylesUnitTest->testStyle()
Undefined property: stdClass::$ridNoticeuser.module2746user_role_save()
Undefined property: stdClass::$ridNoticedrupal_web_test_case.php1045DrupalWebTestCase->drupalCreateRole()
LeafImage styles path and URL functions (ImageStylesPathAndUrlUnitTest) [Image]2100
LeafImage toolkit tests (ImageToolkitUnitTest) [Image]4400
ExpandImport feeds from OPML functionality (ImportOPMLTestCase) [Aggregator]012
MessageGroupFilenameLineFunctionStatus
The test did not complete due to a fatal error.Completion checkaggregator.test699ImportOPMLTestCase->testOPMLImport()
Undefined property: stdClass::$ridNoticeuser.module2746user_role_save()
Undefined property: stdClass::$ridNoticedrupal_web_test_case.php1045DrupalWebTestCase->drupalCreateRole()
LeafInfo file format parser (InfoFileParserTestCase) [System]900
LeafInsert tests (DatabaseInsertTestCase) [Database]4500
LeafInsert tests, default fields (DatabaseInsertDefaultsTestCase) [Database]1900
LeafInsert tests, LOB fields (DatabaseInsertLOBTestCase) [Database]1300
LeafInvalid data (DatabaseInvalidDataTestCase) [Database]700
LeafIP address and HTTP_HOST test (BootstrapIPAddressTestCase) [Bootstrap]1100
LeafIP address blocking (IPAddressBlockingTestCase) [System]012
LeafJavaScript (JavaScriptTestCase) [System]3500
LeafJSON (DrupalJSONTest) [System]1400
LeafKeywords and conditions (SearchKeywordsConditions) [Search]012
ExpandLanguage configuration (LocaleConfigurationTest) [Locale]003
MessageGroupFilenameLineFunctionStatus
Undefined property: stdClass::$ridNoticeuser.module2746user_role_save()
Undefined property: stdClass::$ridNoticedrupal_web_test_case.php1045DrupalWebTestCase->drupalCreateRole()
PDOException: SQLSTATE[23000]: Integrity constraint violation: 1048 Column 'rid' cannot be null: INSERT INTO {role_permission} (rid, permission, module) VALUES (:db_insert_placeholder_0, :db_insert_placeholder_1, :db_insert_placeholder_2); Array ( [:db_insert_placeholder_0] => [:db_insert_placeholder_1] => administer languages [:db_insert_placeholder_2] => locale ) in user_role_grant_permissions() (line 2885 of /var/lib/drupaltestbot/sites/default/files/checkout/modules/user/user.module).Uncaught exceptiondatabase.inc1967PDOStatement->execute()
ExpandLanguage switching (LocaleLanguageSwitchingFunctionalTest) [Locale]012
MessageGroupFilenameLineFunctionStatus
The test did not complete due to a fatal error.Completion checklocale.test1159LocaleLanguageSwitchingFunctionalTest->testLanguageBlock()
Undefined property: stdClass::$ridNoticeuser.module2746user_role_save()
Undefined property: stdClass::$ridNoticedrupal_web_test_case.php1045DrupalWebTestCase->drupalCreateRole()
LeafList field (ListFieldTestCase) [Field types]1400
ExpandList field UI (ListFieldUITestCase) [Field types]012
MessageGroupFilenameLineFunctionStatus
The test did not complete due to a fatal error.Completion checklist.test134ListFieldUITestCase->testAllowedValues()
Undefined property: stdClass::$ridNoticeuser.module2746user_role_save()
Undefined property: stdClass::$ridNoticedrupal_web_test_case.php1045DrupalWebTestCase->drupalCreateRole()
ExpandLoad multiple nodes (NodeLoadMultipleUnitTest) [Node]012
MessageGroupFilenameLineFunctionStatus
The test did not complete due to a fatal error.Completion checknode.test26NodeLoadMultipleUnitTest->testNodeMultipleLoad()
Undefined property: stdClass::$ridNoticeuser.module2746user_role_save()
Undefined property: stdClass::$ridNoticedrupal_web_test_case.php1045DrupalWebTestCase->drupalCreateRole()
ExpandLocale uninstall (EN) (LocaleUninstallFunctionalTest) [Locale]103
MessageGroupFilenameLineFunctionStatus
Undefined property: stdClass::$ridNoticeuser.module2746user_role_save()
Undefined property: stdClass::$ridNoticedrupal_web_test_case.php1045DrupalWebTestCase->drupalCreateRole()
PDOException: SQLSTATE[23000]: Integrity constraint violation: 1048 Column 'rid' cannot be null: INSERT INTO {role_permission} (rid, permission, module) VALUES (:db_insert_placeholder_0, :db_insert_placeholder_1, :db_insert_placeholder_2); Array ( [:db_insert_placeholder_0] => [:db_insert_placeholder_1] => translate interface [:db_insert_placeholder_2] => locale ) in user_role_grant_permissions() (line 2885 of /var/lib/drupaltestbot/sites/default/files/checkout/modules/user/user.module).Uncaught exceptiondatabase.inc1967PDOStatement->execute()
ExpandLocale uninstall (FR) (LocaleUninstallFrenchFunctionalTest) [Locale]103
MessageGroupFilenameLineFunctionStatus
Undefined property: stdClass::$ridNoticeuser.module2746user_role_save()
Undefined property: stdClass::$ridNoticedrupal_web_test_case.php1045DrupalWebTestCase->drupalCreateRole()
PDOException: SQLSTATE[23000]: Integrity constraint violation: 1048 Column 'rid' cannot be null: INSERT INTO {role_permission} (rid, permission, module) VALUES (:db_insert_placeholder_0, :db_insert_placeholder_1, :db_insert_placeholder_2); Array ( [:db_insert_placeholder_0] => [:db_insert_placeholder_1] => translate interface [:db_insert_placeholder_2] => locale ) in user_role_grant_permissions() (line 2885 of /var/lib/drupaltestbot/sites/default/files/checkout/modules/user/user.module).Uncaught exceptiondatabase.inc1967PDOStatement->execute()
LeafLocale upgrade path (LocaleUpgradePathTestCase) [Upgrade path]15500
ExpandLocalize date formats (LocaleDateFormatsFunctionalTest) [Locale]012
MessageGroupFilenameLineFunctionStatus
The test did not complete due to a fatal error.Completion checklocale.test1957LocaleDateFormatsFunctionalTest->testLocalizeDateFormats()
Undefined property: stdClass::$ridNoticeuser.module2746user_role_save()
Undefined property: stdClass::$ridNoticedrupal_web_test_case.php1045DrupalWebTestCase->drupalCreateRole()
LeafLocking framework tests (LockFunctionalTest) [System]1700
LeafMail system (MailTestCase) [System]100
LeafMain content rendering fallback (SystemMainContentFallback) [System]012
ExpandMenu link creation/deletion (MenuTestCase) [Menu]012
MessageGroupFilenameLineFunctionStatus
The test did not complete due to a fatal error.Completion checkmenu.test33MenuTestCase->testMenu()
Undefined property: stdClass::$ridNoticeuser.module2746user_role_save()
Undefined property: stdClass::$ridNoticedrupal_web_test_case.php1045DrupalWebTestCase->drupalCreateRole()
LeafMenu rebuild test (MenuRebuildTestCase) [Menu]500
ExpandMenu router (MenuRouterTestCase) [Menu]105716
MessageGroupFilenameLineFunctionStatus
Undefined property: stdClass::$ridNoticeuser.module2746user_role_save()
Undefined property: stdClass::$ridNoticedrupal_web_test_case.php1045DrupalWebTestCase->drupalCreateRole()
PDOException: SQLSTATE[23000]: Integrity constraint violation: 1048 Column 'rid' cannot be null: INSERT INTO {role_permission} (rid, permission, module) VALUES (:db_insert_placeholder_0, :db_insert_placeholder_1, :db_insert_placeholder_2); Array ( [:db_insert_placeholder_0] => [:db_insert_placeholder_1] => access site in maintenance mode [:db_insert_placeholder_2] => system ) in user_role_grant_permissions() (line 2885 of /var/lib/drupaltestbot/sites/default/files/checkout/modules/user/user.module).Uncaught exceptiondatabase.inc1967PDOStatement->execute()
Undefined property: stdClass::$ridNoticeuser.module2746user_role_save()
Undefined property: stdClass::$ridNoticedrupal_web_test_case.php1045DrupalWebTestCase->drupalCreateRole()
Created role of name: eXsqSE6T, id: -n/a-Rolemenu.test115MenuRouterTestCase->testAuthUserUserLogin()
Argument 1 passed to DrupalWebTestCase::drupalLogin() must be an instance of stdClass, boolean given, called in /var/lib/drupaltestbot/sites/default/files/checkout/modules/simpletest/tests/menu.test on line 116 and definedRecoverable errordrupal_web_test_case.php1112DrupalWebTestCase->drupalLogin()
Trying to get property of non-objectNoticedrupal_web_test_case.php1118DrupalWebTestCase->drupalLogin()
Trying to get property of non-objectNoticedrupal_web_test_case.php1119DrupalWebTestCase->drupalLogin()
Failed to set field name to Othermenu.test116MenuRouterTestCase->testAuthUserUserLogin()
Failed to set field pass to Othermenu.test116MenuRouterTestCase->testAuthUserUserLogin()
Found the requested form fields at userOthermenu.test116MenuRouterTestCase->testAuthUserUserLogin()
Trying to get property of non-objectNoticedrupal_web_test_case.php1125DrupalWebTestCase->drupalLogin()
User successfully logged in.User loginmenu.test116MenuRouterTestCase->testAuthUserUserLogin()
Logged-in user redirected to q=user on accessing q=user/loginOthermenu.test120MenuRouterTestCase->testAuthUserUserLogin()
Trying to get property of non-objectNoticemenu.test124MenuRouterTestCase->testAuthUserUserLogin()
Logged-in user redirected to q=user/UID/edit on accessing q=user/registerOthermenu.test124MenuRouterTestCase->testAuthUserUserLogin()
ExpandMenu settings for nodes (MenuNodeTestCase) [Menu]012
MessageGroupFilenameLineFunctionStatus
The test did not complete due to a fatal error.Completion checkmenu.test603MenuNodeTestCase->testMenuNodeFormWidget()
Undefined property: stdClass::$ridNoticeuser.module2746user_role_save()
Undefined property: stdClass::$ridNoticedrupal_web_test_case.php1045DrupalWebTestCase->drupalCreateRole()
LeafMenu tree generation (MenuTreeDataTestCase) [Menu]400
LeafMerge tests (DatabaseMergeTestCase) [Database]7500
ExpandMiscellaneous AJAX tests (AJAXElementValidation) [AJAX]003
MessageGroupFilenameLineFunctionStatus
Undefined property: stdClass::$ridNoticeuser.module2746user_role_save()
Undefined property: stdClass::$ridNoticedrupal_web_test_case.php1045DrupalWebTestCase->drupalCreateRole()
PDOException: SQLSTATE[23000]: Integrity constraint violation: 1048 Column 'rid' cannot be null: INSERT INTO {role_permission} (rid, permission, module) VALUES (:db_insert_placeholder_0, :db_insert_placeholder_1, :db_insert_placeholder_2); Array ( [:db_insert_placeholder_0] => [:db_insert_placeholder_1] => access comments [:db_insert_placeholder_2] => comment ) in user_role_grant_permissions() (line 2885 of /var/lib/drupaltestbot/sites/default/files/checkout/modules/user/user.module).Uncaught exceptiondatabase.inc1967PDOStatement->execute()
LeafMissing update dependencies (UpdateDependencyMissingTestCase) [Update API]300
ExpandModule API (ModuleUnitTest) [Module]2003
MessageGroupFilenameLineFunctionStatus
Undefined property: stdClass::$ridNoticeuser.module2746user_role_save()
Undefined property: stdClass::$ridNoticedrupal_web_test_case.php1045DrupalWebTestCase->drupalCreateRole()
PDOException: SQLSTATE[23000]: Integrity constraint violation: 1048 Column 'rid' cannot be null: INSERT INTO {role_permission} (rid, permission, module) VALUES (:db_insert_placeholder_0, :db_insert_placeholder_1, :db_insert_placeholder_2); Array ( [:db_insert_placeholder_0] => [:db_insert_placeholder_1] => access comments [:db_insert_placeholder_2] => comment ) in user_role_grant_permissions() (line 2885 of /var/lib/drupaltestbot/sites/default/files/checkout/modules/user/user.module).Uncaught exceptiondatabase.inc1967PDOStatement->execute()
ExpandModule dependencies (ModuleDependencyTestCase) [Module]012
MessageGroupFilenameLineFunctionStatus
The test did not complete due to a fatal error.Completion checksystem.test216ModuleDependencyTestCase->testEnableWithoutDependency()
Undefined property: stdClass::$ridNoticeuser.module2746user_role_save()
Undefined property: stdClass::$ridNoticedrupal_web_test_case.php1045DrupalWebTestCase->drupalCreateRole()
LeafModule installation (ModuleInstallTestCase) [Module]200
LeafModule uninstallation (ModuleUninstallTestCase) [Module]100
ExpandModule versions (ModuleVersionTestCase) [Module]012
MessageGroupFilenameLineFunctionStatus
The test did not complete due to a fatal error.Completion checksystem.test371ModuleVersionTestCase->testModuleVersions()
Undefined property: stdClass::$ridNoticeuser.module2746user_role_save()
Undefined property: stdClass::$ridNoticedrupal_web_test_case.php1045DrupalWebTestCase->drupalCreateRole()
ExpandMultilingual fields (LocaleMultilingualFieldsFunctionalTest) [Locale]012
MessageGroupFilenameLineFunctionStatus
The test did not complete due to a fatal error.Completion checklocale.test1858LocaleMultilingualFieldsFunctionalTest->testMultilingualNodeForm()
Undefined property: stdClass::$ridNoticeuser.module2746user_role_save()
Undefined property: stdClass::$ridNoticedrupal_web_test_case.php1045DrupalWebTestCase->drupalCreateRole()
ExpandMultistep form using form storage (FormsFormStorageTestCase) [Form API]012
MessageGroupFilenameLineFunctionStatus
The test did not complete due to a fatal error.Completion checkform.test789FormsFormStorageTestCase->testForm()
Undefined property: stdClass::$ridNoticeuser.module2746user_role_save()
Undefined property: stdClass::$ridNoticedrupal_web_test_case.php1045DrupalWebTestCase->drupalCreateRole()
ExpandMultistep node form basic options (MultiStepNodeFormBasicOptionsTest) [Node]012
MessageGroupFilenameLineFunctionStatus
The test did not complete due to a fatal error.Completion checknode.test1634MultiStepNodeFormBasicOptionsTest->testMultiStepNodeFormBasicOptions()
Undefined property: stdClass::$ridNoticeuser.module2746user_role_save()
Undefined property: stdClass::$ridNoticedrupal_web_test_case.php1045DrupalWebTestCase->drupalCreateRole()
ExpandNew default theme blocks (NewDefaultThemeBlocks) [Block]003
MessageGroupFilenameLineFunctionStatus
Undefined property: stdClass::$ridNoticeuser.module2746user_role_save()
Undefined property: stdClass::$ridNoticedrupal_web_test_case.php1045DrupalWebTestCase->drupalCreateRole()
PDOException: SQLSTATE[23000]: Integrity constraint violation: 1048 Column 'rid' cannot be null: INSERT INTO {role_permission} (rid, permission, module) VALUES (:db_insert_placeholder_0, :db_insert_placeholder_1, :db_insert_placeholder_2); Array ( [:db_insert_placeholder_0] => [:db_insert_placeholder_1] => administer themes [:db_insert_placeholder_2] => system ) in user_role_grant_permissions() (line 2885 of /var/lib/drupaltestbot/sites/default/files/checkout/modules/user/user.module).Uncaught exceptiondatabase.inc1967PDOStatement->execute()
ExpandNo help (NoHelpTestCase) [Help]012
MessageGroupFilenameLineFunctionStatus
The test did not complete due to a fatal error.Completion checkhelp.test115NoHelpTestCase->testMainPageNoHelp()
Undefined property: stdClass::$ridNoticeuser.module2746user_role_save()
Undefined property: stdClass::$ridNoticedrupal_web_test_case.php1045DrupalWebTestCase->drupalCreateRole()
ExpandNode access (NodeAccessUnitTest) [Node]003
MessageGroupFilenameLineFunctionStatus
Undefined property: stdClass::$ridNoticeuser.module2746user_role_save()
Undefined property: stdClass::$ridNoticedrupal_web_test_case.php1045DrupalWebTestCase->drupalCreateRole()
PDOException: SQLSTATE[23000]: Integrity constraint violation: 1048 Column 'rid' cannot be null: INSERT INTO {role_permission} (rid, permission, module) VALUES (:db_insert_placeholder_0, :db_insert_placeholder_1, :db_insert_placeholder_2); Array ( [:db_insert_placeholder_0] => [:db_insert_placeholder_1] => create page content [:db_insert_placeholder_2] => node ) in user_role_grant_permissions() (line 2885 of /var/lib/drupaltestbot/sites/default/files/checkout/modules/user/user.module).Uncaught exceptiondatabase.inc1967PDOStatement->execute()
ExpandNode access rebuild (NodeAccessRebuildTestCase) [Node]012
MessageGroupFilenameLineFunctionStatus
The test did not complete due to a fatal error.Completion checknode.test1247NodeAccessRebuildTestCase->testNodeAccessRebuild()
Undefined property: stdClass::$ridNoticeuser.module2746user_role_save()
Undefined property: stdClass::$ridNoticedrupal_web_test_case.php1045DrupalWebTestCase->drupalCreateRole()
ExpandNode access records (NodeAccessRecordsUnitTest) [Node]1603
MessageGroupFilenameLineFunctionStatus
Undefined property: stdClass::$ridNoticeuser.module2746user_role_save()
Undefined property: stdClass::$ridNoticedrupal_web_test_case.php1045DrupalWebTestCase->drupalCreateRole()
PDOException: SQLSTATE[23000]: Integrity constraint violation: 1048 Column 'rid' cannot be null: INSERT INTO {role_permission} (rid, permission, module) VALUES (:db_insert_placeholder_0, :db_insert_placeholder_1, :db_insert_placeholder_2); Array ( [:db_insert_placeholder_0] => [:db_insert_placeholder_1] => access content [:db_insert_placeholder_2] => node ) in user_role_grant_permissions() (line 2885 of /var/lib/drupaltestbot/sites/default/files/checkout/modules/user/user.module).Uncaught exceptiondatabase.inc1967PDOStatement->execute()
ExpandNode administration (NodeAdminTestCase) [Node]012
MessageGroupFilenameLineFunctionStatus
The test did not complete due to a fatal error.Completion checknode.test1284NodeAdminTestCase->testContentAdminSort()
Undefined property: stdClass::$ridNoticeuser.module2746user_role_save()
Undefined property: stdClass::$ridNoticedrupal_web_test_case.php1045DrupalWebTestCase->drupalCreateRole()
ExpandNode blocks (NodeBlockFunctionalTest) [Node]012
MessageGroupFilenameLineFunctionStatus
The test did not complete due to a fatal error.Completion checknode.test1503NodeBlockFunctionalTest->testRecentNodeBlock()
Undefined property: stdClass::$ridNoticeuser.module2746user_role_save()
Undefined property: stdClass::$ridNoticedrupal_web_test_case.php1045DrupalWebTestCase->drupalCreateRole()
LeafNode body upgrade path (NodeBodyUpgradePathTestCase) [Upgrade path]3700
ExpandNode creation (NodeCreationTestCase) [Node]012
MessageGroupFilenameLineFunctionStatus
The test did not complete due to a fatal error.Completion checknode.test440NodeCreationTestCase->testNodeCreation()
Undefined property: stdClass::$ridNoticeuser.module2746user_role_save()
Undefined property: stdClass::$ridNoticedrupal_web_test_case.php1045DrupalWebTestCase->drupalCreateRole()
ExpandNode edit (PageEditTestCase) [Node]012
MessageGroupFilenameLineFunctionStatus
The test did not complete due to a fatal error.Completion checknode.test239PageEditTestCase->testPageEdit()
Undefined property: stdClass::$ridNoticeuser.module2746user_role_save()
Undefined property: stdClass::$ridNoticedrupal_web_test_case.php1045DrupalWebTestCase->drupalCreateRole()
ExpandNode edit permissions (PageViewTestCase) [Node]403
MessageGroupFilenameLineFunctionStatus
Undefined property: stdClass::$ridNoticeuser.module2746user_role_save()
Undefined property: stdClass::$ridNoticedrupal_web_test_case.php1045DrupalWebTestCase->drupalCreateRole()
PDOException: SQLSTATE[23000]: Integrity constraint violation: 1048 Column 'rid' cannot be null: INSERT INTO {role_permission} (rid, permission, module) VALUES (:db_insert_placeholder_0, :db_insert_placeholder_1, :db_insert_placeholder_2); Array ( [:db_insert_placeholder_0] => [:db_insert_placeholder_1] => access content [:db_insert_placeholder_2] => node ) in user_role_grant_permissions() (line 2885 of /var/lib/drupaltestbot/sites/default/files/checkout/modules/user/user.module).Uncaught exceptiondatabase.inc1967PDOStatement->execute()
ExpandNode entity query alter (NodeEntityFieldQueryAlter) [Node]012
MessageGroupFilenameLineFunctionStatus
The test did not complete due to a fatal error.Completion checknode.test1856NodeEntityFieldQueryAlter->testNodeQueryAlterWithUI()
Undefined property: stdClass::$ridNoticeuser.module2746user_role_save()
Undefined property: stdClass::$ridNoticedrupal_web_test_case.php1045DrupalWebTestCase->drupalCreateRole()
LeafNode feed (NodeFeedTestCase) [Node]100
ExpandNode post information display (NodePostSettingsTestCase) [Node]012
MessageGroupFilenameLineFunctionStatus
The test did not complete due to a fatal error.Completion checknode.test665NodePostSettingsTestCase->testPagePostInfo()
Undefined property: stdClass::$ridNoticeuser.module2746user_role_save()
Undefined property: stdClass::$ridNoticedrupal_web_test_case.php1045DrupalWebTestCase->drupalCreateRole()
ExpandNode preview (PagePreviewTestCase) [Node]012
MessageGroupFilenameLineFunctionStatus
The test did not complete due to a fatal error.Completion checknode.test368PagePreviewTestCase->testPagePreview()
Undefined property: stdClass::$ridNoticeuser.module2746user_role_save()
Undefined property: stdClass::$ridNoticedrupal_web_test_case.php1045DrupalWebTestCase->drupalCreateRole()
ExpandNode query alter (NodeQueryAlter) [Node]012
MessageGroupFilenameLineFunctionStatus
The test did not complete due to a fatal error.Completion checknode.test1720NodeQueryAlter->testNodeQueryAlterWithUI()
Undefined property: stdClass::$ridNoticeuser.module2746user_role_save()
Undefined property: stdClass::$ridNoticedrupal_web_test_case.php1045DrupalWebTestCase->drupalCreateRole()
ExpandNode revisions (NodeRevisionsTestCase) [Node]012
MessageGroupFilenameLineFunctionStatus
The test did not complete due to a fatal error.Completion checknode.test135NodeRevisionsTestCase->testRevisions()
Undefined property: stdClass::$ridNoticeuser.module2746user_role_save()
Undefined property: stdClass::$ridNoticedrupal_web_test_case.php1045DrupalWebTestCase->drupalCreateRole()
ExpandNode RSS Content (NodeRSSContentTestCase) [Node]012
MessageGroupFilenameLineFunctionStatus
The test did not complete due to a fatal error.Completion checknode.test739NodeRSSContentTestCase->testNodeRSSContent()
Undefined property: stdClass::$ridNoticeuser.module2746user_role_save()
Undefined property: stdClass::$ridNoticedrupal_web_test_case.php1045DrupalWebTestCase->drupalCreateRole()
ExpandNode save (NodeSaveTestCase) [Node]012
MessageGroupFilenameLineFunctionStatus
The test did not complete due to a fatal error.Completion checknode.test951NodeSaveTestCase->testImport()
Undefined property: stdClass::$ridNoticeuser.module2746user_role_save()
Undefined property: stdClass::$ridNoticedrupal_web_test_case.php1045DrupalWebTestCase->drupalCreateRole()
ExpandNode title (NodeTitleTestCase) [Node]012
MessageGroupFilenameLineFunctionStatus
The test did not complete due to a fatal error.Completion checknode.test1428NodeTitleTestCase->testNodeTitle()
Undefined property: stdClass::$ridNoticeuser.module2746user_role_save()
Undefined property: stdClass::$ridNoticedrupal_web_test_case.php1045DrupalWebTestCase->drupalCreateRole()
ExpandNode title XSS filtering (NodeTitleXSSTestCase) [Node]003
MessageGroupFilenameLineFunctionStatus
Undefined property: stdClass::$ridNoticeuser.module2746user_role_save()
Undefined property: stdClass::$ridNoticedrupal_web_test_case.php1045DrupalWebTestCase->drupalCreateRole()
PDOException: SQLSTATE[23000]: Integrity constraint violation: 1048 Column 'rid' cannot be null: INSERT INTO {role_permission} (rid, permission, module) VALUES (:db_insert_placeholder_0, :db_insert_placeholder_1, :db_insert_placeholder_2); Array ( [:db_insert_placeholder_0] => [:db_insert_placeholder_1] => create page content [:db_insert_placeholder_2] => node ) in user_role_grant_permissions() (line 2885 of /var/lib/drupaltestbot/sites/default/files/checkout/modules/user/user.module).Uncaught exceptiondatabase.inc1967PDOStatement->execute()
ExpandNode token replacement (NodeTokenReplaceTestCase) [Node]003
MessageGroupFilenameLineFunctionStatus
Undefined property: stdClass::$ridNoticeuser.module2746user_role_save()
Undefined property: stdClass::$ridNoticedrupal_web_test_case.php1045DrupalWebTestCase->drupalCreateRole()
PDOException: SQLSTATE[23000]: Integrity constraint violation: 1048 Column 'rid' cannot be null: INSERT INTO {role_permission} (rid, permission, module) VALUES (:db_insert_placeholder_0, :db_insert_placeholder_1, :db_insert_placeholder_2); Array ( [:db_insert_placeholder_0] => [:db_insert_placeholder_1] => access comments [:db_insert_placeholder_2] => comment ) in user_role_grant_permissions() (line 2885 of /var/lib/drupaltestbot/sites/default/files/checkout/modules/user/user.module).Uncaught exceptiondatabase.inc1967PDOStatement->execute()
ExpandNode type persist (NodeTypePersistenceTestCase) [Node]003
MessageGroupFilenameLineFunctionStatus
Undefined property: stdClass::$ridNoticeuser.module2746user_role_save()
Undefined property: stdClass::$ridNoticedrupal_web_test_case.php1045DrupalWebTestCase->drupalCreateRole()
PDOException: SQLSTATE[23000]: Integrity constraint violation: 1048 Column 'rid' cannot be null: INSERT INTO {role_permission} (rid, permission, module) VALUES (:db_insert_placeholder_0, :db_insert_placeholder_1, :db_insert_placeholder_2); Array ( [:db_insert_placeholder_0] => [:db_insert_placeholder_1] => bypass node access [:db_insert_placeholder_2] => node ) in user_role_grant_permissions() (line 2885 of /var/lib/drupaltestbot/sites/default/files/checkout/modules/user/user.module).Uncaught exceptiondatabase.inc1967PDOStatement->execute()
ExpandNode types (NodeTypeTestCase) [Node]806
MessageGroupFilenameLineFunctionStatus
Undefined property: stdClass::$ridNoticeuser.module2746user_role_save()
Undefined property: stdClass::$ridNoticedrupal_web_test_case.php1045DrupalWebTestCase->drupalCreateRole()
PDOException: SQLSTATE[23000]: Integrity constraint violation: 1048 Column 'rid' cannot be null: INSERT INTO {role_permission} (rid, permission, module) VALUES (:db_insert_placeholder_0, :db_insert_placeholder_1, :db_insert_placeholder_2); Array ( [:db_insert_placeholder_0] => [:db_insert_placeholder_1] => create cdeyh2lm content [:db_insert_placeholder_2] => node ) in user_role_grant_permissions() (line 2885 of /var/lib/drupaltestbot/sites/default/files/checkout/modules/user/user.module).Uncaught exceptiondatabase.inc1967PDOStatement->execute()
Undefined property: stdClass::$ridNoticeuser.module2746user_role_save()
Undefined property: stdClass::$ridNoticedrupal_web_test_case.php1045DrupalWebTestCase->drupalCreateRole()
PDOException: SQLSTATE[23000]: Integrity constraint violation: 1048 Column 'rid' cannot be null: INSERT INTO {role_permission} (rid, permission, module) VALUES (:db_insert_placeholder_0, :db_insert_placeholder_1, :db_insert_placeholder_2); Array ( [:db_insert_placeholder_0] => [:db_insert_placeholder_1] => bypass node access [:db_insert_placeholder_2] => node ) in user_role_grant_permissions() (line 2885 of /var/lib/drupaltestbot/sites/default/files/checkout/modules/user/user.module).Uncaught exceptiondatabase.inc1967PDOStatement->execute()
ExpandNon default theme admin (NonDefaultBlockAdmin) [Block]003
MessageGroupFilenameLineFunctionStatus
Undefined property: stdClass::$ridNoticeuser.module2746user_role_save()
Undefined property: stdClass::$ridNoticedrupal_web_test_case.php1045DrupalWebTestCase->drupalCreateRole()
PDOException: SQLSTATE[23000]: Integrity constraint violation: 1048 Column 'rid' cannot be null: INSERT INTO {role_permission} (rid, permission, module) VALUES (:db_insert_placeholder_0, :db_insert_placeholder_1, :db_insert_placeholder_2); Array ( [:db_insert_placeholder_0] => [:db_insert_placeholder_1] => administer blocks [:db_insert_placeholder_2] => block ) in user_role_grant_permissions() (line 2885 of /var/lib/drupaltestbot/sites/default/files/checkout/modules/user/user.module).Uncaught exceptiondatabase.inc1967PDOStatement->execute()
LeafOpenID account registration (OpenIDRegistrationTestCase) [OpenID]12544
ExpandOpenID discovery and login (OpenIDFunctionalTestCase) [OpenID]8610751
MessageGroupFilenameLineFunctionStatus
Undefined property: stdClass::$ridNoticeuser.module2746user_role_save()
Undefined property: stdClass::$ridNoticedrupal_web_test_case.php1045DrupalWebTestCase->drupalCreateRole()
Created role of name: sROU59JV, id: -n/a-Roleopenid.test43OpenIDFunctionalTestCase->setUp()
Argument 1 passed to DrupalWebTestCase::drupalLogin() must be an instance of stdClass, boolean given, called in /var/lib/drupaltestbot/sites/default/files/checkout/modules/openid/openid.test on line 50 and definedRecoverable errordrupal_web_test_case.php1112DrupalWebTestCase->drupalLogin()
Trying to get property of non-objectNoticedrupal_web_test_case.php1118DrupalWebTestCase->drupalLogin()
Trying to get property of non-objectNoticedrupal_web_test_case.php1119DrupalWebTestCase->drupalLogin()
Failed to set field name to Otheropenid.test50OpenIDFunctionalTestCase->testDiscovery()
Failed to set field pass to Otheropenid.test50OpenIDFunctionalTestCase->testDiscovery()
Found the requested form fields at userOtheropenid.test50OpenIDFunctionalTestCase->testDiscovery()
Trying to get property of non-objectNoticedrupal_web_test_case.php1125DrupalWebTestCase->drupalLogin()
User successfully logged in.User loginopenid.test50OpenIDFunctionalTestCase->testDiscovery()
Trying to get property of non-objectNoticeopenid.test246OpenIDFunctionalTestCase->addIdentity()
Failed to set field openid_identifier to pifr-mysql/checkout/?q=openid-test/yadis/xrdsOtheropenid.test246OpenIDFunctionalTestCase->addIdentity()
Found the Add an OpenID buttonOtheropenid.test246OpenIDFunctionalTestCase->addIdentity()
Found the requested form fields at user//openidOtheropenid.test246OpenIDFunctionalTestCase->addIdentity()
OpenID redirect page was displayed.Otheropenid.test256OpenIDFunctionalTestCase->addIdentity()
Found the Send buttonOtheropenid.test259OpenIDFunctionalTestCase->addIdentity()
Found the requested form fields at Otheropenid.test259OpenIDFunctionalTestCase->addIdentity()
Identity pifr-mysql/checkout/?q=openid-test/yadis/xrds was added.Otheropenid.test265OpenIDFunctionalTestCase->addIdentity()
Trying to get property of non-objectNoticeopenid.test246OpenIDFunctionalTestCase->addIdentity()
Failed to set field openid_identifier to pifr-mysql/checkout/?q=openid-test/yadis/xrds/delegateOtheropenid.test246OpenIDFunctionalTestCase->addIdentity()
Found the Add an OpenID buttonOtheropenid.test246OpenIDFunctionalTestCase->addIdentity()
Found the requested form fields at user//openidOtheropenid.test246OpenIDFunctionalTestCase->addIdentity()
OpenID redirect page was displayed.Otheropenid.test256OpenIDFunctionalTestCase->addIdentity()
Found the Send buttonOtheropenid.test259OpenIDFunctionalTestCase->addIdentity()
Found the requested form fields at Otheropenid.test259OpenIDFunctionalTestCase->addIdentity()
Identity pifr-mysql/checkout/?q=openid-test/yadis/xrds/delegate was added.Otheropenid.test265OpenIDFunctionalTestCase->addIdentity()
Trying to get property of non-objectNoticeopenid.test246OpenIDFunctionalTestCase->addIdentity()
Failed to set field openid_identifier to http://pifr-mysql/checkout/?q=openid-test/yadis/xrds/serverOtheropenid.test246OpenIDFunctionalTestCase->addIdentity()
Found the Add an OpenID buttonOtheropenid.test246OpenIDFunctionalTestCase->addIdentity()
Found the requested form fields at user//openidOtheropenid.test246OpenIDFunctionalTestCase->addIdentity()
OpenID redirect page was displayed.Otheropenid.test256OpenIDFunctionalTestCase->addIdentity()
Found the Send buttonOtheropenid.test259OpenIDFunctionalTestCase->addIdentity()
Found the requested form fields at Otheropenid.test259OpenIDFunctionalTestCase->addIdentity()
Identity http://pifr-mysql/checkout/?q=openid-test/yadis/xrds/server was added.Otheropenid.test265OpenIDFunctionalTestCase->addIdentity()
Trying to get property of non-objectNoticeopenid.test246OpenIDFunctionalTestCase->addIdentity()
Failed to set field openid_identifier to http://pifr-mysql/checkout/?q=openid-test/yadis/x-xrds-locationOtheropenid.test246OpenIDFunctionalTestCase->addIdentity()
Found the Add an OpenID buttonOtheropenid.test246OpenIDFunctionalTestCase->addIdentity()
Found the requested form fields at user//openidOtheropenid.test246OpenIDFunctionalTestCase->addIdentity()
OpenID redirect page was displayed.Otheropenid.test256OpenIDFunctionalTestCase->addIdentity()
Found the Send buttonOtheropenid.test259OpenIDFunctionalTestCase->addIdentity()
Found the requested form fields at Otheropenid.test259OpenIDFunctionalTestCase->addIdentity()
Identity http://pifr-mysql/checkout/?q=openid-test/yadis/x-xrds-location was added.Otheropenid.test265OpenIDFunctionalTestCase->addIdentity()
Trying to get property of non-objectNoticeopenid.test246OpenIDFunctionalTestCase->addIdentity()
Failed to set field openid_identifier to http://pifr-mysql/checkout/?q=openid-test/yadis/http-equivOtheropenid.test246OpenIDFunctionalTestCase->addIdentity()
Found the Add an OpenID buttonOtheropenid.test246OpenIDFunctionalTestCase->addIdentity()
Found the requested form fields at user//openidOtheropenid.test246OpenIDFunctionalTestCase->addIdentity()
OpenID redirect page was displayed.Otheropenid.test256OpenIDFunctionalTestCase->addIdentity()
Found the Send buttonOtheropenid.test259OpenIDFunctionalTestCase->addIdentity()
Found the requested form fields at Otheropenid.test259OpenIDFunctionalTestCase->addIdentity()
Identity http://pifr-mysql/checkout/?q=openid-test/yadis/http-equiv was added.Otheropenid.test265OpenIDFunctionalTestCase->addIdentity()
Trying to get property of non-objectNoticeopenid.test246OpenIDFunctionalTestCase->addIdentity()
Failed to set field openid_identifier to @example*résumé;%25Otheropenid.test246OpenIDFunctionalTestCase->addIdentity()
Found the Add an OpenID buttonOtheropenid.test246OpenIDFunctionalTestCase->addIdentity()
Found the requested form fields at user//openidOtheropenid.test246OpenIDFunctionalTestCase->addIdentity()
OpenID redirect page was displayed.Otheropenid.test256OpenIDFunctionalTestCase->addIdentity()
Found the Send buttonOtheropenid.test259OpenIDFunctionalTestCase->addIdentity()
Found the requested form fields at Otheropenid.test259OpenIDFunctionalTestCase->addIdentity()
Identity @example*résumé;%25 was added.Otheropenid.test265OpenIDFunctionalTestCase->addIdentity()
Trying to get property of non-objectNoticeopenid.test246OpenIDFunctionalTestCase->addIdentity()
Failed to set field openid_identifier to @example*résumé;%25Otheropenid.test246OpenIDFunctionalTestCase->addIdentity()
Found the Add an OpenID buttonOtheropenid.test246OpenIDFunctionalTestCase->addIdentity()
Found the requested form fields at user//openidOtheropenid.test246OpenIDFunctionalTestCase->addIdentity()
Invalid identity was rejected.Otheropenid.test249OpenIDFunctionalTestCase->addIdentity()
Trying to get property of non-objectNoticeopenid.test246OpenIDFunctionalTestCase->addIdentity()
Failed to set field openid_identifier to http://pifr-mysql/checkout/?q=openid-test/html/openid1Otheropenid.test246OpenIDFunctionalTestCase->addIdentity()
Found the Add an OpenID buttonOtheropenid.test246OpenIDFunctionalTestCase->addIdentity()
Found the requested form fields at user//openidOtheropenid.test246OpenIDFunctionalTestCase->addIdentity()
Identity http://pifr-mysql/checkout/?q=openid-test/html/openid1 was added.Otheropenid.test265OpenIDFunctionalTestCase->addIdentity()
Trying to get property of non-objectNoticeopenid.test246OpenIDFunctionalTestCase->addIdentity()
Failed to set field openid_identifier to http://pifr-mysql/checkout/?q=openid-test/html/openid2Otheropenid.test246OpenIDFunctionalTestCase->addIdentity()
Found the Add an OpenID buttonOtheropenid.test246OpenIDFunctionalTestCase->addIdentity()
Found the requested form fields at user//openidOtheropenid.test246OpenIDFunctionalTestCase->addIdentity()
OpenID redirect page was displayed.Otheropenid.test256OpenIDFunctionalTestCase->addIdentity()
Found the Send buttonOtheropenid.test259OpenIDFunctionalTestCase->addIdentity()
Found the requested form fields at Otheropenid.test259OpenIDFunctionalTestCase->addIdentity()
Identity http://pifr-mysql/checkout/?q=openid-test/html/openid2 was added.Otheropenid.test265OpenIDFunctionalTestCase->addIdentity()
Undefined property: stdClass::$ridNoticeuser.module2746user_role_save()
Undefined property: stdClass::$ridNoticedrupal_web_test_case.php1045DrupalWebTestCase->drupalCreateRole()
Created role of name: itcHc81k, id: -n/a-Roleopenid.test43OpenIDFunctionalTestCase->setUp()
Argument 1 passed to DrupalWebTestCase::drupalLogin() must be an instance of stdClass, boolean given, called in /var/lib/drupaltestbot/sites/default/files/checkout/modules/openid/openid.test on line 119 and definedRecoverable errordrupal_web_test_case.php1112DrupalWebTestCase->drupalLogin()
Trying to get property of non-objectNoticedrupal_web_test_case.php1118DrupalWebTestCase->drupalLogin()
Trying to get property of non-objectNoticedrupal_web_test_case.php1119DrupalWebTestCase->drupalLogin()
Failed to set field name to Otheropenid.test119OpenIDFunctionalTestCase->testLogin()
Failed to set field pass to Otheropenid.test119OpenIDFunctionalTestCase->testLogin()
Found the requested form fields at userOtheropenid.test119OpenIDFunctionalTestCase->testLogin()
Trying to get property of non-objectNoticedrupal_web_test_case.php1125DrupalWebTestCase->drupalLogin()
User successfully logged in.User loginopenid.test119OpenIDFunctionalTestCase->testLogin()
Trying to get property of non-objectNoticeopenid.test246OpenIDFunctionalTestCase->addIdentity()
Failed to set field openid_identifier to http://pifr-mysql/checkout/?q=openid-test/yadis/xrdsOtheropenid.test246OpenIDFunctionalTestCase->addIdentity()
Found the Add an OpenID buttonOtheropenid.test246OpenIDFunctionalTestCase->addIdentity()
Found the requested form fields at user//openidOtheropenid.test246OpenIDFunctionalTestCase->addIdentity()
OpenID redirect page was displayed.Otheropenid.test256OpenIDFunctionalTestCase->addIdentity()
Found the Send buttonOtheropenid.test259OpenIDFunctionalTestCase->addIdentity()
Found the requested form fields at Otheropenid.test259OpenIDFunctionalTestCase->addIdentity()
Identity http://pifr-mysql/checkout/?q=openid-test/yadis/xrds was added.Otheropenid.test265OpenIDFunctionalTestCase->addIdentity()
LeafOpenID helper functions (OpenIDUnitTest) [OpenID]3200
ExpandOptions widgets (OptionsWidgetsTestCase) [Field types]012
MessageGroupFilenameLineFunctionStatus
The test did not complete due to a fatal error.Completion checkoptions.test60OptionsWidgetsTestCase->testRadioButtons()
Undefined property: stdClass::$ridNoticeuser.module2746user_role_save()
Undefined property: stdClass::$ridNoticedrupal_web_test_case.php1045DrupalWebTestCase->drupalCreateRole()
ExpandPage cache test (BootstrapPageCacheTestCase) [Bootstrap]5106
MessageGroupFilenameLineFunctionStatus
Undefined property: stdClass::$ridNoticeuser.module2746user_role_save()
Undefined property: stdClass::$ridNoticedrupal_web_test_case.php1045DrupalWebTestCase->drupalCreateRole()
PDOException: SQLSTATE[23000]: Integrity constraint violation: 1048 Column 'rid' cannot be null: INSERT INTO {role_permission} (rid, permission, module) VALUES (:db_insert_placeholder_0, :db_insert_placeholder_1, :db_insert_placeholder_2); Array ( [:db_insert_placeholder_0] => [:db_insert_placeholder_1] => access comments [:db_insert_placeholder_2] => comment ) in user_role_grant_permissions() (line 2885 of /var/lib/drupaltestbot/sites/default/files/checkout/modules/user/user.module).Uncaught exceptiondatabase.inc1967PDOStatement->execute()
Undefined property: stdClass::$ridNoticeuser.module2746user_role_save()
Undefined property: stdClass::$ridNoticedrupal_web_test_case.php1045DrupalWebTestCase->drupalCreateRole()
PDOException: SQLSTATE[23000]: Integrity constraint violation: 1048 Column 'rid' cannot be null: INSERT INTO {role_permission} (rid, permission, module) VALUES (:db_insert_placeholder_0, :db_insert_placeholder_1, :db_insert_placeholder_2); Array ( [:db_insert_placeholder_0] => [:db_insert_placeholder_1] => access comments [:db_insert_placeholder_2] => comment ) in user_role_grant_permissions() (line 2885 of /var/lib/drupaltestbot/sites/default/files/checkout/modules/user/user.module).Uncaught exceptiondatabase.inc1967PDOStatement->execute()
LeafPager query tests (DatabaseSelectPagerDefaultTestCase) [Database]4200
LeafParsing .info files (ParseInfoFilesTestCase) [System]300
ExpandPath alias functionality (PathTestCase) [Path]012
MessageGroupFilenameLineFunctionStatus
The test did not complete due to a fatal error.Completion checkpath.test29PathTestCase->testPathCache()
Undefined property: stdClass::$ridNoticeuser.module2746user_role_save()
Undefined property: stdClass::$ridNoticedrupal_web_test_case.php1045DrupalWebTestCase->drupalCreateRole()
ExpandPath aliases with languages (PathLanguageUITestCase) [Path]012
MessageGroupFilenameLineFunctionStatus
The test did not complete due to a fatal error.Completion checkpath.test401PathLanguageUITestCase->testLanguageNeutralURLs()
Undefined property: stdClass::$ridNoticeuser.module2746user_role_save()
Undefined property: stdClass::$ridNoticedrupal_web_test_case.php1045DrupalWebTestCase->drupalCreateRole()
ExpandPath aliases with translated nodes (PathLanguageTestCase) [Path]012
MessageGroupFilenameLineFunctionStatus
The test did not complete due to a fatal error.Completion checkpath.test262PathLanguageTestCase->testAliasTranslation()
Undefined property: stdClass::$ridNoticeuser.module2746user_role_save()
Undefined property: stdClass::$ridNoticedrupal_web_test_case.php1045DrupalWebTestCase->drupalCreateRole()
ExpandPath language settings (LocalePathFunctionalTest) [Locale]003
MessageGroupFilenameLineFunctionStatus
Undefined property: stdClass::$ridNoticeuser.module2746user_role_save()
Undefined property: stdClass::$ridNoticedrupal_web_test_case.php1045DrupalWebTestCase->drupalCreateRole()
PDOException: SQLSTATE[23000]: Integrity constraint violation: 1048 Column 'rid' cannot be null: INSERT INTO {role_permission} (rid, permission, module) VALUES (:db_insert_placeholder_0, :db_insert_placeholder_1, :db_insert_placeholder_2); Array ( [:db_insert_placeholder_0] => [:db_insert_placeholder_1] => administer languages [:db_insert_placeholder_2] => locale ) in user_role_grant_permissions() (line 2885 of /var/lib/drupaltestbot/sites/default/files/checkout/modules/user/user.module).Uncaught exceptiondatabase.inc1967PDOStatement->execute()
ExpandPaths on non-English monolingual sites (PathMonolingualTestCase) [Path]012
MessageGroupFilenameLineFunctionStatus
The test did not complete due to a fatal error.Completion checkpath.test492PathMonolingualTestCase->testPageLinks()
Undefined property: stdClass::$ridNoticeuser.module2746user_role_save()
Undefined property: stdClass::$ridNoticedrupal_web_test_case.php1045DrupalWebTestCase->drupalCreateRole()
ExpandPersonal contact form (ContactPersonalTestCase) [Contact]012
MessageGroupFilenameLineFunctionStatus
The test did not complete due to a fatal error.Completion checkcontact.test310ContactPersonalTestCase->testPersonalContactAccess()
Undefined property: stdClass::$ridNoticeuser.module2746user_role_save()
Undefined property: stdClass::$ridNoticedrupal_web_test_case.php1045DrupalWebTestCase->drupalCreateRole()
ExpandPHP filter access check (PHPAccessTestCase) [PHP]012
MessageGroupFilenameLineFunctionStatus
The test did not complete due to a fatal error.Completion checkphp.test105PHPAccessTestCase->testNoPrivileges()
ExpandPHP filter functionality (PHPFilterTestCase) [PHP]012
MessageGroupFilenameLineFunctionStatus
The test did not complete due to a fatal error.Completion checkphp.test64PHPFilterTestCase->testPHPFilter()
LeafPoll add choice (PollJSAddChoice) [Poll]003
LeafPoll create (PollCreateTestCase) [Poll]106
LeafPoll expiration (PollExpirationTestCase) [Poll]103
LeafPoll token replacement (PollTokenReplaceTestCase) [Poll]103
LeafPoll upgrade path (PollUpgradePathTestCase) [Upgrade path]21400
LeafPoll vote (PollVoteTestCase) [Poll]103
LeafProfile browsing (ProfileTestBrowsing) [Profile]012
LeafProgrammatic form submissions (FormsProgrammaticTestCase) [Form API]1800
LeafQuery altering tests (DatabaseAlterTestCase) [Database]5500
LeafQuery logging (DatabaseLoggingTestCase) [Database]3800
LeafQuery tagging tests (DatabaseTaggingTestCase) [Database]2800
LeafQueue functionality (QueueTestCase) [System]700
LeafRange query test (DatabaseRangeQueryTestCase) [Database]200
LeafRDF comment mapping (RdfCommentAttributesTestCase) [RDF]012
LeafRDF mapping CRUD functions (RdfCrudTestCase) [RDF]900
LeafRDF mapping definition functionality (RdfMappingDefinitionTestCase) [RDF]1703
LeafRDF mapping hook (RdfMappingHookTestCase) [RDF]500
LeafRDF namespaces (RdfGetRdfNamespacesTestCase) [RDF]400
LeafRDF namespaces XML serialization tests (DrupalGetRdfNamespacesTestCase) [System]600
LeafRDF tracker page mapping (RdfTrackerAttributesTestCase) [RDF]3200
LeafRDFa markup (RdfRdfaMarkupTestCase) [RDF]503
LeafRebuild arbitrary forms (FormsArbitraryRebuildTestCase) [Form API]1400
LeafRebuild content (NodeBuildContent) [Node]100
LeafRegistry parse file test (RegistryParseFileTestCase) [System]200
LeafRegistry parse files test (RegistryParseFilesTestCase) [System]600
LeafRegression tests (DatabaseRegressionTestCase) [Database]2700
ExpandRemove feed functionality (RemoveFeedTestCase) [Aggregator]012
MessageGroupFilenameLineFunctionStatus
The test did not complete due to a fatal error.Completion checkaggregator.test410RemoveFeedTestCase->testRemoveFeed()
Undefined property: stdClass::$ridNoticeuser.module2746user_role_save()
Undefined property: stdClass::$ridNoticedrupal_web_test_case.php1045DrupalWebTestCase->drupalCreateRole()
ExpandRemove feed item functionality (RemoveFeedItemTestCase) [Aggregator]012
MessageGroupFilenameLineFunctionStatus
The test did not complete due to a fatal error.Completion checkaggregator.test499RemoveFeedItemTestCase->testRemoveFeedItem()
Undefined property: stdClass::$ridNoticeuser.module2746user_role_save()
Undefined property: stdClass::$ridNoticedrupal_web_test_case.php1045DrupalWebTestCase->drupalCreateRole()
ExpandRequired modules (ModuleRequiredTestCase) [Module]012
MessageGroupFilenameLineFunctionStatus
The test did not complete due to a fatal error.Completion checksystem.test428ModuleRequiredTestCase->testDisableRequired()
Undefined property: stdClass::$ridNoticeuser.module2746user_role_save()
Undefined property: stdClass::$ridNoticedrupal_web_test_case.php1045DrupalWebTestCase->drupalCreateRole()
ExpandRequirements hook failure (HookRequirementsTestCase) [Module]012
MessageGroupFilenameLineFunctionStatus
The test did not complete due to a fatal error.Completion checksystem.test187HookRequirementsTestCase->testHookRequirementsFailure()
Undefined property: stdClass::$ridNoticeuser.module2746user_role_save()
Undefined property: stdClass::$ridNoticedrupal_web_test_case.php1045DrupalWebTestCase->drupalCreateRole()
LeafResettable static variables test (BootstrapResettableStaticTestCase) [Bootstrap]500
LeafRole assignment (UserRolesAssignmentTestCase) [User]012
LeafRole permissions (UserPermissionsTestCase) [User]012
LeafSchema API (SchemaTestCase) [Database]2700
LeafSearch engine phrase queries (SearchExactTestCase) [Search]003
LeafSearch engine queries (SearchMatchTestCase) [Search]14400
LeafSearch engine ranking (SearchRankingTestCase) [Search]009
LeafSearch excerpt extraction (SearchExcerptTestCase) [Search]500
LeafSearch expression insert/extract (SearchExpressionInsertExtractTestCase) [Search]2400
LeafSearch page override (SearchPageOverride) [Search]012
LeafSearch page text (SearchPageText) [Search]012
LeafSearch simplify (SearchSimplifyTestCase) [Search]33800
ExpandSecurity (FilterSecurityTestCase) [Filter]012
MessageGroupFilenameLineFunctionStatus
The test did not complete due to a fatal error.Completion checkfilter.test742FilterSecurityTestCase->testDisableFilterModule()
Undefined property: stdClass::$ridNoticeuser.module2746user_role_save()
Undefined property: stdClass::$ridNoticedrupal_web_test_case.php1045DrupalWebTestCase->drupalCreateRole()
LeafSelect tests (DatabaseSelectTestCase) [Database]11700
LeafSelect tests, complex (DatabaseSelectComplexTestCase) [Database]11500
ExpandSelect tests, complex 2 (DatabaseSelectComplexTestCase2) [Database]503
MessageGroupFilenameLineFunctionStatus
Undefined property: stdClass::$ridNoticeuser.module2746user_role_save()
Undefined property: stdClass::$ridNoticedrupal_web_test_case.php1045DrupalWebTestCase->drupalCreateRole()
PDOException: SQLSTATE[23000]: Integrity constraint violation: 1048 Column 'rid' cannot be null: INSERT INTO {role_permission} (rid, permission, module) VALUES (:db_insert_placeholder_0, :db_insert_placeholder_1, :db_insert_placeholder_2); Array ( [:db_insert_placeholder_0] => [:db_insert_placeholder_1] => access content [:db_insert_placeholder_2] => node ) in user_role_grant_permissions() (line 2885 of /var/lib/drupaltestbot/sites/default/files/checkout/modules/user/user.module).Uncaught exceptiondatabase.inc1967PDOStatement->execute()
LeafSelect tests, ordered (DatabaseSelectOrderedTestCase) [Database]2600
LeafSelect tests, subqueries (DatabaseSelectSubqueryTestCase) [Database]2400
LeafSequences API (DatabaseNextIdCase) [Database]200
LeafSession https handling (SessionHttpsTestCase) [Session]003
LeafSession tests (SessionTestCase) [Session]3906
LeafShortcut link functionality (ShortcutLinksTestCase) [Shortcut]012
LeafShortcut set functionality (ShortcutSetsTestCase) [Shortcut]012
LeafShutdown functions (ShutdownFunctionsTest) [System]400
LeafSimpleTest browser (SimpleTestBrowserTestCase) [SimpleTest]1600
LeafSimpleTest e-mail capturing (SimpleTestMailCaptureTestCase) [SimpleTest]1300
LeafSimpleTest error collector (DrupalErrorCollectionUnitTest) [SimpleTest]1500
LeafSimpleTest functionality (SimpleTestFunctionalTest) [SimpleTest]012
LeafSite maintenance mode functionality (SiteMaintenanceTestCase) [System]012
ExpandSite-wide contact form (ContactSitewideTestCase) [Contact]006
MessageGroupFilenameLineFunctionStatus
Undefined property: stdClass::$ridNoticeuser.module2746user_role_save()
Undefined property: stdClass::$ridNoticedrupal_web_test_case.php1045DrupalWebTestCase->drupalCreateRole()
PDOException: SQLSTATE[23000]: Integrity constraint violation: 1048 Column 'rid' cannot be null: INSERT INTO {role_permission} (rid, permission, module) VALUES (:db_insert_placeholder_0, :db_insert_placeholder_1, :db_insert_placeholder_2); Array ( [:db_insert_placeholder_0] => [:db_insert_placeholder_1] => access site-wide contact form [:db_insert_placeholder_2] => contact ) in user_role_grant_permissions() (line 2885 of /var/lib/drupaltestbot/sites/default/files/checkout/modules/user/user.module).Uncaught exceptiondatabase.inc1967PDOStatement->execute()
Undefined property: stdClass::$ridNoticeuser.module2746user_role_save()
Undefined property: stdClass::$ridNoticedrupal_web_test_case.php1045DrupalWebTestCase->drupalCreateRole()
PDOException: SQLSTATE[23000]: Integrity constraint violation: 1048 Column 'rid' cannot be null: INSERT INTO {role_permission} (rid, permission, module) VALUES (:db_insert_placeholder_0, :db_insert_placeholder_1, :db_insert_placeholder_2); Array ( [:db_insert_placeholder_0] => [:db_insert_placeholder_1] => access site-wide contact form [:db_insert_placeholder_2] => contact ) in user_role_grant_permissions() (line 2885 of /var/lib/drupaltestbot/sites/default/files/checkout/modules/user/user.module).Uncaught exceptiondatabase.inc1967PDOStatement->execute()
LeafSize parsing test (CommonSizeTestCase) [System]3500
LeafStatistics logging tests (StatisticsLoggingTestCase) [Statistics]1200
LeafStatistics reports tests (StatisticsReportsTestCase) [Statistics]012
LeafStatistics token replacement (StatisticsTokenReplaceTestCase) [Statistics]012
LeafStream wrappers (StreamWrapperTest) [File API]1500
LeafString filtering tests (CommonXssUnitTest) [System]900
ExpandString translate, search and validate (LocaleTranslationFunctionalTest) [Locale]0012
MessageGroupFilenameLineFunctionStatus
Undefined property: stdClass::$ridNoticeuser.module2746user_role_save()
Undefined property: stdClass::$ridNoticedrupal_web_test_case.php1045DrupalWebTestCase->drupalCreateRole()
PDOException: SQLSTATE[23000]: Integrity constraint violation: 1048 Column 'rid' cannot be null: INSERT INTO {role_permission} (rid, permission, module) VALUES (:db_insert_placeholder_0, :db_insert_placeholder_1, :db_insert_placeholder_2); Array ( [:db_insert_placeholder_0] => [:db_insert_placeholder_1] => administer languages [:db_insert_placeholder_2] => locale ) in user_role_grant_permissions() (line 2885 of /var/lib/drupaltestbot/sites/default/files/checkout/modules/user/user.module).Uncaught exceptiondatabase.inc1967PDOStatement->execute()
Undefined property: stdClass::$ridNoticeuser.module2746user_role_save()
Undefined property: stdClass::$ridNoticedrupal_web_test_case.php1045DrupalWebTestCase->drupalCreateRole()
PDOException: SQLSTATE[23000]: Integrity constraint violation: 1048 Column 'rid' cannot be null: INSERT INTO {role_permission} (rid, permission, module) VALUES (:db_insert_placeholder_0, :db_insert_placeholder_1, :db_insert_placeholder_2); Array ( [:db_insert_placeholder_0] => [:db_insert_placeholder_1] => translate interface [:db_insert_placeholder_2] => locale ) in user_role_grant_permissions() (line 2885 of /var/lib/drupaltestbot/sites/default/files/checkout/modules/user/user.module).Uncaught exceptiondatabase.inc1967PDOStatement->execute()
Undefined property: stdClass::$ridNoticeuser.module2746user_role_save()
Undefined property: stdClass::$ridNoticedrupal_web_test_case.php1045DrupalWebTestCase->drupalCreateRole()
PDOException: SQLSTATE[23000]: Integrity constraint violation: 1048 Column 'rid' cannot be null: INSERT INTO {role_permission} (rid, permission, module) VALUES (:db_insert_placeholder_0, :db_insert_placeholder_1, :db_insert_placeholder_2); Array ( [:db_insert_placeholder_0] => [:db_insert_placeholder_1] => administer languages [:db_insert_placeholder_2] => locale ) in user_role_grant_permissions() (line 2885 of /var/lib/drupaltestbot/sites/default/files/checkout/modules/user/user.module).Uncaught exceptiondatabase.inc1967PDOStatement->execute()
Undefined property: stdClass::$ridNoticeuser.module2746user_role_save()
Undefined property: stdClass::$ridNoticedrupal_web_test_case.php1045DrupalWebTestCase->drupalCreateRole()
PDOException: SQLSTATE[23000]: Integrity constraint violation: 1048 Column 'rid' cannot be null: INSERT INTO {role_permission} (rid, permission, module) VALUES (:db_insert_placeholder_0, :db_insert_placeholder_1, :db_insert_placeholder_2); Array ( [:db_insert_placeholder_0] => [:db_insert_placeholder_1] => administer languages [:db_insert_placeholder_2] => locale ) in user_role_grant_permissions() (line 2885 of /var/lib/drupaltestbot/sites/default/files/checkout/modules/user/user.module).Uncaught exceptiondatabase.inc1967PDOStatement->execute()
LeafString translation using st() (LocaleInstallTest) [Locale]100
ExpandSummary length (SummaryLengthTestCase) [Node]103
MessageGroupFilenameLineFunctionStatus
Undefined property: stdClass::$ridNoticeuser.module2746user_role_save()
Undefined property: stdClass::$ridNoticedrupal_web_test_case.php1045DrupalWebTestCase->drupalCreateRole()
PDOException: SQLSTATE[23000]: Integrity constraint violation: 1048 Column 'rid' cannot be null: INSERT INTO {role_permission} (rid, permission, module) VALUES (:db_insert_placeholder_0, :db_insert_placeholder_1, :db_insert_placeholder_2); Array ( [:db_insert_placeholder_0] => [:db_insert_placeholder_1] => access content [:db_insert_placeholder_2] => node ) in user_role_grant_permissions() (line 2885 of /var/lib/drupaltestbot/sites/default/files/checkout/modules/user/user.module).Uncaught exceptiondatabase.inc1967PDOStatement->execute()
LeafSyslog functionality (SyslogTestCase) [Syslog]003
LeafSystem info alter (SystemInfoAlterTestCase) [System]1000
LeafTableselect form element type test (FormsElementsTableSelectFunctionalTest) [Form API]5200
LeafTablesort query tests (DatabaseSelectTableSortDefaultTestCase) [Database]3400
LeafTaxonomy term functions and forms. (TaxonomyTermTestCase) [Taxonomy]012
LeafTaxonomy term hooks (TaxonomyHooksTestCase) [Taxonomy]012
LeafTaxonomy term multiple loading (TaxonomyLoadMultipleUnitTest) [Taxonomy]012
LeafTaxonomy term reference field (TaxonomyTermFieldTestCase) [Taxonomy]012
LeafTaxonomy term unit tests (TaxonomyTermUnitTest) [Taxonomy]100
ExpandTaxonomy term URL aliases (PathTaxonomyTermTestCase) [Path]012
MessageGroupFilenameLineFunctionStatus
The test did not complete due to a fatal error.Completion checkpath.test191PathTaxonomyTermTestCase->testTermAlias()
Undefined property: stdClass::$ridNoticeuser.module2746user_role_save()
Undefined property: stdClass::$ridNoticedrupal_web_test_case.php1045DrupalWebTestCase->drupalCreateRole()
LeafTaxonomy token replacement (TaxonomyTokenReplaceTestCase) [Taxonomy]012
LeafTaxonomy upgrade path (UpgradePathTaxonomyTestCase) [Upgrade path]126500
LeafTaxonomy vocabularies (TaxonomyVocabularyUnitTest) [Taxonomy]012
LeafTaxonomy vocabulary interface (TaxonomyVocabularyFunctionalTest) [Taxonomy]012
LeafTemporary query test (DatabaseTemporaryQueryTestCase) [Database]500
LeafTest date field (ProfileTestDate) [Profile]012
LeafTest field weights (ProfileTestWeights) [Profile]012
LeafTest select field (ProfileTestSelect) [Profile]012
LeafTest single fields (ProfileTestFields) [Profile]012
LeafTest statistics admin. (StatisticsAdminTestCase) [Statistics]012
LeafTest user actions (TriggerUserActionTestCase) [Trigger]003
LeafTest user triggers (TriggerUserTokenTestCase) [Trigger]003
LeafTesting SimpleTest setUp (SimpleTestFolderTestCase) [SimpleTest]100
ExpandText field (TextFieldTestCase) [Field types]012
MessageGroupFilenameLineFunctionStatus
The test did not complete due to a fatal error.Completion checktext.test30TextFieldTestCase->testTextFieldValidation()
Undefined property: stdClass::$ridNoticeuser.module2746user_role_save()
Undefined property: stdClass::$ridNoticedrupal_web_test_case.php1045DrupalWebTestCase->drupalCreateRole()
LeafText summary (TextSummaryTestCase) [Field types]11600
ExpandText translation (TextTranslationTestCase) [Field types]012
MessageGroupFilenameLineFunctionStatus
The test did not complete due to a fatal error.Completion checktext.test407TextTranslationTestCase->testTextField()
Undefined property: stdClass::$ridNoticeuser.module2746user_role_save()
Undefined property: stdClass::$ridNoticedrupal_web_test_case.php1045DrupalWebTestCase->drupalCreateRole()
LeafTheme API (ThemeUnitTest) [Theme]1600
LeafTheme fast initialization (ThemeFastTestCase) [Theme]012
LeafTheme initialization in hook_init() (ThemeHookInitUnitTest) [Theme]400
LeafTheme interface functionality (SystemThemeFunctionalTest) [System]012
LeafTheme item list (ThemeItemListUnitTest) [Theme]100
LeafTheme Table (ThemeTableUnitTest) [Theme]600
LeafTimer test (BootstrapTimerTestCase) [Bootstrap]500
LeafToken replacement (TokenReplaceTestCase) [System]2003
LeafTop visitor blocking (StatisticsBlockVisitorsTestCase) [Statistics]012
LeafTracker (TrackerTest) [Tracker]012
LeafTransaction tests (DatabaseTransactionTestCase) [Database]3100
ExpandTranslation export (LocaleExportFunctionalTest) [Locale]012
MessageGroupFilenameLineFunctionStatus
The test did not complete due to a fatal error.Completion checklocale.test905LocaleExportFunctionalTest->testExportTranslation()
Undefined property: stdClass::$ridNoticeuser.module2746user_role_save()
Undefined property: stdClass::$ridNoticedrupal_web_test_case.php1045DrupalWebTestCase->drupalCreateRole()
LeafTranslation functionality (TranslationTestCase) [Translation]003
ExpandTranslation import (LocaleImportFunctionalTest) [Locale]012
MessageGroupFilenameLineFunctionStatus
The test did not complete due to a fatal error.Completion checklocale.test604LocaleImportFunctionalTest->testStandalonePoFile()
Undefined property: stdClass::$ridNoticeuser.module2746user_role_save()
Undefined property: stdClass::$ridNoticedrupal_web_test_case.php1045DrupalWebTestCase->drupalCreateRole()
LeafTrigger content (node) actions (TriggerContentTestCase) [Trigger]006
LeafTrigger cron (system) actions (TriggerCronTestCase) [Trigger]003
LeafTrigger orphaned actions (TriggerOrphanedActionsTestCase) [Trigger]003
LeafTrigger other actions (TriggerOtherTestCase) [Trigger]009
ExpandUI language negotiation (LocaleUILanguageNegotiationTest) [Locale]003
MessageGroupFilenameLineFunctionStatus
Undefined property: stdClass::$ridNoticeuser.module2746user_role_save()
Undefined property: stdClass::$ridNoticedrupal_web_test_case.php1045DrupalWebTestCase->drupalCreateRole()
PDOException: SQLSTATE[23000]: Integrity constraint violation: 1048 Column 'rid' cannot be null: INSERT INTO {role_permission} (rid, permission, module) VALUES (:db_insert_placeholder_0, :db_insert_placeholder_1, :db_insert_placeholder_2); Array ( [:db_insert_placeholder_0] => [:db_insert_placeholder_1] => administer languages [:db_insert_placeholder_2] => locale ) in user_role_grant_permissions() (line 2885 of /var/lib/drupaltestbot/sites/default/files/checkout/modules/user/user.module).Uncaught exceptiondatabase.inc1967PDOStatement->execute()
LeafUnassigned text format functionality (FilterNoFormatTestCase) [Filter]100
LeafUnicode handling (UnicodeUnitTest) [System]17600
LeafUnmanaged file copying (FileUnmanagedCopyTest) [File API]3100
LeafUnmanaged file delete (FileUnmanagedDeleteTest) [File API]800
LeafUnmanaged file moving (FileUnmanagedMoveTest) [File API]2200
LeafUnmanaged file save data (FileUnmanagedSaveDataTest) [File API]700
LeafUnmanaged recursive file delete (FileUnmanagedDeleteRecursiveTest) [File API]1700
LeafUpdate contrib functionality (UpdateTestContribCase) [Update]012
LeafUpdate core functionality (UpdateCoreTestCase) [Update]012
LeafUpdate dependency hook invocation (UpdateDependencyHookInvocationTestCase) [Update API]300
LeafUpdate dependency ordering (UpdateDependencyOrderingTestCase) [Update API]300
ExpandUpdate feed functionality (UpdateFeedTestCase) [Aggregator]012
MessageGroupFilenameLineFunctionStatus
The test did not complete due to a fatal error.Completion checkaggregator.test368UpdateFeedTestCase->testUpdateFeed()
Undefined property: stdClass::$ridNoticeuser.module2746user_role_save()
Undefined property: stdClass::$ridNoticedrupal_web_test_case.php1045DrupalWebTestCase->drupalCreateRole()
ExpandUpdate feed item functionality (UpdateFeedItemTestCase) [Aggregator]012
MessageGroupFilenameLineFunctionStatus
The test did not complete due to a fatal error.Completion checkaggregator.test438UpdateFeedItemTestCase->testUpdateFeedItem()
Undefined property: stdClass::$ridNoticeuser.module2746user_role_save()
Undefined property: stdClass::$ridNoticedrupal_web_test_case.php1045DrupalWebTestCase->drupalCreateRole()
LeafUpdate functionality (UpdateScriptFunctionalTest) [System]012
ExpandUpdate on cron functionality (AggregatorCronTestCase) [Aggregator]012
MessageGroupFilenameLineFunctionStatus
The test did not complete due to a fatal error.Completion checkaggregator.test718AggregatorCronTestCase->testCron()
Undefined property: stdClass::$ridNoticeuser.module2746user_role_save()
Undefined property: stdClass::$ridNoticedrupal_web_test_case.php1045DrupalWebTestCase->drupalCreateRole()
LeafUpdate tests (DatabaseUpdateTestCase) [Database]3500
LeafUpdate tests, Complex (DatabaseUpdateComplexTestCase) [Database]5200
LeafUpdate tests, LOB (DatabaseUpdateLOBTestCase) [Database]1300
LeafUpload and extract module functionality (UpdateTestUploadCase) [Update]012
LeafUpload upgrade path (UploadUpgradePathTestCase) [Upgrade path]3200
LeafUpload user picture (UserPictureTestCase) [User]012
LeafURL altering (UrlAlterFunctionalTest) [Path API]303
LeafURL generation tests (CommonURLUnitTest) [System]5600
LeafUser administration (UserAdminTestCase) [User]014
LeafUser autocompletion (UserAutocompleteTestCase) [User]012
LeafUser blocks (UserBlocksUnitTests) [User]017
LeafUser create (UserCreateTestCase) [User]003
ExpandUser creation (LocaleUserCreationTest) [Locale]003
MessageGroupFilenameLineFunctionStatus
Undefined property: stdClass::$ridNoticeuser.module2746user_role_save()
Undefined property: stdClass::$ridNoticedrupal_web_test_case.php1045DrupalWebTestCase->drupalCreateRole()
PDOException: SQLSTATE[23000]: Integrity constraint violation: 1048 Column 'rid' cannot be null: INSERT INTO {role_permission} (rid, permission, module) VALUES (:db_insert_placeholder_0, :db_insert_placeholder_1, :db_insert_placeholder_2); Array ( [:db_insert_placeholder_0] => [:db_insert_placeholder_1] => administer languages [:db_insert_placeholder_2] => locale ) in user_role_grant_permissions() (line 2885 of /var/lib/drupaltestbot/sites/default/files/checkout/modules/user/user.module).Uncaught exceptiondatabase.inc1967PDOStatement->execute()
LeafUser edit (UserEditTestCase) [User]003
LeafUser edited own account (UserEditedOwnAccountTestCase) [User]003
ExpandUser language settings (LocaleUserLanguageFunctionalTest) [Locale]003
MessageGroupFilenameLineFunctionStatus
Undefined property: stdClass::$ridNoticeuser.module2746user_role_save()
Undefined property: stdClass::$ridNoticedrupal_web_test_case.php1045DrupalWebTestCase->drupalCreateRole()
PDOException: SQLSTATE[23000]: Integrity constraint violation: 1048 Column 'rid' cannot be null: INSERT INTO {role_permission} (rid, permission, module) VALUES (:db_insert_placeholder_0, :db_insert_placeholder_1, :db_insert_placeholder_2); Array ( [:db_insert_placeholder_0] => [:db_insert_placeholder_1] => administer languages [:db_insert_placeholder_2] => locale ) in user_role_grant_permissions() (line 2885 of /var/lib/drupaltestbot/sites/default/files/checkout/modules/user/user.module).Uncaught exceptiondatabase.inc1967PDOStatement->execute()
LeafUser login (UserLoginTestCase) [User]022
LeafUser poll vote capability. (PollVoteCheckHostname) [Poll]012
LeafUser registration (UserRegistrationTestCase) [User]5803
LeafUser role administration (UserRoleAdminTestCase) [User]012
LeafUser save test (UserSaveTestCase) [User]300
LeafUser search (UserUserSearchTestCase) [User]003
LeafUser signatures (UserSignatureTestCase) [User]023
LeafUser time zones (UserTimeZoneFunctionalTest) [User]003
LeafUser token replacement (UserTokenReplaceTestCase) [User]014
LeafUsername/e-mail validation (UserValidationTestCase) [User]1900
LeafValid Url (ValidUrlTestCase) [System]7900
LeafVariable test (BootstrapVariableTestCase) [Bootstrap]700
LeafXML-RPC basic (XMLRPCBasicTestCase) [XML-RPC]500
LeafXML-RPC message and alteration (XMLRPCMessagesTestCase) [XML-RPC]500
LeafXML-RPC validator (XMLRPCValidator1IncTestCase) [XML-RPC]900