schema_alter_ideas_0.patch

Test status
StatusResult
Last receivedMon, 10/04/2010 - 12:10:51
Last requestedMon, 10/04/2010 - 12:22:34
Last testedMon, 10/04/2010 - 12:39:33
Test count1
Environment status
MySQLfail
File information
Fileschema_alter_ideas_0.patch
BranchDrupal core - 7.x
LinkIssue Link
SummaryFAILED: [[SimpleTest]]: [MySQL] 18,247 pass(es), 112 fail(s), and 7 exception(s).
Details

MySQL

  1. Setup environment
  2. Detect an invalid patch URL
  3. Detect invalid repository information
  4. Detect invalid patch format
  5. Detect a non-applicable patch
  6. Detect invalid PHP syntax
  7. Detect a Drupal installation failure
  8. Detect a test run failure
  9. Detect a failing test
    Review the test failures below then if necessary run them locally until the problem has been fixed.
  10. Complete test suite with all tests passing
18,247 pass(es), 112 fail(s), and 7 exception(s)

Non-pass

Test namePassFailException
ExpandBasic SQL syntax tests (DatabaseBasicSyntaxTestCase) [Database]1210
MessageGroupFilenameLineFunctionStatus
The test did not complete due to a fatal error.Completion checkdatabase_test.test2871DatabaseBasicSyntaxTestCase->testLikeEscape()
ExpandBasic upgrade path (BasicUpgradePath) [Upgrade path]402
MessageGroupFilenameLineFunctionStatus
PDOException: SQLSTATE[42S02]: Base table or view not found: 1146 Table 'drupaltestbotmysql.simpletest6646cache_bootstrap' doesn't exist: DELETE FROM {cache_bootstrap} WHERE (cid = :db_condition_placeholder_0) ; Array ( [:db_condition_placeholder_0] => variables ) in cache_clear_all() (line 170 of /var/lib/drupaltestbot/sites/default/files/checkout/includes/cache.inc).Uncaught exceptiondatabase.inc1967PDOStatement->execute()
PDOException: SQLSTATE[42S02]: Base table or view not found: 1146 Table 'drupaltestbotmysql.simpletest445616cache_bootstrap' doesn't exist: DELETE FROM {cache_bootstrap} WHERE (cid = :db_condition_placeholder_0) ; Array ( [:db_condition_placeholder_0] => variables ) in cache_clear_all() (line 170 of /var/lib/drupaltestbot/sites/default/files/checkout/includes/cache.inc).Uncaught exceptiondatabase.inc1967PDOStatement->execute()
ExpandBatch processing (BatchProcessingTestCase) [Batch API]8110
MessageGroupFilenameLineFunctionStatus
The test did not complete due to a fatal error.Completion checkbatch.test78BatchProcessingTestCase->testBatchFormMultistep()
ExpandBlock caching (BlockCacheTestCase) [Block]11410
MessageGroupFilenameLineFunctionStatus
The test did not complete due to a fatal error.Completion checkblock.test495BlockCacheTestCase->testNoCache()
ExpandBlock functionality (BlockTestCase) [Block]13610
MessageGroupFilenameLineFunctionStatus
The test did not complete due to a fatal error.Completion checkblock.test147BlockTestCase->testBlockVisibility()
ExpandBlog functionality (BlogTestCase) [Blog]3810
MessageGroupFilenameLineFunctionStatus
The test did not complete due to a fatal error.Completion checkblog.test60BlogTestCase->testBlog()
ExpandCache clear test (CacheClearCase) [Cache]810
MessageGroupFilenameLineFunctionStatus
The test did not complete due to a fatal error.Completion checkcache.test281CacheClearCase->testClearArray()
ExpandCache saving test (CacheSavingCase) [Cache]210
MessageGroupFilenameLineFunctionStatus
The test did not complete due to a fatal error.Completion checkcache.test130CacheSavingCase->testDouble()
ExpandCancel account (UserCancelTestCase) [User]2910
MessageGroupFilenameLineFunctionStatus
The test did not complete due to a fatal error.Completion checkuser.test398UserCancelTestCase->testUserCancelInvalid()
ExpandCascading stylesheets (CascadingStylesheetsTestCase) [System]510
MessageGroupFilenameLineFunctionStatus
The test did not complete due to a fatal error.Completion checkcommon.test607CascadingStylesheetsTestCase->testAddFile()
ExpandComment paging settings (CommentPagerTest) [Comment]14310
MessageGroupFilenameLineFunctionStatus
The test did not complete due to a fatal error.Completion checkcomment.test799CommentPagerTest->testCommentNewPageIndicator()
ExpandComment upgrade path (CommentUpgradePathTestCase) [Upgrade path]201
MessageGroupFilenameLineFunctionStatus
PDOException: SQLSTATE[42S02]: Base table or view not found: 1146 Table 'drupaltestbotmysql.simpletest882315cache_bootstrap' doesn't exist: DELETE FROM {cache_bootstrap} WHERE (cid = :db_condition_placeholder_0) ; Array ( [:db_condition_placeholder_0] => variables ) in cache_clear_all() (line 170 of /var/lib/drupaltestbot/sites/default/files/checkout/includes/cache.inc).Uncaught exceptiondatabase.inc1967PDOStatement->execute()
ExpandConnection tests (DatabaseConnectionTestCase) [Database]1910
MessageGroupFilenameLineFunctionStatus
The test did not complete due to a fatal error.Completion checkdatabase_test.test237DatabaseConnectionTestCase->testConnectionClosing()
ExpandCron run (CronRunTestCase) [System]3610
MessageGroupFilenameLineFunctionStatus
The test did not complete due to a fatal error.Completion checksystem.test574CronRunTestCase->testTempFileCleanup()
ExpandDate and time (DateTimeFunctionalTest) [System]5210
MessageGroupFilenameLineFunctionStatus
The test did not complete due to a fatal error.Completion checksystem.test946DateTimeFunctionalTest->testDateFormatConfiguration()
ExpandDBLog functionality (DBLogTestCase) [DBLog]38210
MessageGroupFilenameLineFunctionStatus
The test did not complete due to a fatal error.Completion checkdblog.test407DBLogTestCase->testFilter()
ExpandDelete/Truncate tests (DatabaseDeleteTruncateTestCase) [Database]1410
MessageGroupFilenameLineFunctionStatus
The test did not complete due to a fatal error.Completion checkdatabase_test.test1022DatabaseDeleteTruncateTestCase->testTruncate()
ExpandDrupal goto (DrupalGotoTest) [System]1410
MessageGroupFilenameLineFunctionStatus
The test did not complete due to a fatal error.Completion checkcommon.test1098DrupalGotoTest->testDrupalGetDestination()
ExpandDrupal HTTP request (DrupalHTTPRequestTestCase) [System]1510
MessageGroupFilenameLineFunctionStatus
The test did not complete due to a fatal error.Completion checkcommon.test964DrupalHTTPRequestTestCase->testDrupalHTTPRequestRedirect()
Expanddrupal_render() (DrupalRenderTestCase) [System]710
MessageGroupFilenameLineFunctionStatus
The test did not complete due to a fatal error.Completion checkcommon.test1481DrupalRenderTestCase->testDrupalRenderFormElements()
ExpandEmpty statement (DatabaseEmptyStatementTestCase) [Database]310
MessageGroupFilenameLineFunctionStatus
The test did not complete due to a fatal error.Completion checkdatabase_test.test3287DatabaseEmptyStatementTestCase->testEmptyFetchAll()
ExpandFetch tests (DatabaseFetchTestCase) [Database]1710
MessageGroupFilenameLineFunctionStatus
The test did not complete due to a fatal error.Completion checkdatabase_test.test334DatabaseFetchTestCase->testQueryFetchArray()
ExpandFetch tests, part 2 (DatabaseFetch2TestCase) [Database]1710
MessageGroupFilenameLineFunctionStatus
The test did not complete due to a fatal error.Completion checkdatabase_test.test419DatabaseFetch2TestCase->testQueryFetchCol()
ExpandField attach tests (other) (FieldAttachOtherTestCase) [Field API]2910
MessageGroupFilenameLineFunctionStatus
The test did not complete due to a fatal error.Completion checkfield.test860FieldAttachOtherTestCase->testFieldAttachValidate()
ExpandField attach tests (storage-related) (FieldAttachStorageTestCase) [Field API]4810
MessageGroupFilenameLineFunctionStatus
The test did not complete due to a fatal error.Completion checkfield.test271FieldAttachStorageTestCase->testFieldAttachSaveLoadDifferentStorage()
ExpandField bulk delete tests (FieldBulkDeleteTestCase) [Field API]3610
MessageGroupFilenameLineFunctionStatus
The test did not complete due to a fatal error.Completion checkfield.test2957FieldBulkDeleteTestCase->testPurgeField()
ExpandField CRUD tests (FieldCrudTestCase) [Field API]1610
MessageGroupFilenameLineFunctionStatus
The test did not complete due to a fatal error.Completion checkfield.test1914FieldCrudTestCase->testReadField()
ExpandField form tests (FieldFormTestCase) [Field API]5510
MessageGroupFilenameLineFunctionStatus
The test did not complete due to a fatal error.Completion checkfield.test1330FieldFormTestCase->testFieldFormUnlimited()
ExpandField info tests (FieldInfoTestCase) [Field API]6210
MessageGroupFilenameLineFunctionStatus
The test did not complete due to a fatal error.Completion checkfield.test1105FieldInfoTestCase->testInstancePrepare()
ExpandField instance CRUD tests (FieldInstanceCrudTestCase) [Field API]1410
MessageGroupFilenameLineFunctionStatus
The test did not complete due to a fatal error.Completion checkfield.test2337FieldInstanceCrudTestCase->testUpdateFieldInstance()
ExpandField SQL storage tests (FieldSqlStorageTestCase) [Field API]3310
MessageGroupFilenameLineFunctionStatus
The test did not complete due to a fatal error.Completion checkfield_sql_storage.test126FieldSqlStorageTestCase->testFieldAttachInsertAndUpdate()
ExpandField translations tests (FieldTranslationsTestCase) [Field API]910
MessageGroupFilenameLineFunctionStatus
The test did not complete due to a fatal error.Completion checkfield.test2540FieldTranslationsTestCase->testFieldInvokeMultiple()
ExpandField UI tests (FieldUITestCase) [Field UI]8610
MessageGroupFilenameLineFunctionStatus
The test did not complete due to a fatal error.Completion checkfield_ui.test223FieldUITestCase->testDeleteField()
ExpandFile copying (FileCopyTest) [File API]4910
MessageGroupFilenameLineFunctionStatus
The test did not complete due to a fatal error.Completion checkfile.test1692FileCopyTest->testExistingReplace()
ExpandFile download (FileDownloadTest) [File API]1710
MessageGroupFilenameLineFunctionStatus
The test did not complete due to a fatal error.Completion checkfile.test2246FileDownloadTest->testFileCreateUrl()
ExpandFile field validation tests (FileFieldValidateTestCase) [File]7810
MessageGroupFilenameLineFunctionStatus
The test did not complete due to a fatal error.Completion checkfile.test663FileFieldValidateTestCase->testFileExtension()
ExpandFile loading (FileLoadTest) [File API]610
MessageGroupFilenameLineFunctionStatus
The test did not complete due to a fatal error.Completion checkfile.test1786FileLoadTest->testLoadInvalidStatus()
ExpandFile moving (FileMoveTest) [File API]4510
MessageGroupFilenameLineFunctionStatus
The test did not complete due to a fatal error.Completion checkfile.test1527FileMoveTest->testExistingReplace()
ExpandFile naming (FileNameMungingTest) [File API]310
MessageGroupFilenameLineFunctionStatus
The test did not complete due to a fatal error.Completion checkfile.test2432FileNameMungingTest->testMungeIgnoreWhitelisted()
ExpandFile paths and directories (FileDirectoryTest) [File API]1210
MessageGroupFilenameLineFunctionStatus
The test did not complete due to a fatal error.Completion checkfile.test957FileDirectoryTest->testFileDestination()
ExpandFile save data (FileSaveDataTest) [File API]3010
MessageGroupFilenameLineFunctionStatus
The test did not complete due to a fatal error.Completion checkfile.test2105FileSaveDataTest->testExistingRename()
ExpandFile scan directory (FileScanDirectoryTest) [File API]1310
MessageGroupFilenameLineFunctionStatus
The test did not complete due to a fatal error.Completion checkfile.test1043FileScanDirectoryTest->testOptionNoMask()
ExpandFile uploading (FileSaveUploadTest) [File API]8610
MessageGroupFilenameLineFunctionStatus
The test did not complete due to a fatal error.Completion checkfile.test721FileSaveUploadTest->testHandleDangerousFile()
ExpandFile usage (FileUsageTest) [File]1610
MessageGroupFilenameLineFunctionStatus
The test did not complete due to a fatal error.Completion checkfile.test1966FileUsageTest->testRemoveUsage()
ExpandFile validator tests (FileValidatorTest) [File API]610
MessageGroupFilenameLineFunctionStatus
The test did not complete due to a fatal error.Completion checkfile.test411FileValidatorTest->testFileValidateImageResolution()
ExpandFilter format access (FilterFormatAccessTestCase) [Filter]8010
MessageGroupFilenameLineFunctionStatus
The test did not complete due to a fatal error.Completion checkfilter.test509FilterFormatAccessTestCase->testFormatWidgetPermissions()
ExpandForm element validation (FormsTestCase) [Form API]16610
MessageGroupFilenameLineFunctionStatus
The test did not complete due to a fatal error.Completion checkform.test158FormsTestCase->testSelect()
ExpandImage effects (ImageEffectsUnitTest) [Image]1010
MessageGroupFilenameLineFunctionStatus
The test did not complete due to a fatal error.Completion checkimage.test248ImageEffectsUnitTest->testCropEffect()
ExpandImage field display tests (ImageFieldDisplayTestCase) [Image]7610
MessageGroupFilenameLineFunctionStatus
The test did not complete due to a fatal error.Completion checkimage.test714ImageFieldDisplayTestCase->testImageFieldSettings()
ExpandImage styles and effects UI configuration (ImageAdminStylesUnitTest) [Image]13610
MessageGroupFilenameLineFunctionStatus
The test did not complete due to a fatal error.Completion checkimage.test565ImageAdminStylesUnitTest->testStyleReplacement()
ExpandImage styles path and URL functions (ImageStylesPathAndUrlUnitTest) [Image]1110
MessageGroupFilenameLineFunctionStatus
The test did not complete due to a fatal error.Completion checkimage.test154ImageStylesPathAndUrlUnitTest->testImageStyleUrlAndPathPrivate()
ExpandImage toolkit tests (ImageToolkitUnitTest) [Image]810
MessageGroupFilenameLineFunctionStatus
The test did not complete due to a fatal error.Completion checkimage.test106ImageToolkitUnitTest->testSave()
ExpandInsert tests (DatabaseInsertTestCase) [Database]1610
MessageGroupFilenameLineFunctionStatus
The test did not complete due to a fatal error.Completion checkdatabase_test.test501DatabaseInsertTestCase->testRepeatedInsert()
ExpandInsert tests, default fields (DatabaseInsertDefaultsTestCase) [Database]1310
MessageGroupFilenameLineFunctionStatus
The test did not complete due to a fatal error.Completion checkdatabase_test.test682DatabaseInsertDefaultsTestCase->testDefaultInsertWithFields()
ExpandJavaScript (JavaScriptTestCase) [System]510
MessageGroupFilenameLineFunctionStatus
The test did not complete due to a fatal error.Completion checkcommon.test1169JavaScriptTestCase->testAddSetting()
ExpandMenu router (MenuRouterTestCase) [Menu]810
MessageGroupFilenameLineFunctionStatus
The test did not complete due to a fatal error.Completion checkmenu.test49MenuRouterTestCase->testThemeCallbackInheritance()
ExpandMerge tests (DatabaseMergeTestCase) [Database]2010
MessageGroupFilenameLineFunctionStatus
The test did not complete due to a fatal error.Completion checkdatabase_test.test1098DatabaseMergeTestCase->testMergeUpdateExcept()
ExpandModule API (ModuleUnitTest) [Module]3710
MessageGroupFilenameLineFunctionStatus
The test did not complete due to a fatal error.Completion checkmodule.test117ModuleUnitTest->testDependencyResolution()
ExpandModule dependencies (ModuleDependencyTestCase) [Module]6420
MessageGroupFilenameLineFunctionStatus
The test did not complete due to a fatal error.Completion checksystem.test268ModuleDependencyTestCase->testEnableRequirementsFailureDependency()
The test did not complete due to a fatal error.Completion checksystem.test268ModuleDependencyTestCase->testEnableRequirementsFailureDependency()
ExpandMultistep form using form storage (FormsFormStorageTestCase) [Form API]4510
MessageGroupFilenameLineFunctionStatus
The test did not complete due to a fatal error.Completion checkform.test836FormsFormStorageTestCase->testValidation()
ExpandNode body upgrade path (NodeBodyUpgradePathTestCase) [Upgrade path]201
MessageGroupFilenameLineFunctionStatus
PDOException: SQLSTATE[42S02]: Base table or view not found: 1146 Table 'drupaltestbotmysql.simpletest741830cache_bootstrap' doesn't exist: DELETE FROM {cache_bootstrap} WHERE (cid = :db_condition_placeholder_0) ; Array ( [:db_condition_placeholder_0] => variables ) in cache_clear_all() (line 170 of /var/lib/drupaltestbot/sites/default/files/checkout/includes/cache.inc).Uncaught exceptiondatabase.inc1967PDOStatement->execute()
ExpandNode query alter (NodeQueryAlter) [Node]3710
MessageGroupFilenameLineFunctionStatus
The test did not complete due to a fatal error.Completion checknode.test1663NodeQueryAlter->testNodeQueryAlterLowLevelNoAccess()
ExpandNode types (NodeTypeTestCase) [Node]3810
MessageGroupFilenameLineFunctionStatus
The test did not complete due to a fatal error.Completion checknode.test1100NodeTypeTestCase->testNodeTypeEditing()
ExpandOpenID account registration (OpenIDRegistrationTestCase) [OpenID]6510
MessageGroupFilenameLineFunctionStatus
The test did not complete due to a fatal error.Completion checkopenid.test368OpenIDRegistrationTestCase->testRegisterUserWithInvalidSreg()
ExpandOpenID discovery and login (OpenIDFunctionalTestCase) [OpenID]11910
MessageGroupFilenameLineFunctionStatus
The test did not complete due to a fatal error.Completion checkopenid.test152OpenIDFunctionalTestCase->testLoginMaintenanceMode()
ExpandOpenID helper functions (OpenIDUnitTest) [OpenID]510
MessageGroupFilenameLineFunctionStatus
The test did not complete due to a fatal error.Completion checkopenid.test502OpenIDUnitTest->testOpenidGetBytes()
ExpandOptions widgets (OptionsWidgetsTestCase) [Field types]7110
MessageGroupFilenameLineFunctionStatus
The test did not complete due to a fatal error.Completion checkoptions.test204OptionsWidgetsTestCase->testSelectListSingle()
ExpandPage cache test (BootstrapPageCacheTestCase) [Bootstrap]6510
MessageGroupFilenameLineFunctionStatus
The test did not complete due to a fatal error.Completion checkbootstrap.test201BootstrapPageCacheTestCase->testPageCompression()
ExpandPager query tests (DatabaseSelectPagerDefaultTestCase) [Database]2210
MessageGroupFilenameLineFunctionStatus
The test did not complete due to a fatal error.Completion checkdatabase_test.test2179DatabaseSelectPagerDefaultTestCase->testInnerPagerQuery()
ExpandPath alias functionality (PathTestCase) [Path]6110
MessageGroupFilenameLineFunctionStatus
The test did not complete due to a fatal error.Completion checkpath.test113PathTestCase->testNodeAlias()
ExpandPath aliases with languages (PathLanguageUITestCase) [Path]4610
MessageGroupFilenameLineFunctionStatus
The test did not complete due to a fatal error.Completion checkpath.test430PathLanguageUITestCase->testNonDefaultURLs()
ExpandPoll upgrade path (PollUpgradePathTestCase) [Upgrade path]201
MessageGroupFilenameLineFunctionStatus
PDOException: SQLSTATE[42S02]: Base table or view not found: 1146 Table 'drupaltestbotmysql.simpletest417703cache_bootstrap' doesn't exist: DELETE FROM {cache_bootstrap} WHERE (cid = :db_condition_placeholder_0) ; Array ( [:db_condition_placeholder_0] => variables ) in cache_clear_all() (line 170 of /var/lib/drupaltestbot/sites/default/files/checkout/includes/cache.inc).Uncaught exceptiondatabase.inc1967PDOStatement->execute()
ExpandQuery altering tests (DatabaseAlterTestCase) [Database]1810
MessageGroupFilenameLineFunctionStatus
The test did not complete due to a fatal error.Completion checkdatabase_test.test2464DatabaseAlterTestCase->testAlterChangeConditional()
ExpandQuery logging (DatabaseLoggingTestCase) [Database]1510
MessageGroupFilenameLineFunctionStatus
The test did not complete due to a fatal error.Completion checkdatabase_test.test2671DatabaseLoggingTestCase->testEnableTargetLogging()
ExpandQuery tagging tests (DatabaseTaggingTestCase) [Database]1410
MessageGroupFilenameLineFunctionStatus
The test did not complete due to a fatal error.Completion checkdatabase_test.test2367DatabaseTaggingTestCase->testHasAnyTag()
ExpandRDF comment mapping (RdfCommentAttributesTestCase) [RDF]15210
MessageGroupFilenameLineFunctionStatus
The test did not complete due to a fatal error.Completion checkrdf.test508RdfCommentAttributesTestCase->testCommentReplyOfRdfaMarkup()
ExpandRDF mapping definition functionality (RdfMappingDefinitionTestCase) [RDF]910
MessageGroupFilenameLineFunctionStatus
The test did not complete due to a fatal error.Completion checkrdf.test314RdfMappingDefinitionTestCase->testAttributesInMarkup3()
ExpandRegression tests (DatabaseRegressionTestCase) [Database]1310
MessageGroupFilenameLineFunctionStatus
The test did not complete due to a fatal error.Completion checkdatabase_test.test2604DatabaseRegressionTestCase->testDBFieldExists()
ExpandRole permissions (UserPermissionsTestCase) [User]4110
MessageGroupFilenameLineFunctionStatus
The test did not complete due to a fatal error.Completion checkuser.test1005UserPermissionsTestCase->testUserRoleChangePermissions()
ExpandSelect tests (DatabaseSelectTestCase) [Database]1310
MessageGroupFilenameLineFunctionStatus
The test did not complete due to a fatal error.Completion checkdatabase_test.test1297DatabaseSelectTestCase->testSimpleSelectConditional()
ExpandSelect tests, complex (DatabaseSelectComplexTestCase) [Database]3410
MessageGroupFilenameLineFunctionStatus
The test did not complete due to a fatal error.Completion checkdatabase_test.test1823DatabaseSelectComplexTestCase->testGroupBy()
ExpandSelect tests, ordered (DatabaseSelectOrderedTestCase) [Database]1610
MessageGroupFilenameLineFunctionStatus
The test did not complete due to a fatal error.Completion checkdatabase_test.test1738DatabaseSelectOrderedTestCase->testSimpleSelectOrderedDesc()
ExpandSelect tests, subqueries (DatabaseSelectSubqueryTestCase) [Database]1210
MessageGroupFilenameLineFunctionStatus
The test did not complete due to a fatal error.Completion checkdatabase_test.test1625DatabaseSelectSubqueryTestCase->testConditionSubquerySelect()
ExpandSession tests (SessionTestCase) [Session]11210
MessageGroupFilenameLineFunctionStatus
The test did not complete due to a fatal error.Completion checksession.test136SessionTestCase->testEmptyAnonymousSession()
ExpandShortcut link functionality (ShortcutLinksTestCase) [Shortcut]4610
MessageGroupFilenameLineFunctionStatus
The test did not complete due to a fatal error.Completion checkshortcut.test150ShortcutLinksTestCase->testShortcutLinkRename()
ExpandShortcut set functionality (ShortcutSetsTestCase) [Shortcut]3210
MessageGroupFilenameLineFunctionStatus
The test did not complete due to a fatal error.Completion checkshortcut.test233ShortcutSetsTestCase->testShortcutSetAssign()
ExpandStatistics reports tests (StatisticsReportsTestCase) [Statistics]2510
MessageGroupFilenameLineFunctionStatus
The test did not complete due to a fatal error.Completion checkstatistics.test141StatisticsReportsTestCase->testTopReferrers()
ExpandStream wrappers (StreamWrapperTest) [File API]410
MessageGroupFilenameLineFunctionStatus
The test did not complete due to a fatal error.Completion checkfile.test2581StreamWrapperTest->testUriFunctions()
ExpandString translate, search and validate (LocaleTranslationFunctionalTest) [Locale]13310
MessageGroupFilenameLineFunctionStatus
The test did not complete due to a fatal error.Completion checklocale.test361LocaleTranslationFunctionalTest->testStringValidation()
ExpandTableselect form element type test (FormsElementsTableSelectFunctionalTest) [Form API]1410
MessageGroupFilenameLineFunctionStatus
The test did not complete due to a fatal error.Completion checkform.test612FormsElementsTableSelectFunctionalTest->testEmptyText()
ExpandTaxonomy term functions and forms. (TaxonomyTermTestCase) [Taxonomy]4610
MessageGroupFilenameLineFunctionStatus
The test did not complete due to a fatal error.Completion checktaxonomy.test479TaxonomyTermTestCase->testNodeTermCreationAndDeletion()
ExpandTaxonomy upgrade path (UpgradePathTaxonomyTestCase) [Upgrade path]201
MessageGroupFilenameLineFunctionStatus
PDOException: SQLSTATE[42S02]: Base table or view not found: 1146 Table 'drupaltestbotmysql.simpletest631135cache_bootstrap' doesn't exist: DELETE FROM {cache_bootstrap} WHERE (cid = :db_condition_placeholder_0) ; Array ( [:db_condition_placeholder_0] => variables ) in cache_clear_all() (line 170 of /var/lib/drupaltestbot/sites/default/files/checkout/includes/cache.inc).Uncaught exceptiondatabase.inc1967PDOStatement->execute()
ExpandTaxonomy vocabularies (TaxonomyVocabularyUnitTest) [Taxonomy]2210
MessageGroupFilenameLineFunctionStatus
The test did not complete due to a fatal error.Completion checktaxonomy.test259TaxonomyVocabularyUnitTest->testTaxonomyVocabularyLoadStaticReset()
ExpandTaxonomy vocabulary interface (TaxonomyVocabularyFunctionalTest) [Taxonomy]6110
MessageGroupFilenameLineFunctionStatus
The test did not complete due to a fatal error.Completion checktaxonomy.test134TaxonomyVocabularyFunctionalTest->testTaxonomyAdminNoVocabularies()
ExpandTest statistics admin. (StatisticsAdminTestCase) [Statistics]4210
MessageGroupFilenameLineFunctionStatus
The test did not complete due to a fatal error.Completion checkstatistics.test329StatisticsAdminTestCase->testDeleteUser()
ExpandText field (TextFieldTestCase) [Field types]4410
MessageGroupFilenameLineFunctionStatus
The test did not complete due to a fatal error.Completion checktext.test132TextFieldTestCase->testTextfieldWidgetsFormatted()
ExpandText summary (TextSummaryTestCase) [Field types]210
MessageGroupFilenameLineFunctionStatus
The test did not complete due to a fatal error.Completion checktext.test270TextSummaryTestCase->testLength()
ExpandTheme API (ThemeUnitTest) [Theme]710
MessageGroupFilenameLineFunctionStatus
The test did not complete due to a fatal error.Completion checktheme.test59ThemeUnitTest->testFrontPageThemeSuggestion()
ExpandTheme Table (ThemeTableUnitTest) [Theme]410
MessageGroupFilenameLineFunctionStatus
The test did not complete due to a fatal error.Completion checktheme.test147ThemeTableUnitTest->testThemeTableWithEmptyMessage()
ExpandToken replacement (TokenReplaceTestCase) [System]2010
MessageGroupFilenameLineFunctionStatus
The test did not complete due to a fatal error.Completion checksystem.test1573TokenReplaceTestCase->testSystemDateTokenReplacement()
ExpandTracker (TrackerTest) [Tracker]5810
MessageGroupFilenameLineFunctionStatus
The test did not complete due to a fatal error.Completion checktracker.test98TrackerTest->testTrackerNewNodes()
ExpandTransaction tests (DatabaseTransactionTestCase) [Database]1910
MessageGroupFilenameLineFunctionStatus
The test did not complete due to a fatal error.Completion checkdatabase_test.test3203DatabaseTransactionTestCase->testCommittedTransaction()
ExpandTranslation import (LocaleImportFunctionalTest) [Locale]7710
MessageGroupFilenameLineFunctionStatus
The test did not complete due to a fatal error.Completion checklocale.test742LocaleImportFunctionalTest->testLanguageContext()
ExpandTrigger other actions (TriggerOtherTestCase) [Trigger]9910
MessageGroupFilenameLineFunctionStatus
The test did not complete due to a fatal error.Completion checktrigger.test646TriggerOtherTestCase->testActionsTaxonomy()
ExpandUnicode handling (UnicodeUnitTest) [System]15510
MessageGroupFilenameLineFunctionStatus
The test did not complete due to a fatal error.Completion checkunicode.test192UnicodeUnitTest->testDecodeEntities()
ExpandUnmanaged file copying (FileUnmanagedCopyTest) [File API]1510
MessageGroupFilenameLineFunctionStatus
The test did not complete due to a fatal error.Completion checkfile.test1360FileUnmanagedCopyTest->testOverwriteSelf()
ExpandUnmanaged file delete (FileUnmanagedDeleteTest) [File API]510
MessageGroupFilenameLineFunctionStatus
The test did not complete due to a fatal error.Completion checkfile.test1143FileUnmanagedDeleteTest->testDirectory()
ExpandUnmanaged file moving (FileUnmanagedMoveTest) [File API]1510
MessageGroupFilenameLineFunctionStatus
The test did not complete due to a fatal error.Completion checkfile.test1286FileUnmanagedMoveTest->testOverwriteSelf()
ExpandUnmanaged recursive file delete (FileUnmanagedDeleteRecursiveTest) [File API]510
MessageGroupFilenameLineFunctionStatus
The test did not complete due to a fatal error.Completion checkfile.test1194FileUnmanagedDeleteRecursiveTest->testDirectory()
ExpandUpdate contrib functionality (UpdateTestContribCase) [Update]4410
MessageGroupFilenameLineFunctionStatus
The test did not complete due to a fatal error.Completion checkupdate.test282UpdateTestContribCase->testUpdateContribOrder()
ExpandUpdate core functionality (UpdateCoreTestCase) [Update]4310
MessageGroupFilenameLineFunctionStatus
The test did not complete due to a fatal error.Completion checkupdate.test100UpdateCoreTestCase->testSecurityUpdateAvailable()
ExpandUpdate tests (DatabaseUpdateTestCase) [Database]1410
MessageGroupFilenameLineFunctionStatus
The test did not complete due to a fatal error.Completion checkdatabase_test.test739DatabaseUpdateTestCase->testMultiGTUpdate()
ExpandUpdate tests, Complex (DatabaseUpdateComplexTestCase) [Database]1410
MessageGroupFilenameLineFunctionStatus
The test did not complete due to a fatal error.Completion checkdatabase_test.test828DatabaseUpdateComplexTestCase->testNotInConditionUpdate()
ExpandUpload upgrade path (UploadUpgradePathTestCase) [Upgrade path]201
MessageGroupFilenameLineFunctionStatus
PDOException: SQLSTATE[42S02]: Base table or view not found: 1146 Table 'drupaltestbotmysql.simpletest163665cache_bootstrap' doesn't exist: DELETE FROM {cache_bootstrap} WHERE (cid = :db_condition_placeholder_0) ; Array ( [:db_condition_placeholder_0] => variables ) in cache_clear_all() (line 170 of /var/lib/drupaltestbot/sites/default/files/checkout/includes/cache.inc).Uncaught exceptiondatabase.inc1967PDOStatement->execute()
ExpandUpload user picture (UserPictureTestCase) [User]3010
MessageGroupFilenameLineFunctionStatus
The test did not complete due to a fatal error.Completion checkuser.test789UserPictureTestCase->testWithGDinvalidSize()
ExpandURL generation tests (CommonURLUnitTest) [System]210
MessageGroupFilenameLineFunctionStatus
The test did not complete due to a fatal error.Completion checkcommon.test100CommonURLUnitTest->testLCustomClass()
ExpandUser registration (UserRegistrationTestCase) [User]6510
MessageGroupFilenameLineFunctionStatus
The test did not complete due to a fatal error.Completion checkuser.test103UserRegistrationTestCase->testRegistrationDefaultValues()

All

Test namePassFailException
Leaf403 functionality (AccessDeniedTestCase) [System]7500
Leaf404 functionality (PageNotFoundTestCase) [System]1800
LeafActions configuration (ActionsConfigurationTestCase) [Actions]3800
LeafActions executing in a potentially infinite loop (ActionLoopTestCase) [Actions]2900
LeafAdd feed functionality (AddFeedTestCase) [Aggregator]2800
LeafAdmin theme block admin accessibility (BlockAdminThemeTestCase) [Block]1800
LeafAdministrative pages (SystemAdminTestCase) [System]19100
LeafAdvanced search form (SearchAdvancedSearchForm) [Search]3100
LeafAJAX command form values (AJAXFormValuesTestCase) [AJAX]2800
LeafAJAX commands (AJAXCommandsTestCase) [AJAX]6300
LeafAJAX framework (AJAXFrameworkTestCase) [AJAX]800
LeafAJAX multi form (AJAXMultiFormTestCase) [AJAX]3500
LeafAnonymous comments (CommentAnonymous) [Comment]15600
LeafAutocompletion (ProfileTestAutocomplete) [Profile]5400
ExpandBasic SQL syntax tests (DatabaseBasicSyntaxTestCase) [Database]1210
MessageGroupFilenameLineFunctionStatus
The test did not complete due to a fatal error.Completion checkdatabase_test.test2871DatabaseBasicSyntaxTestCase->testLikeEscape()
ExpandBasic upgrade path (BasicUpgradePath) [Upgrade path]402
MessageGroupFilenameLineFunctionStatus
PDOException: SQLSTATE[42S02]: Base table or view not found: 1146 Table 'drupaltestbotmysql.simpletest6646cache_bootstrap' doesn't exist: DELETE FROM {cache_bootstrap} WHERE (cid = :db_condition_placeholder_0) ; Array ( [:db_condition_placeholder_0] => variables ) in cache_clear_all() (line 170 of /var/lib/drupaltestbot/sites/default/files/checkout/includes/cache.inc).Uncaught exceptiondatabase.inc1967PDOStatement->execute()
PDOException: SQLSTATE[42S02]: Base table or view not found: 1146 Table 'drupaltestbotmysql.simpletest445616cache_bootstrap' doesn't exist: DELETE FROM {cache_bootstrap} WHERE (cid = :db_condition_placeholder_0) ; Array ( [:db_condition_placeholder_0] => variables ) in cache_clear_all() (line 170 of /var/lib/drupaltestbot/sites/default/files/checkout/includes/cache.inc).Uncaught exceptiondatabase.inc1967PDOStatement->execute()
LeafBatch percentages (BatchPercentagesUnitTestCase) [Batch API]1300
ExpandBatch processing (BatchProcessingTestCase) [Batch API]8110
MessageGroupFilenameLineFunctionStatus
The test did not complete due to a fatal error.Completion checkbatch.test78BatchProcessingTestCase->testBatchFormMultistep()
LeafBatch progress page (BatchPageTestCase) [Batch API]700
LeafBlock availability (BookBlockTestCase) [Book]1800
LeafBlock availability (NodeBlockTestCase) [Node]1800
LeafBlock availability (PollBlockTestCase) [Poll]10000
LeafBlock availability (ProfileBlockTestCase) [Profile]9000
LeafBlock availability (SearchBlockTestCase) [Search]5100
ExpandBlock caching (BlockCacheTestCase) [Block]11410
MessageGroupFilenameLineFunctionStatus
The test did not complete due to a fatal error.Completion checkblock.test495BlockCacheTestCase->testNoCache()
ExpandBlock functionality (BlockTestCase) [Block]13610
MessageGroupFilenameLineFunctionStatus
The test did not complete due to a fatal error.Completion checkblock.test147BlockTestCase->testBlockVisibility()
LeafBlock functionality (SystemBlockTestCase) [System]3400
LeafBlock HTML id (BlockHTMLIdTestCase) [Block]1500
ExpandBlog functionality (BlogTestCase) [Blog]3810
MessageGroupFilenameLineFunctionStatus
The test did not complete due to a fatal error.Completion checkblog.test60BlogTestCase->testBlog()
LeafBook functionality (BookTestCase) [Book]26000
LeafBoot and exit hook invocation (HookBootExitTestCase) [Bootstrap]1800
LeafBreadcrumbs (MenuBreadcrumbTestCase) [Menu]36100
ExpandCache clear test (CacheClearCase) [Cache]810
MessageGroupFilenameLineFunctionStatus
The test did not complete due to a fatal error.Completion checkcache.test281CacheClearCase->testClearArray()
LeafCache emptiness test (CacheIsEmptyCase) [Cache]500
ExpandCache saving test (CacheSavingCase) [Cache]210
MessageGroupFilenameLineFunctionStatus
The test did not complete due to a fatal error.Completion checkcache.test130CacheSavingCase->testDouble()
ExpandCancel account (UserCancelTestCase) [User]2910
MessageGroupFilenameLineFunctionStatus
The test did not complete due to a fatal error.Completion checkuser.test398UserCancelTestCase->testUserCancelInvalid()
ExpandCascading stylesheets (CascadingStylesheetsTestCase) [System]510
MessageGroupFilenameLineFunctionStatus
The test did not complete due to a fatal error.Completion checkcommon.test607CascadingStylesheetsTestCase->testAddFile()
LeafCategorize feed functionality (CategorizeFeedTestCase) [Aggregator]1900
LeafCategorize feed item functionality (CategorizeFeedItemTestCase) [Aggregator]5300
LeafChecks display of aggregator items (AggregatorRenderingTestCase) [Aggregator]6800
LeafCJK tokenizer (SearchTokenizerTestCase) [Search]200
LeafColor functionality (ColorTestCase) [Color]6100
LeafComment approval (CommentApprovalTest) [Comment]15400
LeafComment blocks (CommentBlockFunctionalTest) [Comment]11500
LeafComment count toggle (SearchCommentCountToggleTestCase) [Search]3000
LeafComment interface (CommentInterfaceTest) [Comment]22300
ExpandComment paging settings (CommentPagerTest) [Comment]14310
MessageGroupFilenameLineFunctionStatus
The test did not complete due to a fatal error.Completion checkcomment.test799CommentPagerTest->testCommentNewPageIndicator()
LeafComment preview (CommentPreviewTest) [Comment]7200
LeafComment Rebuild (CommentContentRebuild) [Comment]3200
LeafComment RSS (CommentRSSUnitTest) [Comment]2400
LeafComment Search tests (SearchCommentTestCase) [Search]13900
LeafComment token replacement (CommentTokenReplaceTestCase) [Comment]6400
ExpandComment upgrade path (CommentUpgradePathTestCase) [Upgrade path]201
MessageGroupFilenameLineFunctionStatus
PDOException: SQLSTATE[42S02]: Base table or view not found: 1146 Table 'drupaltestbotmysql.simpletest882315cache_bootstrap' doesn't exist: DELETE FROM {cache_bootstrap} WHERE (cid = :db_condition_placeholder_0) ; Array ( [:db_condition_placeholder_0] => variables ) in cache_clear_all() (line 170 of /var/lib/drupaltestbot/sites/default/files/checkout/includes/cache.inc).Uncaught exceptiondatabase.inc1967PDOStatement->execute()
LeafConfig settings form (SearchConfigSettingsForm) [Search]11600
ExpandConnection tests (DatabaseConnectionTestCase) [Database]1910
MessageGroupFilenameLineFunctionStatus
The test did not complete due to a fatal error.Completion checkdatabase_test.test237DatabaseConnectionTestCase->testConnectionClosing()
LeafContent language settings (LocaleContentFunctionalTest) [Locale]6400
ExpandCron run (CronRunTestCase) [System]3610
MessageGroupFilenameLineFunctionStatus
The test did not complete due to a fatal error.Completion checksystem.test574CronRunTestCase->testTempFileCleanup()
LeafCSS Unit Tests (CascadingStylesheetsUnitTest) [System]600
LeafCustom query syntax tests (DatabaseQueryTestCase) [Database]600
LeafDashboard blocks (DashboardBlocksTestCase) [Dashboard]5000
LeafData API functions (DrupalDataApiTest) [System]3200
ExpandDate and time (DateTimeFunctionalTest) [System]5210
MessageGroupFilenameLineFunctionStatus
The test did not complete due to a fatal error.Completion checksystem.test946DateTimeFunctionalTest->testDateFormatConfiguration()
ExpandDBLog functionality (DBLogTestCase) [DBLog]38210
MessageGroupFilenameLineFunctionStatus
The test did not complete due to a fatal error.Completion checkdblog.test407DBLogTestCase->testFilter()
LeafDefault text format functionality (FilterDefaultFormatTestCase) [Filter]3300
ExpandDelete/Truncate tests (DatabaseDeleteTruncateTestCase) [Database]1410
MessageGroupFilenameLineFunctionStatus
The test did not complete due to a fatal error.Completion checkdatabase_test.test1022DatabaseDeleteTruncateTestCase->testTruncate()
LeafDrupal error handlers (DrupalErrorHandlerUnitTest) [System]2800
ExpandDrupal goto (DrupalGotoTest) [System]1410
MessageGroupFilenameLineFunctionStatus
The test did not complete due to a fatal error.Completion checkcommon.test1098DrupalGotoTest->testDrupalGetDestination()
ExpandDrupal HTTP request (DrupalHTTPRequestTestCase) [System]1510
MessageGroupFilenameLineFunctionStatus
The test did not complete due to a fatal error.Completion checkcommon.test964DrupalHTTPRequestTestCase->testDrupalHTTPRequestRedirect()
LeafDrupal match path (DrupalMatchPathTestCase) [Path API]4100
LeafDrupal set/get regions (DrupalSetContentTestCase) [System]3800
LeafDrupal tags handling (DrupalTagsHandlingTestCase) [System]800
Leafdrupal_alter() tests (DrupalAlterTestCase) [System]500
Expanddrupal_render() (DrupalRenderTestCase) [System]710
MessageGroupFilenameLineFunctionStatus
The test did not complete due to a fatal error.Completion checkcommon.test1481DrupalRenderTestCase->testDrupalRenderFormElements()
LeafEmbedded forms (SearchEmbedForm) [Search]2900
ExpandEmpty statement (DatabaseEmptyStatementTestCase) [Database]310
MessageGroupFilenameLineFunctionStatus
The test did not complete due to a fatal error.Completion checkdatabase_test.test3287DatabaseEmptyStatementTestCase->testEmptyFetchAll()
LeafEnable/disable modules (EnableDisableTestCase) [Module]5800
LeafEntity properties (EntityPropertiesTestCase) [Entity API]300
LeafEntity query (EntityFieldQueryTestCase) [Entity API]8300
LeafFeed parser functionality (FeedParserTestCase) [Aggregator]4000
ExpandFetch tests (DatabaseFetchTestCase) [Database]1710
MessageGroupFilenameLineFunctionStatus
The test did not complete due to a fatal error.Completion checkdatabase_test.test334DatabaseFetchTestCase->testQueryFetchArray()
ExpandFetch tests, part 2 (DatabaseFetch2TestCase) [Database]1710
MessageGroupFilenameLineFunctionStatus
The test did not complete due to a fatal error.Completion checkdatabase_test.test419DatabaseFetch2TestCase->testQueryFetchCol()
LeafFetching multiple cache items (CacheGetMultipleUnitTest) [Cache]700
ExpandField attach tests (other) (FieldAttachOtherTestCase) [Field API]2910
MessageGroupFilenameLineFunctionStatus
The test did not complete due to a fatal error.Completion checkfield.test860FieldAttachOtherTestCase->testFieldAttachValidate()
ExpandField attach tests (storage-related) (FieldAttachStorageTestCase) [Field API]4810
MessageGroupFilenameLineFunctionStatus
The test did not complete due to a fatal error.Completion checkfield.test271FieldAttachStorageTestCase->testFieldAttachSaveLoadDifferentStorage()
ExpandField bulk delete tests (FieldBulkDeleteTestCase) [Field API]3610
MessageGroupFilenameLineFunctionStatus
The test did not complete due to a fatal error.Completion checkfield.test2957FieldBulkDeleteTestCase->testPurgeField()
ExpandField CRUD tests (FieldCrudTestCase) [Field API]1610
MessageGroupFilenameLineFunctionStatus
The test did not complete due to a fatal error.Completion checkfield.test1914FieldCrudTestCase->testReadField()
LeafField Display API tests (FieldDisplayAPITestCase) [Field API]4200
ExpandField form tests (FieldFormTestCase) [Field API]5510
MessageGroupFilenameLineFunctionStatus
The test did not complete due to a fatal error.Completion checkfield.test1330FieldFormTestCase->testFieldFormUnlimited()
ExpandField info tests (FieldInfoTestCase) [Field API]6210
MessageGroupFilenameLineFunctionStatus
The test did not complete due to a fatal error.Completion checkfield.test1105FieldInfoTestCase->testInstancePrepare()
ExpandField instance CRUD tests (FieldInstanceCrudTestCase) [Field API]1410
MessageGroupFilenameLineFunctionStatus
The test did not complete due to a fatal error.Completion checkfield.test2337FieldInstanceCrudTestCase->testUpdateFieldInstance()
ExpandField SQL storage tests (FieldSqlStorageTestCase) [Field API]3310
MessageGroupFilenameLineFunctionStatus
The test did not complete due to a fatal error.Completion checkfield_sql_storage.test126FieldSqlStorageTestCase->testFieldAttachInsertAndUpdate()
ExpandField translations tests (FieldTranslationsTestCase) [Field API]910
MessageGroupFilenameLineFunctionStatus
The test did not complete due to a fatal error.Completion checkfield.test2540FieldTranslationsTestCase->testFieldInvokeMultiple()
ExpandField UI tests (FieldUITestCase) [Field UI]8610
MessageGroupFilenameLineFunctionStatus
The test did not complete due to a fatal error.Completion checkfield_ui.test223FieldUITestCase->testDeleteField()
ExpandFile copying (FileCopyTest) [File API]4910
MessageGroupFilenameLineFunctionStatus
The test did not complete due to a fatal error.Completion checkfile.test1692FileCopyTest->testExistingReplace()
LeafFile delete (FileDeleteTest) [File API]1800
ExpandFile download (FileDownloadTest) [File API]1710
MessageGroupFilenameLineFunctionStatus
The test did not complete due to a fatal error.Completion checkfile.test2246FileDownloadTest->testFileCreateUrl()
LeafFile field display tests (FileFieldDisplayTestCase) [File]2000
LeafFile field file path tests (FileFieldPathTestCase) [File]2300
LeafFile field revision test (FileFieldRevisionTestCase) [File]6700
ExpandFile field validation tests (FileFieldValidateTestCase) [File]7810
MessageGroupFilenameLineFunctionStatus
The test did not complete due to a fatal error.Completion checkfile.test663FileFieldValidateTestCase->testFileExtension()
LeafFile field widget test (FileFieldWidgetTestCase) [File]12300
ExpandFile loading (FileLoadTest) [File API]610
MessageGroupFilenameLineFunctionStatus
The test did not complete due to a fatal error.Completion checkfile.test1786FileLoadTest->testLoadInvalidStatus()
LeafFile mimetypes (FileMimeTypeTest) [File API]3800
ExpandFile moving (FileMoveTest) [File API]4510
MessageGroupFilenameLineFunctionStatus
The test did not complete due to a fatal error.Completion checkfile.test1527FileMoveTest->testExistingReplace()
ExpandFile naming (FileNameMungingTest) [File API]310
MessageGroupFilenameLineFunctionStatus
The test did not complete due to a fatal error.Completion checkfile.test2432FileNameMungingTest->testMungeIgnoreWhitelisted()
ExpandFile paths and directories (FileDirectoryTest) [File API]1210
MessageGroupFilenameLineFunctionStatus
The test did not complete due to a fatal error.Completion checkfile.test957FileDirectoryTest->testFileDestination()
ExpandFile save data (FileSaveDataTest) [File API]3010
MessageGroupFilenameLineFunctionStatus
The test did not complete due to a fatal error.Completion checkfile.test2105FileSaveDataTest->testExistingRename()
LeafFile saving (FileSaveTest) [File API]1400
ExpandFile scan directory (FileScanDirectoryTest) [File API]1310
MessageGroupFilenameLineFunctionStatus
The test did not complete due to a fatal error.Completion checkfile.test1043FileScanDirectoryTest->testOptionNoMask()
LeafFile space used tests (FileSpaceUsedTest) [File API]1100
LeafFile token replacement (FileTokenReplaceTestCase) [File]3500
ExpandFile uploading (FileSaveUploadTest) [File API]8610
MessageGroupFilenameLineFunctionStatus
The test did not complete due to a fatal error.Completion checkfile.test721FileSaveUploadTest->testHandleDangerousFile()
LeafFile URL rewriting (FileURLRewritingTest) [File]1500
ExpandFile usage (FileUsageTest) [File]1610
MessageGroupFilenameLineFunctionStatus
The test did not complete due to a fatal error.Completion checkfile.test1966FileUsageTest->testRemoveUsage()
LeafFile validate (FileValidateTest) [File API]1100
ExpandFile validator tests (FileValidatorTest) [File API]610
MessageGroupFilenameLineFunctionStatus
The test did not complete due to a fatal error.Completion checkfile.test411FileValidatorTest->testFileValidateImageResolution()
LeafFileTransfer unit tests (FileTranferTest) [System]200
LeafFilter administration functionality (FilterAdminTestCase) [Filter]14500
LeafFilter CRUD operations (FilterCRUDTestCase) [Filter]21400
ExpandFilter format access (FilterFormatAccessTestCase) [Filter]8010
MessageGroupFilenameLineFunctionStatus
The test did not complete due to a fatal error.Completion checkfilter.test509FilterFormatAccessTestCase->testFormatWidgetPermissions()
LeafFilter format hooks (FilterHooksTestCase) [Filter]3200
LeafFilter module filters (FilterUnitTestCase) [Filter]20200
LeafFingerprinting meta tag (AdminMetaTagTestCase) [System]300
LeafFlood control mechanism (FloodFunctionalTest) [System]600
LeafForm alter hooks (FormAlterTestCase) [Form API]300
LeafForm API file inclusion (FormsFileInclusionTestCase) [Form API]900
LeafForm element and label output test (FormsElementsLabelsTestCase) [Form API]1500
ExpandForm element validation (FormsTestCase) [Form API]16610
MessageGroupFilenameLineFunctionStatus
The test did not complete due to a fatal error.Completion checkform.test158FormsTestCase->testSelect()
LeafForm rebuilding (FormsRebuildTestCase) [Form API]5000
LeafForm state values clearance (FormStateValuesCleanTestCase) [Form API]1300
LeafForm triggering element determination (FormsTriggeringElementTestCase) [Form API]4800
LeafForm validation handlers (FormValidationTestCase) [Form API]3500
LeafForm wrapper callback (FormsFormWrapperTestCase) [Form API]400
LeafFormat date (FormatDateUnitTest) [System]4300
LeafForum functionality (ForumTestCase) [Forum]60800
LeafFront page (FrontPageTestCase) [System]3600
LeafGet filename test (BootstrapGetFilenameTestCase) [Bootstrap]400
LeafGraph (GraphUnitTest) [System]2800
LeafHelp functionality (HelpTestCase) [Help]30800
LeafHTML Attributes (DrupalAttributesUnitTest) [System]600
LeafHTML identifiers (DrupalHTMLIdentifierTestCase) [System]1000
LeafHTML in page titles (PageTitleFiltering) [System]4000
LeafHTTP file retrieval (RetrieveFileTestCase) [System]700
ExpandImage effects (ImageEffectsUnitTest) [Image]1010
MessageGroupFilenameLineFunctionStatus
The test did not complete due to a fatal error.Completion checkimage.test248ImageEffectsUnitTest->testCropEffect()
ExpandImage field display tests (ImageFieldDisplayTestCase) [Image]7610
MessageGroupFilenameLineFunctionStatus
The test did not complete due to a fatal error.Completion checkimage.test714ImageFieldDisplayTestCase->testImageFieldSettings()
LeafImage field validation tests (ImageFieldValidateTestCase) [Image]1800
LeafImage GD manipulation tests (ImageToolkitGdTestCase) [Image]100
ExpandImage styles and effects UI configuration (ImageAdminStylesUnitTest) [Image]13610
MessageGroupFilenameLineFunctionStatus
The test did not complete due to a fatal error.Completion checkimage.test565ImageAdminStylesUnitTest->testStyleReplacement()
ExpandImage styles path and URL functions (ImageStylesPathAndUrlUnitTest) [Image]1110
MessageGroupFilenameLineFunctionStatus
The test did not complete due to a fatal error.Completion checkimage.test154ImageStylesPathAndUrlUnitTest->testImageStyleUrlAndPathPrivate()
ExpandImage toolkit tests (ImageToolkitUnitTest) [Image]810
MessageGroupFilenameLineFunctionStatus
The test did not complete due to a fatal error.Completion checkimage.test106ImageToolkitUnitTest->testSave()
LeafImport feeds from OPML functionality (ImportOPMLTestCase) [Aggregator]5300
LeafInfo file format parser (InfoFileParserTestCase) [System]900
ExpandInsert tests (DatabaseInsertTestCase) [Database]1610
MessageGroupFilenameLineFunctionStatus
The test did not complete due to a fatal error.Completion checkdatabase_test.test501DatabaseInsertTestCase->testRepeatedInsert()
ExpandInsert tests, default fields (DatabaseInsertDefaultsTestCase) [Database]1310
MessageGroupFilenameLineFunctionStatus
The test did not complete due to a fatal error.Completion checkdatabase_test.test682DatabaseInsertDefaultsTestCase->testDefaultInsertWithFields()
LeafInsert tests, LOB fields (DatabaseInsertLOBTestCase) [Database]1300
LeafInvalid data (DatabaseInvalidDataTestCase) [Database]700
LeafIP address and HTTP_HOST test (BootstrapIPAddressTestCase) [Bootstrap]1100
LeafIP address blocking (IPAddressBlockingTestCase) [System]4200
ExpandJavaScript (JavaScriptTestCase) [System]510
MessageGroupFilenameLineFunctionStatus
The test did not complete due to a fatal error.Completion checkcommon.test1169JavaScriptTestCase->testAddSetting()
LeafJSON (DrupalJSONTest) [System]1400
LeafKeywords and conditions (SearchKeywordsConditions) [Search]2500
LeafLanguage configuration (LocaleConfigurationTest) [Locale]7800
LeafLanguage switching (LocaleLanguageSwitchingFunctionalTest) [Locale]2100
LeafList field (ListFieldTestCase) [Field types]1400
LeafList field UI (ListFieldUITestCase) [Field types]2400
LeafLoad multiple nodes (NodeLoadMultipleUnitTest) [Node]3600
LeafLocale uninstall (EN) (LocaleUninstallFunctionalTest) [Locale]3100
LeafLocale uninstall (FR) (LocaleUninstallFrenchFunctionalTest) [Locale]3100
LeafLocalize date formats (LocaleDateFormatsFunctionalTest) [Locale]3500
LeafLocking framework tests (LockFunctionalTest) [System]1700
LeafMail system (MailTestCase) [System]100
LeafMain content rendering fallback (SystemMainContentFallback) [System]6600
LeafMenu link creation/deletion (MenuTestCase) [Menu]87500
LeafMenu rebuild test (MenuRebuildTestCase) [Menu]500
ExpandMenu router (MenuRouterTestCase) [Menu]810
MessageGroupFilenameLineFunctionStatus
The test did not complete due to a fatal error.Completion checkmenu.test49MenuRouterTestCase->testThemeCallbackInheritance()
LeafMenu settings for nodes (MenuNodeTestCase) [Menu]4700
LeafMenu tree generation (MenuTreeDataTestCase) [Menu]400
ExpandMerge tests (DatabaseMergeTestCase) [Database]2010
MessageGroupFilenameLineFunctionStatus
The test did not complete due to a fatal error.Completion checkdatabase_test.test1098DatabaseMergeTestCase->testMergeUpdateExcept()
LeafMiscellaneous AJAX tests (AJAXElementValidation) [AJAX]800
LeafMissing update dependencies (UpdateDependencyMissingTestCase) [Update API]300
ExpandModule API (ModuleUnitTest) [Module]3710
MessageGroupFilenameLineFunctionStatus
The test did not complete due to a fatal error.Completion checkmodule.test117ModuleUnitTest->testDependencyResolution()
ExpandModule dependencies (ModuleDependencyTestCase) [Module]6420
MessageGroupFilenameLineFunctionStatus
The test did not complete due to a fatal error.Completion checksystem.test268ModuleDependencyTestCase->testEnableRequirementsFailureDependency()
The test did not complete due to a fatal error.Completion checksystem.test268ModuleDependencyTestCase->testEnableRequirementsFailureDependency()
LeafModule installation (ModuleInstallTestCase) [Module]200
LeafModule uninstallation (ModuleUninstallTestCase) [Module]200
LeafModule versions (ModuleVersionTestCase) [Module]8200
LeafMultilingual fields (LocaleMultilingualFieldsFunctionalTest) [Locale]5200
ExpandMultistep form using form storage (FormsFormStorageTestCase) [Form API]4510
MessageGroupFilenameLineFunctionStatus
The test did not complete due to a fatal error.Completion checkform.test836FormsFormStorageTestCase->testValidation()
LeafMultistep node form basic options (MultiStepNodeFormBasicOptionsTest) [Node]2300
LeafNew default theme blocks (NewDefaultThemeBlocks) [Block]2400
LeafNo help (NoHelpTestCase) [Help]1100
LeafNode access (NodeAccessUnitTest) [Node]3100
LeafNode access rebuild (NodeAccessRebuildTestCase) [Node]1600
LeafNode access records (NodeAccessRecordsUnitTest) [Node]2300
LeafNode administration (NodeAdminTestCase) [Node]11900
LeafNode blocks (NodeBlockFunctionalTest) [Node]8300
ExpandNode body upgrade path (NodeBodyUpgradePathTestCase) [Upgrade path]201
MessageGroupFilenameLineFunctionStatus
PDOException: SQLSTATE[42S02]: Base table or view not found: 1146 Table 'drupaltestbotmysql.simpletest741830cache_bootstrap' doesn't exist: DELETE FROM {cache_bootstrap} WHERE (cid = :db_condition_placeholder_0) ; Array ( [:db_condition_placeholder_0] => variables ) in cache_clear_all() (line 170 of /var/lib/drupaltestbot/sites/default/files/checkout/includes/cache.inc).Uncaught exceptiondatabase.inc1967PDOStatement->execute()
LeafNode creation (NodeCreationTestCase) [Node]2500
LeafNode edit (PageEditTestCase) [Node]9300
LeafNode edit permissions (PageViewTestCase) [Node]3200
LeafNode entity query alter (NodeEntityFieldQueryAlter) [Node]3000
LeafNode feed (NodeFeedTestCase) [Node]100
LeafNode post information display (NodePostSettingsTestCase) [Node]3400
LeafNode preview (PagePreviewTestCase) [Node]3500
ExpandNode query alter (NodeQueryAlter) [Node]3710
MessageGroupFilenameLineFunctionStatus
The test did not complete due to a fatal error.Completion checknode.test1663NodeQueryAlter->testNodeQueryAlterLowLevelNoAccess()
LeafNode revisions (NodeRevisionsTestCase) [Node]4400
LeafNode RSS Content (NodeRSSContentTestCase) [Node]1600
LeafNode save (NodeSaveTestCase) [Node]2800
LeafNode title (NodeTitleTestCase) [Node]2000
LeafNode title XSS filtering (NodeTitleXSSTestCase) [Node]2000
LeafNode token replacement (NodeTokenReplaceTestCase) [Node]3400
ExpandNode types (NodeTypeTestCase) [Node]3810
MessageGroupFilenameLineFunctionStatus
The test did not complete due to a fatal error.Completion checknode.test1100NodeTypeTestCase->testNodeTypeEditing()
LeafNon default theme admin (NonDefaultBlockAdmin) [Block]1000
ExpandOpenID account registration (OpenIDRegistrationTestCase) [OpenID]6510
MessageGroupFilenameLineFunctionStatus
The test did not complete due to a fatal error.Completion checkopenid.test368OpenIDRegistrationTestCase->testRegisterUserWithInvalidSreg()
ExpandOpenID discovery and login (OpenIDFunctionalTestCase) [OpenID]11910
MessageGroupFilenameLineFunctionStatus
The test did not complete due to a fatal error.Completion checkopenid.test152OpenIDFunctionalTestCase->testLoginMaintenanceMode()
ExpandOpenID helper functions (OpenIDUnitTest) [OpenID]510
MessageGroupFilenameLineFunctionStatus
The test did not complete due to a fatal error.Completion checkopenid.test502OpenIDUnitTest->testOpenidGetBytes()
ExpandOptions widgets (OptionsWidgetsTestCase) [Field types]7110
MessageGroupFilenameLineFunctionStatus
The test did not complete due to a fatal error.Completion checkoptions.test204OptionsWidgetsTestCase->testSelectListSingle()
ExpandPage cache test (BootstrapPageCacheTestCase) [Bootstrap]6510
MessageGroupFilenameLineFunctionStatus
The test did not complete due to a fatal error.Completion checkbootstrap.test201BootstrapPageCacheTestCase->testPageCompression()
ExpandPager query tests (DatabaseSelectPagerDefaultTestCase) [Database]2210
MessageGroupFilenameLineFunctionStatus
The test did not complete due to a fatal error.Completion checkdatabase_test.test2179DatabaseSelectPagerDefaultTestCase->testInnerPagerQuery()
LeafParsing .info files (ParseInfoFilesTestCase) [System]300
ExpandPath alias functionality (PathTestCase) [Path]6110
MessageGroupFilenameLineFunctionStatus
The test did not complete due to a fatal error.Completion checkpath.test113PathTestCase->testNodeAlias()
ExpandPath aliases with languages (PathLanguageUITestCase) [Path]4610
MessageGroupFilenameLineFunctionStatus
The test did not complete due to a fatal error.Completion checkpath.test430PathLanguageUITestCase->testNonDefaultURLs()
LeafPath aliases with translated nodes (PathLanguageTestCase) [Path]6300
LeafPath language settings (LocalePathFunctionalTest) [Locale]3600
LeafPaths on non-English monolingual sites (PathMonolingualTestCase) [Path]3400
LeafPersonal contact form (ContactPersonalTestCase) [Contact]14200
LeafPHP filter access check (PHPAccessTestCase) [PHP]3700
LeafPHP filter functionality (PHPFilterTestCase) [PHP]4100
LeafPoll add choice (PollJSAddChoice) [Poll]1500
LeafPoll create (PollCreateTestCase) [Poll]12100
LeafPoll expiration (PollExpirationTestCase) [Poll]3200
LeafPoll token replacement (PollTokenReplaceTestCase) [Poll]10600
ExpandPoll upgrade path (PollUpgradePathTestCase) [Upgrade path]201
MessageGroupFilenameLineFunctionStatus
PDOException: SQLSTATE[42S02]: Base table or view not found: 1146 Table 'drupaltestbotmysql.simpletest417703cache_bootstrap' doesn't exist: DELETE FROM {cache_bootstrap} WHERE (cid = :db_condition_placeholder_0) ; Array ( [:db_condition_placeholder_0] => variables ) in cache_clear_all() (line 170 of /var/lib/drupaltestbot/sites/default/files/checkout/includes/cache.inc).Uncaught exceptiondatabase.inc1967PDOStatement->execute()
LeafPoll vote (PollVoteTestCase) [Poll]8000
LeafProfile browsing (ProfileTestBrowsing) [Profile]3200
LeafProgrammatic form submissions (FormsProgrammaticTestCase) [Form API]1800
ExpandQuery altering tests (DatabaseAlterTestCase) [Database]1810
MessageGroupFilenameLineFunctionStatus
The test did not complete due to a fatal error.Completion checkdatabase_test.test2464DatabaseAlterTestCase->testAlterChangeConditional()
ExpandQuery logging (DatabaseLoggingTestCase) [Database]1510
MessageGroupFilenameLineFunctionStatus
The test did not complete due to a fatal error.Completion checkdatabase_test.test2671DatabaseLoggingTestCase->testEnableTargetLogging()
ExpandQuery tagging tests (DatabaseTaggingTestCase) [Database]1410
MessageGroupFilenameLineFunctionStatus
The test did not complete due to a fatal error.Completion checkdatabase_test.test2367DatabaseTaggingTestCase->testHasAnyTag()
LeafQueue functionality (QueueTestCase) [System]700
LeafRange query test (DatabaseRangeQueryTestCase) [Database]200
ExpandRDF comment mapping (RdfCommentAttributesTestCase) [RDF]15210
MessageGroupFilenameLineFunctionStatus
The test did not complete due to a fatal error.Completion checkrdf.test508RdfCommentAttributesTestCase->testCommentReplyOfRdfaMarkup()
LeafRDF mapping CRUD functions (RdfCrudTestCase) [RDF]900
ExpandRDF mapping definition functionality (RdfMappingDefinitionTestCase) [RDF]910
MessageGroupFilenameLineFunctionStatus
The test did not complete due to a fatal error.Completion checkrdf.test314RdfMappingDefinitionTestCase->testAttributesInMarkup3()
LeafRDF mapping hook (RdfMappingHookTestCase) [RDF]500
LeafRDF namespaces (RdfGetRdfNamespacesTestCase) [RDF]400
LeafRDF namespaces XML serialization tests (DrupalGetRdfNamespacesTestCase) [System]600
LeafRDF tracker page mapping (RdfTrackerAttributesTestCase) [RDF]3200
LeafRDFa markup (RdfRdfaMarkupTestCase) [RDF]2100
LeafRebuild arbitrary forms (FormsArbitraryRebuildTestCase) [Form API]1400
LeafRebuild content (NodeBuildContent) [Node]100
LeafRegistry parse file test (RegistryParseFileTestCase) [System]200
LeafRegistry parse files test (RegistryParseFilesTestCase) [System]600
ExpandRegression tests (DatabaseRegressionTestCase) [Database]1310
MessageGroupFilenameLineFunctionStatus
The test did not complete due to a fatal error.Completion checkdatabase_test.test2604DatabaseRegressionTestCase->testDBFieldExists()
LeafRemove feed functionality (RemoveFeedTestCase) [Aggregator]2300
LeafRemove feed item functionality (RemoveFeedItemTestCase) [Aggregator]19600
LeafRequired modules (ModuleRequiredTestCase) [Module]2100
LeafRequirements hook failure (HookRequirementsTestCase) [Module]1500
LeafResettable static variables test (BootstrapResettableStaticTestCase) [Bootstrap]500
LeafRole assignment (UserRolesAssignmentTestCase) [User]5300
ExpandRole permissions (UserPermissionsTestCase) [User]4110
MessageGroupFilenameLineFunctionStatus
The test did not complete due to a fatal error.Completion checkuser.test1005UserPermissionsTestCase->testUserRoleChangePermissions()
LeafSchema API (SchemaTestCase) [Database]2700
LeafSearch engine phrase queries (SearchExactTestCase) [Search]2200
LeafSearch engine queries (SearchMatchTestCase) [Search]14400
LeafSearch engine ranking (SearchRankingTestCase) [Search]6000
LeafSearch excerpt extraction (SearchExcerptTestCase) [Search]500
LeafSearch expression insert/extract (SearchExpressionInsertExtractTestCase) [Search]2400
LeafSearch page override (SearchPageOverride) [Search]1200
LeafSearch page text (SearchPageText) [Search]2600
LeafSearch simplify (SearchSimplifyTestCase) [Search]33800
LeafSecurity (FilterSecurityTestCase) [Filter]2600
ExpandSelect tests (DatabaseSelectTestCase) [Database]1310
MessageGroupFilenameLineFunctionStatus
The test did not complete due to a fatal error.Completion checkdatabase_test.test1297DatabaseSelectTestCase->testSimpleSelectConditional()
ExpandSelect tests, complex (DatabaseSelectComplexTestCase) [Database]3410
MessageGroupFilenameLineFunctionStatus
The test did not complete due to a fatal error.Completion checkdatabase_test.test1823DatabaseSelectComplexTestCase->testGroupBy()
LeafSelect tests, complex 2 (DatabaseSelectComplexTestCase2) [Database]1400
ExpandSelect tests, ordered (DatabaseSelectOrderedTestCase) [Database]1610
MessageGroupFilenameLineFunctionStatus
The test did not complete due to a fatal error.Completion checkdatabase_test.test1738DatabaseSelectOrderedTestCase->testSimpleSelectOrderedDesc()
ExpandSelect tests, subqueries (DatabaseSelectSubqueryTestCase) [Database]1210
MessageGroupFilenameLineFunctionStatus
The test did not complete due to a fatal error.Completion checkdatabase_test.test1625DatabaseSelectSubqueryTestCase->testConditionSubquerySelect()
LeafSequences API (DatabaseNextIdCase) [Database]200
LeafSession https handling (SessionHttpsTestCase) [Session]6800
ExpandSession tests (SessionTestCase) [Session]11210
MessageGroupFilenameLineFunctionStatus
The test did not complete due to a fatal error.Completion checksession.test136SessionTestCase->testEmptyAnonymousSession()
ExpandShortcut link functionality (ShortcutLinksTestCase) [Shortcut]4610
MessageGroupFilenameLineFunctionStatus
The test did not complete due to a fatal error.Completion checkshortcut.test150ShortcutLinksTestCase->testShortcutLinkRename()
ExpandShortcut set functionality (ShortcutSetsTestCase) [Shortcut]3210
MessageGroupFilenameLineFunctionStatus
The test did not complete due to a fatal error.Completion checkshortcut.test233ShortcutSetsTestCase->testShortcutSetAssign()
LeafShutdown functions (ShutdownFunctionsTest) [System]400
LeafSimpleTest browser (SimpleTestBrowserTestCase) [SimpleTest]1600
LeafSimpleTest e-mail capturing (SimpleTestMailCaptureTestCase) [SimpleTest]1300
LeafSimpleTest error collector (DrupalErrorCollectionUnitTest) [SimpleTest]1500
LeafSimpleTest functionality (SimpleTestFunctionalTest) [SimpleTest]9100
LeafSite maintenance mode functionality (SiteMaintenanceTestCase) [System]8000
LeafSite-wide contact form (ContactSitewideTestCase) [Contact]23700
LeafSize parsing test (CommonSizeTestCase) [System]3500
LeafStatistics logging tests (StatisticsLoggingTestCase) [Statistics]1200
ExpandStatistics reports tests (StatisticsReportsTestCase) [Statistics]2510
MessageGroupFilenameLineFunctionStatus
The test did not complete due to a fatal error.Completion checkstatistics.test141StatisticsReportsTestCase->testTopReferrers()
LeafStatistics token replacement (StatisticsTokenReplaceTestCase) [Statistics]2900
ExpandStream wrappers (StreamWrapperTest) [File API]410
MessageGroupFilenameLineFunctionStatus
The test did not complete due to a fatal error.Completion checkfile.test2581StreamWrapperTest->testUriFunctions()
LeafString filtering tests (CommonXssUnitTest) [System]900
ExpandString translate, search and validate (LocaleTranslationFunctionalTest) [Locale]13310
MessageGroupFilenameLineFunctionStatus
The test did not complete due to a fatal error.Completion checklocale.test361LocaleTranslationFunctionalTest->testStringValidation()
LeafString translation using st() (LocaleInstallTest) [Locale]100
LeafSummary length (SummaryLengthTestCase) [Node]1500
LeafSyslog functionality (SyslogTestCase) [Syslog]1600
LeafSystem info alter (SystemInfoAlterTestCase) [System]1000
ExpandTableselect form element type test (FormsElementsTableSelectFunctionalTest) [Form API]1410
MessageGroupFilenameLineFunctionStatus
The test did not complete due to a fatal error.Completion checkform.test612FormsElementsTableSelectFunctionalTest->testEmptyText()
LeafTablesort query tests (DatabaseSelectTableSortDefaultTestCase) [Database]3400
ExpandTaxonomy term functions and forms. (TaxonomyTermTestCase) [Taxonomy]4610
MessageGroupFilenameLineFunctionStatus
The test did not complete due to a fatal error.Completion checktaxonomy.test479TaxonomyTermTestCase->testNodeTermCreationAndDeletion()
LeafTaxonomy term hooks (TaxonomyHooksTestCase) [Taxonomy]1900
LeafTaxonomy term multiple loading (TaxonomyLoadMultipleUnitTest) [Taxonomy]1700
LeafTaxonomy term reference field (TaxonomyTermFieldTestCase) [Taxonomy]2500
LeafTaxonomy term unit tests (TaxonomyTermUnitTest) [Taxonomy]100
LeafTaxonomy term URL aliases (PathTaxonomyTermTestCase) [Path]3400
LeafTaxonomy token replacement (TaxonomyTokenReplaceTestCase) [Taxonomy]5300
ExpandTaxonomy upgrade path (UpgradePathTaxonomyTestCase) [Upgrade path]201
MessageGroupFilenameLineFunctionStatus
PDOException: SQLSTATE[42S02]: Base table or view not found: 1146 Table 'drupaltestbotmysql.simpletest631135cache_bootstrap' doesn't exist: DELETE FROM {cache_bootstrap} WHERE (cid = :db_condition_placeholder_0) ; Array ( [:db_condition_placeholder_0] => variables ) in cache_clear_all() (line 170 of /var/lib/drupaltestbot/sites/default/files/checkout/includes/cache.inc).Uncaught exceptiondatabase.inc1967PDOStatement->execute()
ExpandTaxonomy vocabularies (TaxonomyVocabularyUnitTest) [Taxonomy]2210
MessageGroupFilenameLineFunctionStatus
The test did not complete due to a fatal error.Completion checktaxonomy.test259TaxonomyVocabularyUnitTest->testTaxonomyVocabularyLoadStaticReset()
ExpandTaxonomy vocabulary interface (TaxonomyVocabularyFunctionalTest) [Taxonomy]6110
MessageGroupFilenameLineFunctionStatus
The test did not complete due to a fatal error.Completion checktaxonomy.test134TaxonomyVocabularyFunctionalTest->testTaxonomyAdminNoVocabularies()
LeafTemporary query test (DatabaseTemporaryQueryTestCase) [Database]500
LeafTest date field (ProfileTestDate) [Profile]4900
LeafTest field weights (ProfileTestWeights) [Profile]5300
LeafTest select field (ProfileTestSelect) [Profile]4500
LeafTest single fields (ProfileTestFields) [Profile]18000
ExpandTest statistics admin. (StatisticsAdminTestCase) [Statistics]4210
MessageGroupFilenameLineFunctionStatus
The test did not complete due to a fatal error.Completion checkstatistics.test329StatisticsAdminTestCase->testDeleteUser()
LeafTest user actions (TriggerUserActionTestCase) [Trigger]6500
LeafTest user triggers (TriggerUserTokenTestCase) [Trigger]18500
LeafTesting SimpleTest setUp (SimpleTestFolderTestCase) [SimpleTest]100
ExpandText field (TextFieldTestCase) [Field types]4410
MessageGroupFilenameLineFunctionStatus
The test did not complete due to a fatal error.Completion checktext.test132TextFieldTestCase->testTextfieldWidgetsFormatted()
ExpandText summary (TextSummaryTestCase) [Field types]210
MessageGroupFilenameLineFunctionStatus
The test did not complete due to a fatal error.Completion checktext.test270TextSummaryTestCase->testLength()
LeafText translation (TextTranslationTestCase) [Field types]10400
ExpandTheme API (ThemeUnitTest) [Theme]710
MessageGroupFilenameLineFunctionStatus
The test did not complete due to a fatal error.Completion checktheme.test59ThemeUnitTest->testFrontPageThemeSuggestion()
LeafTheme fast initialization (ThemeFastTestCase) [Theme]1000
LeafTheme initialization in hook_init() (ThemeHookInitUnitTest) [Theme]400
LeafTheme interface functionality (SystemThemeFunctionalTest) [System]6600
LeafTheme item list (ThemeItemListUnitTest) [Theme]100
ExpandTheme Table (ThemeTableUnitTest) [Theme]410
MessageGroupFilenameLineFunctionStatus
The test did not complete due to a fatal error.Completion checktheme.test147ThemeTableUnitTest->testThemeTableWithEmptyMessage()
LeafTimer test (BootstrapTimerTestCase) [Bootstrap]500
ExpandToken replacement (TokenReplaceTestCase) [System]2010
MessageGroupFilenameLineFunctionStatus
The test did not complete due to a fatal error.Completion checksystem.test1573TokenReplaceTestCase->testSystemDateTokenReplacement()
LeafTop visitor blocking (StatisticsBlockVisitorsTestCase) [Statistics]4500
ExpandTracker (TrackerTest) [Tracker]5810
MessageGroupFilenameLineFunctionStatus
The test did not complete due to a fatal error.Completion checktracker.test98TrackerTest->testTrackerNewNodes()
ExpandTransaction tests (DatabaseTransactionTestCase) [Database]1910
MessageGroupFilenameLineFunctionStatus
The test did not complete due to a fatal error.Completion checkdatabase_test.test3203DatabaseTransactionTestCase->testCommittedTransaction()
LeafTranslation export (LocaleExportFunctionalTest) [Locale]2900
LeafTranslation functionality (TranslationTestCase) [Translation]7500
ExpandTranslation import (LocaleImportFunctionalTest) [Locale]7710
MessageGroupFilenameLineFunctionStatus
The test did not complete due to a fatal error.Completion checklocale.test742LocaleImportFunctionalTest->testLanguageContext()
LeafTrigger content (node) actions (TriggerContentTestCase) [Trigger]35300
LeafTrigger cron (system) actions (TriggerCronTestCase) [Trigger]3300
LeafTrigger orphaned actions (TriggerOrphanedActionsTestCase) [Trigger]3700
ExpandTrigger other actions (TriggerOtherTestCase) [Trigger]9910
MessageGroupFilenameLineFunctionStatus
The test did not complete due to a fatal error.Completion checktrigger.test646TriggerOtherTestCase->testActionsTaxonomy()
LeafUI language negotiation (LocaleUILanguageNegotiationTest) [Locale]4700
LeafUnassigned text format functionality (FilterNoFormatTestCase) [Filter]100
ExpandUnicode handling (UnicodeUnitTest) [System]15510
MessageGroupFilenameLineFunctionStatus
The test did not complete due to a fatal error.Completion checkunicode.test192UnicodeUnitTest->testDecodeEntities()
ExpandUnmanaged file copying (FileUnmanagedCopyTest) [File API]1510
MessageGroupFilenameLineFunctionStatus
The test did not complete due to a fatal error.Completion checkfile.test1360FileUnmanagedCopyTest->testOverwriteSelf()
ExpandUnmanaged file delete (FileUnmanagedDeleteTest) [File API]510
MessageGroupFilenameLineFunctionStatus
The test did not complete due to a fatal error.Completion checkfile.test1143FileUnmanagedDeleteTest->testDirectory()
ExpandUnmanaged file moving (FileUnmanagedMoveTest) [File API]1510
MessageGroupFilenameLineFunctionStatus
The test did not complete due to a fatal error.Completion checkfile.test1286FileUnmanagedMoveTest->testOverwriteSelf()
LeafUnmanaged file save data (FileUnmanagedSaveDataTest) [File API]700
ExpandUnmanaged recursive file delete (FileUnmanagedDeleteRecursiveTest) [File API]510
MessageGroupFilenameLineFunctionStatus
The test did not complete due to a fatal error.Completion checkfile.test1194FileUnmanagedDeleteRecursiveTest->testDirectory()
ExpandUpdate contrib functionality (UpdateTestContribCase) [Update]4410
MessageGroupFilenameLineFunctionStatus
The test did not complete due to a fatal error.Completion checkupdate.test282UpdateTestContribCase->testUpdateContribOrder()
ExpandUpdate core functionality (UpdateCoreTestCase) [Update]4310
MessageGroupFilenameLineFunctionStatus
The test did not complete due to a fatal error.Completion checkupdate.test100UpdateCoreTestCase->testSecurityUpdateAvailable()
LeafUpdate dependency hook invocation (UpdateDependencyHookInvocationTestCase) [Update API]300
LeafUpdate dependency ordering (UpdateDependencyOrderingTestCase) [Update API]300
LeafUpdate feed functionality (UpdateFeedTestCase) [Aggregator]7400
LeafUpdate feed item functionality (UpdateFeedItemTestCase) [Aggregator]6100
LeafUpdate functionality (UpdateScriptFunctionalTest) [System]5600
LeafUpdate on cron functionality (AggregatorCronTestCase) [Aggregator]5300
ExpandUpdate tests (DatabaseUpdateTestCase) [Database]1410
MessageGroupFilenameLineFunctionStatus
The test did not complete due to a fatal error.Completion checkdatabase_test.test739DatabaseUpdateTestCase->testMultiGTUpdate()
ExpandUpdate tests, Complex (DatabaseUpdateComplexTestCase) [Database]1410
MessageGroupFilenameLineFunctionStatus
The test did not complete due to a fatal error.Completion checkdatabase_test.test828DatabaseUpdateComplexTestCase->testNotInConditionUpdate()
LeafUpdate tests, LOB (DatabaseUpdateLOBTestCase) [Database]1300
LeafUpload and extract module functionality (UpdateTestUploadCase) [Update]1800
ExpandUpload upgrade path (UploadUpgradePathTestCase) [Upgrade path]201
MessageGroupFilenameLineFunctionStatus
PDOException: SQLSTATE[42S02]: Base table or view not found: 1146 Table 'drupaltestbotmysql.simpletest163665cache_bootstrap' doesn't exist: DELETE FROM {cache_bootstrap} WHERE (cid = :db_condition_placeholder_0) ; Array ( [:db_condition_placeholder_0] => variables ) in cache_clear_all() (line 170 of /var/lib/drupaltestbot/sites/default/files/checkout/includes/cache.inc).Uncaught exceptiondatabase.inc1967PDOStatement->execute()
ExpandUpload user picture (UserPictureTestCase) [User]3010
MessageGroupFilenameLineFunctionStatus
The test did not complete due to a fatal error.Completion checkuser.test789UserPictureTestCase->testWithGDinvalidSize()
LeafURL altering (UrlAlterFunctionalTest) [Path API]2800
ExpandURL generation tests (CommonURLUnitTest) [System]210
MessageGroupFilenameLineFunctionStatus
The test did not complete due to a fatal error.Completion checkcommon.test100CommonURLUnitTest->testLCustomClass()
LeafUser administration (UserAdminTestCase) [User]6500
LeafUser autocompletion (UserAutocompleteTestCase) [User]2800
LeafUser blocks (UserBlocksUnitTests) [User]4300
LeafUser create (UserCreateTestCase) [User]2700
LeafUser creation (LocaleUserCreationTest) [Locale]6800
LeafUser edit (UserEditTestCase) [User]6800
LeafUser edited own account (UserEditedOwnAccountTestCase) [User]2300
LeafUser language settings (LocaleUserLanguageFunctionalTest) [Locale]5100
LeafUser login (UserLoginTestCase) [User]13200
LeafUser poll vote capability. (PollVoteCheckHostname) [Poll]12000
ExpandUser registration (UserRegistrationTestCase) [User]6510
MessageGroupFilenameLineFunctionStatus
The test did not complete due to a fatal error.Completion checkuser.test103UserRegistrationTestCase->testRegistrationDefaultValues()
LeafUser role administration (UserRoleAdminTestCase) [User]3900
LeafUser save test (UserSaveTestCase) [User]300
LeafUser search (UserUserSearchTestCase) [User]3800
LeafUser signatures (UserSignatureTestCase) [User]4500
LeafUser time zones (UserTimeZoneFunctionalTest) [User]3100
LeafUser token replacement (UserTokenReplaceTestCase) [User]4300
LeafUsername/e-mail validation (UserValidationTestCase) [User]1900
LeafValid Url (ValidUrlTestCase) [System]7900
LeafVariable test (BootstrapVariableTestCase) [Bootstrap]700
LeafXML-RPC basic (XMLRPCBasicTestCase) [XML-RPC]500
LeafXML-RPC message and alteration (XMLRPCMessagesTestCase) [XML-RPC]500
LeafXML-RPC validator (XMLRPCValidator1IncTestCase) [XML-RPC]900