drupal.cache-db-static.0.patch

Test status
StatusResult
Last receivedMon, 09/27/2010 - 22:30:30
Last requestedMon, 09/27/2010 - 22:47:08
Last testedMon, 09/27/2010 - 23:04:46
Test count1
Environment status
MySQLfail
File information
Filedrupal.cache-db-static.0.patch
BranchDrupal core - 7.x
LinkIssue Link
SummaryFAILED: [[SimpleTest]]: [MySQL] 24,991 pass(es), 16 fail(s), and 40 exception(s).
Details

MySQL

  1. Setup environment
  2. Detect an invalid patch URL
  3. Detect invalid repository information
  4. Detect invalid patch format
  5. Detect a non-applicable patch
  6. Detect invalid PHP syntax
  7. Detect a Drupal installation failure
  8. Detect a test run failure
  9. Detect a failing test
    Review the test failures below then if necessary run them locally until the problem has been fixed.
  10. Complete test suite with all tests passing
24,991 pass(es), 16 fail(s), and 40 exception(s)

Non-pass

Test namePassFailException
ExpandBasic upgrade path (BasicUpgradePath) [Upgrade path]4401
MessageGroupFilenameLineFunctionStatus
PDOException: SQLSTATE[42S02]: Base table or view not found: 1146 Table 'drupal_checkout.simpletest281113menu_custom' doesn't exist: SELECT * FROM {menu_custom}; Array ( ) in menu_load_all() (line 232 of /var/www/sites/default/files/checkout/modules/menu/menu.module).Uncaught exceptiondatabase.inc1962PDOStatement->execute()
ExpandCache clear test (CacheClearCase) [Cache]1120
MessageGroupFilenameLineFunctionStatus
Two caches were created for checking cid substring with wildcard true.Othercache.test271CacheClearCase->testClearWildcard()
Two cache entries were created.Othercache.test307CacheClearCase->testClearArray()
ExpandComment upgrade path (CommentUpgradePathTestCase) [Upgrade path]2701
MessageGroupFilenameLineFunctionStatus
PDOException: SQLSTATE[42S02]: Base table or view not found: 1146 Table 'drupal_checkout.simpletest12245cache_image' doesn't exist: TRUNCATE {cache_image} ; Array ( ) in cache_clear_all() (line 170 of /var/www/sites/default/files/checkout/includes/cache.inc).Uncaught exceptiondatabase.inc1962PDOStatement->execute()
ExpandEnable/disable modules (EnableDisableTestCase) [Module]5234
MessageGroupFilenameLineFunctionStatus
Undefined index: forumNoticeforum.install102forum_enable()
Trying to get property of non-objectNoticenode.module562node_add_body_field()
Trying to get property of non-objectNoticenode.module576node_add_body_field()
Attempt to create an instance of field body without a bundle.FieldExceptionfield.crud.inc650field_create_instance()
Modules status has been updated.Othersystem.test118EnableDisableTestCase->testEnableDisable()
hook_modules_installed fired.Othersystem.test121EnableDisableTestCase->testEnableDisable()
hook_modules_enabled fired.Othersystem.test122EnableDisableTestCase->testEnableDisable()
ExpandField attach tests (other) (FieldAttachOtherTestCase) [Field API]41311
MessageGroupFilenameLineFunctionStatus
Trying to get property of non-objectNoticefield.attach.inc625field_attach_load()
Invalid argument supplied for foreach()Warningfield.attach.inc625field_attach_load()
Trying to get property of non-objectNoticefield.attach.inc625field_attach_load()
Invalid argument supplied for foreach()Warningfield.attach.inc625field_attach_load()
Trying to get property of non-objectNoticefield.test819FieldAttachOtherTestCase->testFieldAttachCache()
Cached: correct cache entry on loadOtherfield.test819FieldAttachOtherTestCase->testFieldAttachCache()
Trying to get property of non-objectNoticefield.attach.inc625field_attach_load()
Invalid argument supplied for foreach()Warningfield.attach.inc625field_attach_load()
Trying to get property of non-objectNoticefield.test832FieldAttachOtherTestCase->testFieldAttachCache()
Cached: correct cache entry on loadOtherfield.test832FieldAttachOtherTestCase->testFieldAttachCache()
Trying to get property of non-objectNoticefield.attach.inc625field_attach_load()
Invalid argument supplied for foreach()Warningfield.attach.inc625field_attach_load()
Trying to get property of non-objectNoticefield.test847FieldAttachOtherTestCase->testFieldAttachCache()
Cached: correct cache entry on loadOtherfield.test847FieldAttachOtherTestCase->testFieldAttachCache()
ExpandImage styles and effects UI configuration (ImageAdminStylesUnitTest) [Image]22059
MessageGroupFilenameLineFunctionStatus
array_values(): The argument should be an arrayWarningimage.test458ImageAdminStylesUnitTest->testStyle()
Invalid argument supplied for foreach()Warningimage.test460ImageAdminStylesUnitTest->testStyle()
array_pop(): The argument should be an arrayWarningimage.test474ImageAdminStylesUnitTest->testStyle()
array_values(): The argument should be an arrayWarningimage.test458ImageAdminStylesUnitTest->testStyle()
Invalid argument supplied for foreach()Warningimage.test460ImageAdminStylesUnitTest->testStyle()
array_pop(): The argument should be an arrayWarningimage.test474ImageAdminStylesUnitTest->testStyle()
Found the Delete buttonOtherimage.test475ImageAdminStylesUnitTest->testStyle()
Found the requested form fields at admin/config/media/image-styles/edit/vjnokt8zge/effects//deleteOtherimage.test475ImageAdminStylesUnitTest->testStyle()
Image effect deleted.Otherimage.test476ImageAdminStylesUnitTest->testStyle()
Undefined index: nameNoticeimage.test485ImageAdminStylesUnitTest->testStyle()
Undefined index: nameNoticeimage.test488ImageAdminStylesUnitTest->testStyle()
The image_scale effect has an ieid.Otherimage.test534ImageAdminStylesUnitTest->testDefaultStyle()
Undefined offset: 1Noticeimage.test541ImageAdminStylesUnitTest->testDefaultStyle()
The added effect exists in the overridden style.Otherimage.test541ImageAdminStylesUnitTest->testDefaultStyle()
ExpandModule API (ModuleUnitTest) [Module]3210
MessageGroupFilenameLineFunctionStatus
The module implements cache is populated after requesting a page.Othermodule.test93ModuleUnitTest->testModuleImplements()
ExpandModule dependencies (ModuleDependencyTestCase) [Module]9417
MessageGroupFilenameLineFunctionStatus
Undefined index: forumNoticeforum.install102forum_enable()
Trying to get property of non-objectNoticenode.module562node_add_body_field()
Trying to get property of non-objectNoticenode.module576node_add_body_field()
Attempt to create an instance of field body without a bundle.FieldExceptionfield.crud.inc650field_create_instance()
array_keys(): The first argument should be an arrayWarningcommon.inc6146drupal_schema_fields_sql()
array_keys(): The first argument should be an arrayWarningcommon.inc6146drupal_schema_fields_sql()
Argument 2 passed to SelectQuery::fields() must be an array, null given, called in /var/www/sites/default/files/checkout/includes/entity.inc on line 273 and definedRecoverable fatal errorselect.inc1228SelectQuery->fields()
Modules status has been updated.Othersystem.test318ModuleDependencyTestCase->testEnableForumTaxonomyFieldDependency()
ExpandNode body upgrade path (NodeBodyUpgradePathTestCase) [Upgrade path]3702
MessageGroupFilenameLineFunctionStatus
Undefined index: accessNoticemenu.inc870_menu_link_translate()
Undefined index: accessNoticemenu.inc1403_menu_tree_check_access()
ExpandPoll upgrade path (PollUpgradePathTestCase) [Upgrade path]2701
MessageGroupFilenameLineFunctionStatus
PDOException: SQLSTATE[42S02]: Base table or view not found: 1146 Table 'drupal_checkout.simpletest490603taxonomy_vocabulary' doesn't exist: SELECT name, machine_name, vid FROM {taxonomy_vocabulary}; Array ( ) in taxonomy_vocabulary_get_names() (line 707 of /var/www/sites/default/files/checkout/modules/taxonomy/taxonomy.module).Uncaught exceptiondatabase.inc1962PDOStatement->execute()
ExpandRole permissions (UserPermissionsTestCase) [User]4912
MessageGroupFilenameLineFunctionStatus
Undefined index: administer news feedsNoticeuser.module2867user_role_grant_permissions()
SQLSTATE[23000]: Integrity constraint violation: 1048 Column 'module' cannot be null: INSERT INTO {role_permission} (rid, permission, module) VALUES (:db_insert_placeholder_0, :db_insert_placeholder_1, :db_insert_placeholder_2); Array ( [:db_insert_placeholder_0] => 4 [:db_insert_placeholder_1] => administer news feeds [:db_insert_placeholder_2] => ) PDOExceptionuser.module2869user_role_grant_permissions()
The permission was automatically assigned to the administrator roleOtheruser.test999UserPermissionsTestCase->testAdministratorRole()
ExpandTaxonomy upgrade path (UpgradePathTaxonomyTestCase) [Upgrade path]124202
MessageGroupFilenameLineFunctionStatus
Undefined index: accessNoticemenu.inc870_menu_link_translate()
Undefined index: accessNoticemenu.inc1403_menu_tree_check_access()

All

Test namePassFailException
Leaf403 functionality (AccessDeniedTestCase) [System]7500
Leaf404 functionality (PageNotFoundTestCase) [System]1800
LeafActions configuration (ActionsConfigurationTestCase) [Actions]3800
LeafActions executing in a potentially infinite loop (ActionLoopTestCase) [Actions]2800
LeafAdd feed functionality (AddFeedTestCase) [Aggregator]2800
LeafAdmin theme block admin accessibility (BlockAdminThemeTestCase) [Block]1800
LeafAdvanced search form (SearchAdvancedSearchForm) [Search]3100
LeafAJAX command form values (AJAXFormValuesTestCase) [AJAX]2800
LeafAJAX commands (AJAXCommandsTestCase) [AJAX]6300
LeafAJAX framework (AJAXFrameworkTestCase) [AJAX]800
LeafAJAX multi form (AJAXMultiFormTestCase) [AJAX]3500
LeafAnonymous comments (CommentAnonymous) [Comment]15600
LeafAutocompletion (ProfileTestAutocomplete) [Profile]5400
LeafBasic SQL syntax tests (DatabaseBasicSyntaxTestCase) [Database]2600
ExpandBasic upgrade path (BasicUpgradePath) [Upgrade path]4401
MessageGroupFilenameLineFunctionStatus
PDOException: SQLSTATE[42S02]: Base table or view not found: 1146 Table 'drupal_checkout.simpletest281113menu_custom' doesn't exist: SELECT * FROM {menu_custom}; Array ( ) in menu_load_all() (line 232 of /var/www/sites/default/files/checkout/modules/menu/menu.module).Uncaught exceptiondatabase.inc1962PDOStatement->execute()
LeafBatch percentages (BatchPercentagesUnitTestCase) [Batch API]1300
LeafBatch processing (BatchProcessingTestCase) [Batch API]14300
LeafBatch progress page (BatchPageTestCase) [Batch API]700
LeafBlock availability (BookBlockTestCase) [Book]1800
LeafBlock availability (NodeBlockTestCase) [Node]1800
LeafBlock availability (PollBlockTestCase) [Poll]10000
LeafBlock availability (ProfileBlockTestCase) [Profile]9000
LeafBlock availability (SearchBlockTestCase) [Search]5100
LeafBlock caching (BlockCacheTestCase) [Block]22800
LeafBlock functionality (BlockTestCase) [Block]26800
LeafBlock functionality (SystemBlockTestCase) [System]6800
LeafBlock HTML id (BlockHTMLIdTestCase) [Block]1500
LeafBlog functionality (BlogTestCase) [Blog]24100
LeafBook functionality (BookTestCase) [Book]26000
LeafBoot and exit hook invocation (HookBootExitTestCase) [Bootstrap]1800
LeafBreadcrumbs (MenuBreadcrumbTestCase) [Menu]36100
ExpandCache clear test (CacheClearCase) [Cache]1120
MessageGroupFilenameLineFunctionStatus
Two caches were created for checking cid substring with wildcard true.Othercache.test271CacheClearCase->testClearWildcard()
Two cache entries were created.Othercache.test307CacheClearCase->testClearArray()
LeafCache emptiness test (CacheIsEmptyCase) [Cache]500
LeafCache saving test (CacheSavingCase) [Cache]500
LeafCancel account (UserCancelTestCase) [User]23700
LeafCascading stylesheets (CascadingStylesheetsTestCase) [System]2600
LeafCategorize feed functionality (CategorizeFeedTestCase) [Aggregator]1900
LeafCategorize feed item functionality (CategorizeFeedItemTestCase) [Aggregator]5300
LeafChecks display of aggregator items (AggregatorRenderingTestCase) [Aggregator]6800
LeafCJK tokenizer (SearchTokenizerTestCase) [Search]200
LeafColor functionality (ColorTestCase) [Color]6100
LeafComment approval (CommentApprovalTest) [Comment]15400
LeafComment blocks (CommentBlockFunctionalTest) [Comment]11500
LeafComment count toggle (SearchCommentCountToggleTestCase) [Search]3000
LeafComment interface (CommentInterfaceTest) [Comment]22300
LeafComment paging settings (CommentPagerTest) [Comment]20800
LeafComment preview (CommentPreviewTest) [Comment]7200
LeafComment Rebuild (CommentContentRebuild) [Comment]3200
LeafComment RSS (CommentRSSUnitTest) [Comment]2400
LeafComment Search tests (SearchCommentTestCase) [Search]13900
LeafComment token replacement (CommentTokenReplaceTestCase) [Comment]6400
ExpandComment upgrade path (CommentUpgradePathTestCase) [Upgrade path]2701
MessageGroupFilenameLineFunctionStatus
PDOException: SQLSTATE[42S02]: Base table or view not found: 1146 Table 'drupal_checkout.simpletest12245cache_image' doesn't exist: TRUNCATE {cache_image} ; Array ( ) in cache_clear_all() (line 170 of /var/www/sites/default/files/checkout/includes/cache.inc).Uncaught exceptiondatabase.inc1962PDOStatement->execute()
LeafCompact mode (CompactModeTest) [System]2600
LeafConfig settings form (SearchConfigSettingsForm) [Search]11600
LeafConnection tests (DatabaseConnectionTestCase) [Database]3400
LeafContent language settings (LocaleContentFunctionalTest) [Locale]6400
LeafCron run (CronRunTestCase) [System]4500
LeafCSS Unit Tests (CascadingStylesheetsUnitTest) [System]600
LeafCustom query syntax tests (DatabaseQueryTestCase) [Database]600
LeafDashboard blocks (DashboardBlocksTestCase) [Dashboard]5000
LeafData API functions (DrupalDataApiTest) [System]3200
LeafDate and time (DateTimeFunctionalTest) [System]9600
LeafDBLog functionality (DBLogTestCase) [DBLog]44000
LeafDefault text format functionality (FilterDefaultFormatTestCase) [Filter]3300
LeafDelete/Truncate tests (DatabaseDeleteTruncateTestCase) [Database]2000
LeafDrupal error handlers (DrupalErrorHandlerUnitTest) [System]2800
LeafDrupal goto (DrupalGotoTest) [System]1800
LeafDrupal HTTP request (DrupalHTTPRequestTestCase) [System]2700
LeafDrupal match path (DrupalMatchPathTestCase) [Path API]4100
LeafDrupal set/get regions (DrupalSetContentTestCase) [System]3800
LeafDrupal tags handling (DrupalTagsHandlingTestCase) [System]800
Leafdrupal_alter() tests (DrupalAlterTestCase) [System]500
Leafdrupal_render() (DrupalRenderTestCase) [System]3300
LeafEmbedded forms (SearchEmbedForm) [Search]2900
LeafEmpty statement (DatabaseEmptyStatementTestCase) [Database]400
ExpandEnable/disable modules (EnableDisableTestCase) [Module]5234
MessageGroupFilenameLineFunctionStatus
Undefined index: forumNoticeforum.install102forum_enable()
Trying to get property of non-objectNoticenode.module562node_add_body_field()
Trying to get property of non-objectNoticenode.module576node_add_body_field()
Attempt to create an instance of field body without a bundle.FieldExceptionfield.crud.inc650field_create_instance()
Modules status has been updated.Othersystem.test118EnableDisableTestCase->testEnableDisable()
hook_modules_installed fired.Othersystem.test121EnableDisableTestCase->testEnableDisable()
hook_modules_enabled fired.Othersystem.test122EnableDisableTestCase->testEnableDisable()
LeafEntity properties (EntityPropertiesTestCase) [Entity API]300
LeafEntity query (EntityFieldQueryTestCase) [Entity API]8300
LeafFeed parser functionality (FeedParserTestCase) [Aggregator]4000
LeafFetch tests (DatabaseFetchTestCase) [Database]3300
LeafFetch tests, part 2 (DatabaseFetch2TestCase) [Database]2600
LeafFetching multiple cache items (CacheGetMultipleUnitTest) [Cache]700
ExpandField attach tests (other) (FieldAttachOtherTestCase) [Field API]41311
MessageGroupFilenameLineFunctionStatus
Trying to get property of non-objectNoticefield.attach.inc625field_attach_load()
Invalid argument supplied for foreach()Warningfield.attach.inc625field_attach_load()
Trying to get property of non-objectNoticefield.attach.inc625field_attach_load()
Invalid argument supplied for foreach()Warningfield.attach.inc625field_attach_load()
Trying to get property of non-objectNoticefield.test819FieldAttachOtherTestCase->testFieldAttachCache()
Cached: correct cache entry on loadOtherfield.test819FieldAttachOtherTestCase->testFieldAttachCache()
Trying to get property of non-objectNoticefield.attach.inc625field_attach_load()
Invalid argument supplied for foreach()Warningfield.attach.inc625field_attach_load()
Trying to get property of non-objectNoticefield.test832FieldAttachOtherTestCase->testFieldAttachCache()
Cached: correct cache entry on loadOtherfield.test832FieldAttachOtherTestCase->testFieldAttachCache()
Trying to get property of non-objectNoticefield.attach.inc625field_attach_load()
Invalid argument supplied for foreach()Warningfield.attach.inc625field_attach_load()
Trying to get property of non-objectNoticefield.test847FieldAttachOtherTestCase->testFieldAttachCache()
Cached: correct cache entry on loadOtherfield.test847FieldAttachOtherTestCase->testFieldAttachCache()
LeafField attach tests (storage-related) (FieldAttachStorageTestCase) [Field API]8300
LeafField bulk delete tests (FieldBulkDeleteTestCase) [Field API]4000
LeafField CRUD tests (FieldCrudTestCase) [Field API]5900
LeafField Display API tests (FieldDisplayAPITestCase) [Field API]4200
LeafField form tests (FieldFormTestCase) [Field API]16600
LeafField info tests (FieldInfoTestCase) [Field API]7900
LeafField instance CRUD tests (FieldInstanceCrudTestCase) [Field API]3200
LeafField SQL storage tests (FieldSqlStorageTestCase) [Field API]8300
LeafField translations tests (FieldTranslationsTestCase) [Field API]5200
LeafField UI tests (FieldUITestCase) [Field UI]15600
LeafFile copying (FileCopyTest) [File API]10600
LeafFile delete (FileDeleteTest) [File API]1800
LeafFile download (FileDownloadTest) [File API]3500
LeafFile field display tests (FileFieldDisplayTestCase) [File]2000
LeafFile field file path tests (FileFieldPathTestCase) [File]2300
LeafFile field revision test (FileFieldRevisionTestCase) [File]6700
LeafFile field validation tests (FileFieldValidateTestCase) [File]10300
LeafFile field widget test (FileFieldWidgetTestCase) [File]11400
LeafFile loading (FileLoadTest) [File API]2900
LeafFile mimetypes (FileMimeTypeTest) [File API]3800
LeafFile moving (FileMoveTest) [File API]10500
LeafFile naming (FileNameMungingTest) [File API]500
LeafFile paths and directories (FileDirectoryTest) [File API]1800
LeafFile save data (FileSaveDataTest) [File API]8800
LeafFile saving (FileSaveTest) [File API]1400
LeafFile scan directory (FileScanDirectoryTest) [File API]2300
LeafFile space used tests (FileSpaceUsedTest) [File API]1100
LeafFile token replacement (FileTokenReplaceTestCase) [File]3500
LeafFile uploading (FileSaveUploadTest) [File API]26500
LeafFile URL rewriting (FileURLRewritingTest) [File]1500
LeafFile usage (FileUsageTest) [File]2000
LeafFile validate (FileValidateTest) [File API]1100
LeafFile validator tests (FileValidatorTest) [File API]2700
LeafFileTransfer unit tests (FileTranferTest) [System]200
LeafFilter administration functionality (FilterAdminTestCase) [Filter]14500
LeafFilter CRUD operations (FilterCRUDTestCase) [Filter]21400
LeafFilter format access (FilterFormatAccessTestCase) [Filter]13400
LeafFilter format hooks (FilterHooksTestCase) [Filter]3200
LeafFilter module filters (FilterUnitTestCase) [Filter]20200
LeafFingerprinting meta tag (AdminMetaTagTestCase) [System]300
LeafFlood control mechanism (FloodFunctionalTest) [System]600
LeafForm alter hooks (FormAlterTestCase) [Form API]300
LeafForm API file inclusion (FormsFileInclusionTestCase) [Form API]900
LeafForm element and label output test (FormsElementsLabelsTestCase) [Form API]1500
LeafForm element validation (FormsTestCase) [Form API]29800
LeafForm rebuilding (FormsRebuildTestCase) [Form API]5500
LeafForm state values clearance (FormStateValuesCleanTestCase) [Form API]1300
LeafForm triggering element determination (FormsTriggeringElementTestCase) [Form API]5400
LeafForm validation handlers (FormValidationTestCase) [Form API]5200
LeafForm wrapper callback (FormsFormWrapperTestCase) [Form API]400
LeafFormat date (FormatDateUnitTest) [System]4300
LeafForum functionality (ForumTestCase) [Forum]71200
LeafFront page (FrontPageTestCase) [System]3600
LeafGet filename test (BootstrapGetFilenameTestCase) [Bootstrap]400
LeafGraph (GraphUnitTest) [System]2800
LeafHelp functionality (HelpTestCase) [Help]46400
LeafHTML Attributes (DrupalAttributesUnitTest) [System]600
LeafHTML identifiers (DrupalHTMLIdentifierTestCase) [System]1000
LeafHTML in page titles (PageTitleFiltering) [System]6200
LeafHTTP file retrieval (RetrieveFileTestCase) [System]1400
LeafImage effects (ImageEffectsUnitTest) [Image]3300
LeafImage field display tests (ImageFieldDisplayTestCase) [Image]15400
LeafImage field validation tests (ImageFieldValidateTestCase) [Image]2800
LeafImage GD manipulation tests (ImageToolkitGdTestCase) [Image]200
ExpandImage styles and effects UI configuration (ImageAdminStylesUnitTest) [Image]22059
MessageGroupFilenameLineFunctionStatus
array_values(): The argument should be an arrayWarningimage.test458ImageAdminStylesUnitTest->testStyle()
Invalid argument supplied for foreach()Warningimage.test460ImageAdminStylesUnitTest->testStyle()
array_pop(): The argument should be an arrayWarningimage.test474ImageAdminStylesUnitTest->testStyle()
array_values(): The argument should be an arrayWarningimage.test458ImageAdminStylesUnitTest->testStyle()
Invalid argument supplied for foreach()Warningimage.test460ImageAdminStylesUnitTest->testStyle()
array_pop(): The argument should be an arrayWarningimage.test474ImageAdminStylesUnitTest->testStyle()
Found the Delete buttonOtherimage.test475ImageAdminStylesUnitTest->testStyle()
Found the requested form fields at admin/config/media/image-styles/edit/vjnokt8zge/effects//deleteOtherimage.test475ImageAdminStylesUnitTest->testStyle()
Image effect deleted.Otherimage.test476ImageAdminStylesUnitTest->testStyle()
Undefined index: nameNoticeimage.test485ImageAdminStylesUnitTest->testStyle()
Undefined index: nameNoticeimage.test488ImageAdminStylesUnitTest->testStyle()
The image_scale effect has an ieid.Otherimage.test534ImageAdminStylesUnitTest->testDefaultStyle()
Undefined offset: 1Noticeimage.test541ImageAdminStylesUnitTest->testDefaultStyle()
The added effect exists in the overridden style.Otherimage.test541ImageAdminStylesUnitTest->testDefaultStyle()
LeafImage styles path and URL functions (ImageStylesPathAndUrlUnitTest) [Image]2300
LeafImage toolkit tests (ImageToolkitUnitTest) [Image]4800
LeafImport feeds from OPML functionality (ImportOPMLTestCase) [Aggregator]5300
LeafInfo file format parser (InfoFileParserTestCase) [System]900
LeafInsert tests (DatabaseInsertTestCase) [Database]4500
LeafInsert tests, default fields (DatabaseInsertDefaultsTestCase) [Database]1900
LeafInsert tests, LOB fields (DatabaseInsertLOBTestCase) [Database]1300
LeafInvalid data (DatabaseInvalidDataTestCase) [Database]700
LeafIP address and HTTP_HOST test (BootstrapIPAddressTestCase) [Bootstrap]1100
LeafIP address blocking (IPAddressBlockingTestCase) [System]4200
LeafJavaScript (JavaScriptTestCase) [System]3800
LeafJSON (DrupalJSONTest) [System]1400
LeafKeywords and conditions (SearchKeywordsConditions) [Search]2500
LeafLanguage configuration (LocaleConfigurationTest) [Locale]7800
LeafLanguage switching (LocaleLanguageSwitchingFunctionalTest) [Locale]2100
LeafList field (ListFieldTestCase) [Field types]1400
LeafList field UI (ListFieldUITestCase) [Field types]2400
LeafLoad multiple nodes (NodeLoadMultipleUnitTest) [Node]3600
LeafLocale uninstall (EN) (LocaleUninstallFunctionalTest) [Locale]3100
LeafLocale uninstall (FR) (LocaleUninstallFrenchFunctionalTest) [Locale]3100
LeafLocalize date formats (LocaleDateFormatsFunctionalTest) [Locale]3500
LeafLocking framework tests (LockFunctionalTest) [System]1700
LeafMail system (MailTestCase) [System]100
LeafMain content rendering fallback (SystemMainContentFallback) [System]7900
LeafMenu link creation/deletion (MenuTestCase) [Menu]64400
LeafMenu rebuild test (MenuRebuildTestCase) [Menu]500
LeafMenu router (MenuRouterTestCase) [Menu]16200
LeafMenu settings for nodes (MenuNodeTestCase) [Menu]4700
LeafMenu tree generation (MenuTreeDataTestCase) [Menu]400
LeafMerge tests (DatabaseMergeTestCase) [Database]7500
LeafMiscellaneous AJAX tests (AJAXElementValidation) [AJAX]800
LeafMissing update dependencies (UpdateDependencyMissingTestCase) [Update API]300
ExpandModule API (ModuleUnitTest) [Module]3210
MessageGroupFilenameLineFunctionStatus
The module implements cache is populated after requesting a page.Othermodule.test93ModuleUnitTest->testModuleImplements()
ExpandModule dependencies (ModuleDependencyTestCase) [Module]9417
MessageGroupFilenameLineFunctionStatus
Undefined index: forumNoticeforum.install102forum_enable()
Trying to get property of non-objectNoticenode.module562node_add_body_field()
Trying to get property of non-objectNoticenode.module576node_add_body_field()
Attempt to create an instance of field body without a bundle.FieldExceptionfield.crud.inc650field_create_instance()
array_keys(): The first argument should be an arrayWarningcommon.inc6146drupal_schema_fields_sql()
array_keys(): The first argument should be an arrayWarningcommon.inc6146drupal_schema_fields_sql()
Argument 2 passed to SelectQuery::fields() must be an array, null given, called in /var/www/sites/default/files/checkout/includes/entity.inc on line 273 and definedRecoverable fatal errorselect.inc1228SelectQuery->fields()
Modules status has been updated.Othersystem.test318ModuleDependencyTestCase->testEnableForumTaxonomyFieldDependency()
LeafModule installation (ModuleInstallTestCase) [Module]200
LeafModule uninstallation (ModuleUninstallTestCase) [Module]100
LeafModule versions (ModuleVersionTestCase) [Module]5000
LeafMultilingual fields (LocaleMultilingualFieldsFunctionalTest) [Locale]5200
LeafMultistep form using form storage (FormsFormStorageTestCase) [Form API]12800
LeafMultistep node form basic options (MultiStepNodeFormBasicOptionsTest) [Node]1500
LeafNew default theme blocks (NewDefaultThemeBlocks) [Block]2400
LeafNo help (NoHelpTestCase) [Help]1100
LeafNode access (NodeAccessUnitTest) [Node]3100
LeafNode access rebuild (NodeAccessRebuildTestCase) [Node]1600
LeafNode access records (NodeAccessRecordsUnitTest) [Node]2200
LeafNode administration (NodeAdminTestCase) [Node]11900
LeafNode blocks (NodeBlockFunctionalTest) [Node]8300
ExpandNode body upgrade path (NodeBodyUpgradePathTestCase) [Upgrade path]3702
MessageGroupFilenameLineFunctionStatus
Undefined index: accessNoticemenu.inc870_menu_link_translate()
Undefined index: accessNoticemenu.inc1403_menu_tree_check_access()
LeafNode creation (NodeCreationTestCase) [Node]2500
LeafNode edit (PageEditTestCase) [Node]9300
LeafNode edit permissions (PageViewTestCase) [Node]3200
LeafNode entity query alter (NodeEntityFieldQueryAlter) [Node]3000
LeafNode feed (NodeFeedTestCase) [Node]100
LeafNode post information display (NodePostSettingsTestCase) [Node]3400
LeafNode preview (PagePreviewTestCase) [Node]3500
LeafNode query alter (NodeQueryAlter) [Node]5100
LeafNode revisions (NodeRevisionsTestCase) [Node]4400
LeafNode RSS Content (NodeRSSContentTestCase) [Node]1600
LeafNode save (NodeSaveTestCase) [Node]2800
LeafNode title (NodeTitleTestCase) [Node]2000
LeafNode title XSS filtering (NodeTitleXSSTestCase) [Node]2000
LeafNode token replacement (NodeTokenReplaceTestCase) [Node]3400
LeafNode types (NodeTypeTestCase) [Node]8400
LeafNon default theme admin (NonDefaultBlockAdmin) [Block]1000
LeafOpenID account registration (OpenIDRegistrationTestCase) [OpenID]13100
LeafOpenID discovery and login (OpenIDFunctionalTestCase) [OpenID]24800
LeafOpenID helper functions (OpenIDUnitTest) [OpenID]3200
LeafOptions widgets (OptionsWidgetsTestCase) [Field types]22900
LeafPage cache test (BootstrapPageCacheTestCase) [Bootstrap]7800
LeafPager query tests (DatabaseSelectPagerDefaultTestCase) [Database]4200
LeafParsing .info files (ParseInfoFilesTestCase) [System]300
LeafPath alias functionality (PathTestCase) [Path]10200
LeafPath aliases with languages (PathLanguageUITestCase) [Path]6900
LeafPath aliases with translated nodes (PathLanguageTestCase) [Path]6300
LeafPath language settings (LocalePathFunctionalTest) [Locale]3600
LeafPaths on non-English monolingual sites (PathMonolingualTestCase) [Path]3400
LeafPersonal contact form (ContactPersonalTestCase) [Contact]14200
LeafPHP filter access check (PHPAccessTestCase) [PHP]3700
LeafPHP filter functionality (PHPFilterTestCase) [PHP]4100
LeafPoll add choice (PollJSAddChoice) [Poll]1500
LeafPoll create (PollCreateTestCase) [Poll]12100
LeafPoll expiration (PollExpirationTestCase) [Poll]3200
LeafPoll token replacement (PollTokenReplaceTestCase) [Poll]10600
ExpandPoll upgrade path (PollUpgradePathTestCase) [Upgrade path]2701
MessageGroupFilenameLineFunctionStatus
PDOException: SQLSTATE[42S02]: Base table or view not found: 1146 Table 'drupal_checkout.simpletest490603taxonomy_vocabulary' doesn't exist: SELECT name, machine_name, vid FROM {taxonomy_vocabulary}; Array ( ) in taxonomy_vocabulary_get_names() (line 707 of /var/www/sites/default/files/checkout/modules/taxonomy/taxonomy.module).Uncaught exceptiondatabase.inc1962PDOStatement->execute()
LeafPoll vote (PollVoteTestCase) [Poll]8000
LeafProfile browsing (ProfileTestBrowsing) [Profile]3200
LeafProgrammatic form submissions (FormsProgrammaticTestCase) [Form API]1800
LeafQuery altering tests (DatabaseAlterTestCase) [Database]5500
LeafQuery logging (DatabaseLoggingTestCase) [Database]3800
LeafQuery tagging tests (DatabaseTaggingTestCase) [Database]2800
LeafQueue functionality (QueueTestCase) [System]700
LeafRange query test (DatabaseRangeQueryTestCase) [Database]200
LeafRDF comment mapping (RdfCommentAttributesTestCase) [RDF]20400
LeafRDF mapping CRUD functions (RdfCrudTestCase) [RDF]900
LeafRDF mapping definition functionality (RdfMappingDefinitionTestCase) [RDF]5800
LeafRDF mapping hook (RdfMappingHookTestCase) [RDF]500
LeafRDF namespaces (RdfGetRdfNamespacesTestCase) [RDF]400
LeafRDF namespaces XML serialization tests (DrupalGetRdfNamespacesTestCase) [System]600
LeafRDF tracker page mapping (RdfTrackerAttributesTestCase) [RDF]3200
LeafRDFa markup (RdfRdfaMarkupTestCase) [RDF]2100
LeafRebuild arbitrary forms (FormsArbitraryRebuildTestCase) [Form API]1400
LeafRebuild content (NodeBuildContent) [Node]100
LeafRegistry parse file test (RegistryParseFileTestCase) [System]200
LeafRegistry parse files test (RegistryParseFilesTestCase) [System]600
LeafRegression tests (DatabaseRegressionTestCase) [Database]2700
LeafRemove feed functionality (RemoveFeedTestCase) [Aggregator]2300
LeafRemove feed item functionality (RemoveFeedItemTestCase) [Aggregator]19600
LeafRequired modules (ModuleRequiredTestCase) [Module]2100
LeafRequirements hook failure (HookRequirementsTestCase) [Module]1500
LeafResettable static variables test (BootstrapResettableStaticTestCase) [Bootstrap]500
LeafRole assignment (UserRolesAssignmentTestCase) [User]5300
ExpandRole permissions (UserPermissionsTestCase) [User]4912
MessageGroupFilenameLineFunctionStatus
Undefined index: administer news feedsNoticeuser.module2867user_role_grant_permissions()
SQLSTATE[23000]: Integrity constraint violation: 1048 Column 'module' cannot be null: INSERT INTO {role_permission} (rid, permission, module) VALUES (:db_insert_placeholder_0, :db_insert_placeholder_1, :db_insert_placeholder_2); Array ( [:db_insert_placeholder_0] => 4 [:db_insert_placeholder_1] => administer news feeds [:db_insert_placeholder_2] => ) PDOExceptionuser.module2869user_role_grant_permissions()
The permission was automatically assigned to the administrator roleOtheruser.test999UserPermissionsTestCase->testAdministratorRole()
LeafSchema API (SchemaTestCase) [Database]2700
LeafSearch engine phrase queries (SearchExactTestCase) [Search]2200
LeafSearch engine queries (SearchMatchTestCase) [Search]14400
LeafSearch engine ranking (SearchRankingTestCase) [Search]6000
LeafSearch excerpt extraction (SearchExcerptTestCase) [Search]500
LeafSearch expression insert/extract (SearchExpressionInsertExtractTestCase) [Search]2400
LeafSearch page override (SearchPageOverride) [Search]1200
LeafSearch page text (SearchPageText) [Search]2600
LeafSearch simplify (SearchSimplifyTestCase) [Search]33800
LeafSecurity (FilterSecurityTestCase) [Filter]2600
LeafSelect tests (DatabaseSelectTestCase) [Database]11700
LeafSelect tests, complex (DatabaseSelectComplexTestCase) [Database]11500
LeafSelect tests, complex 2 (DatabaseSelectComplexTestCase2) [Database]1400
LeafSelect tests, ordered (DatabaseSelectOrderedTestCase) [Database]2600
LeafSelect tests, subqueries (DatabaseSelectSubqueryTestCase) [Database]2400
LeafSequences API (DatabaseNextIdCase) [Database]200
LeafSession https handling (SessionHttpsTestCase) [Session]6800
LeafSession tests (SessionTestCase) [Session]14600
LeafShortcut link functionality (ShortcutLinksTestCase) [Shortcut]9600
LeafShortcut set functionality (ShortcutSetsTestCase) [Shortcut]17000
LeafShutdown functions (ShutdownFunctionsTest) [System]800
LeafSimpleTest browser (SimpleTestBrowserTestCase) [SimpleTest]1600
LeafSimpleTest e-mail capturing (SimpleTestMailCaptureTestCase) [SimpleTest]1300
LeafSimpleTest error collector (DrupalErrorCollectionUnitTest) [SimpleTest]1500
LeafSimpleTest functionality (SimpleTestFunctionalTest) [SimpleTest]9100
LeafSite maintenance mode functionality (SiteMaintenanceTestCase) [System]15200
LeafSite-wide contact form (ContactSitewideTestCase) [Contact]23700
LeafSize parsing test (CommonSizeTestCase) [System]3500
LeafStatistics logging tests (StatisticsLoggingTestCase) [Statistics]1200
LeafStatistics reports tests (StatisticsReportsTestCase) [Statistics]8000
LeafStatistics token replacement (StatisticsTokenReplaceTestCase) [Statistics]2900
LeafStream wrappers (StreamWrapperTest) [File API]1500
LeafString filtering tests (CommonXssUnitTest) [System]900
LeafString translate, search and validate (LocaleTranslationFunctionalTest) [Locale]25000
LeafString translation using st() (LocaleInstallTest) [Locale]100
LeafSummary length (SummaryLengthTestCase) [Node]1500
LeafSyslog functionality (SyslogTestCase) [Syslog]1600
LeafTableselect form element type test (FormsElementsTableSelectFunctionalTest) [Form API]5200
LeafTablesort query tests (DatabaseSelectTableSortDefaultTestCase) [Database]3400
LeafTaxonomy term functions and forms. (TaxonomyTermTestCase) [Taxonomy]16600
LeafTaxonomy term hooks (TaxonomyHooksTestCase) [Taxonomy]1900
LeafTaxonomy term multiple loading (TaxonomyLoadMultipleUnitTest) [Taxonomy]1700
LeafTaxonomy term reference field (TaxonomyTermFieldTestCase) [Taxonomy]2500
LeafTaxonomy term unit tests (TaxonomyTermUnitTest) [Taxonomy]100
LeafTaxonomy term URL aliases (PathTaxonomyTermTestCase) [Path]3400
LeafTaxonomy token replacement (TaxonomyTokenReplaceTestCase) [Taxonomy]5300
ExpandTaxonomy upgrade path (UpgradePathTaxonomyTestCase) [Upgrade path]124202
MessageGroupFilenameLineFunctionStatus
Undefined index: accessNoticemenu.inc870_menu_link_translate()
Undefined index: accessNoticemenu.inc1403_menu_tree_check_access()
LeafTaxonomy vocabularies (TaxonomyVocabularyUnitTest) [Taxonomy]5200
LeafTaxonomy vocabulary interface (TaxonomyVocabularyFunctionalTest) [Taxonomy]9700
LeafTemporary query test (DatabaseTemporaryQueryTestCase) [Database]500
LeafTest date field (ProfileTestDate) [Profile]4900
LeafTest field weights (ProfileTestWeights) [Profile]5300
LeafTest select field (ProfileTestSelect) [Profile]4500
LeafTest single fields (ProfileTestFields) [Profile]18000
LeafTest statistics admin. (StatisticsAdminTestCase) [Statistics]10400
LeafTest user actions (TriggerUserActionTestCase) [Trigger]6500
LeafTest user triggers (TriggerUserTokenTestCase) [Trigger]18500
LeafTesting SimpleTest setUp (SimpleTestFolderTestCase) [SimpleTest]100
LeafText field (TextFieldTestCase) [Field types]19700
LeafText summary (TextSummaryTestCase) [Field types]11600
LeafText translation (TextTranslationTestCase) [Field types]10400
LeafTheme API (ThemeUnitTest) [Theme]1100
LeafTheme fast initialization (ThemeFastTestCase) [Theme]1000
LeafTheme initialization in hook_init() (ThemeHookInitUnitTest) [Theme]400
LeafTheme interface functionality (SystemThemeFunctionalTest) [System]8800
LeafTheme item list (ThemeItemListUnitTest) [Theme]100
LeafTheme Table (ThemeTableUnitTest) [Theme]600
LeafTimer test (BootstrapTimerTestCase) [Bootstrap]500
LeafToken replacement (TokenReplaceTestCase) [System]3400
LeafTop visitor blocking (StatisticsBlockVisitorsTestCase) [Statistics]4500
LeafTracker (TrackerTest) [Tracker]21900
LeafTransaction tests (DatabaseTransactionTestCase) [Database]3100
LeafTranslation export (LocaleExportFunctionalTest) [Locale]2900
LeafTranslation functionality (TranslationTestCase) [Translation]7500
LeafTranslation import (LocaleImportFunctionalTest) [Locale]9100
LeafTrigger content (node) actions (TriggerContentTestCase) [Trigger]35300
LeafTrigger cron (system) actions (TriggerCronTestCase) [Trigger]3300
LeafTrigger orphaned actions (TriggerOrphanedActionsTestCase) [Trigger]3700
LeafTrigger other actions (TriggerOtherTestCase) [Trigger]11200
LeafUI language negotiation (LocaleUILanguageNegotiationTest) [Locale]4700
LeafUnassigned text format functionality (FilterNoFormatTestCase) [Filter]100
LeafUnicode handling (UnicodeUnitTest) [System]25500
LeafUnmanaged file copying (FileUnmanagedCopyTest) [File API]3100
LeafUnmanaged file delete (FileUnmanagedDeleteTest) [File API]800
LeafUnmanaged file moving (FileUnmanagedMoveTest) [File API]2200
LeafUnmanaged file save data (FileUnmanagedSaveDataTest) [File API]700
LeafUnmanaged recursive file delete (FileUnmanagedDeleteRecursiveTest) [File API]1700
LeafUpdate contrib functionality (UpdateTestContribCase) [Update]13700
LeafUpdate core functionality (UpdateCoreTestCase) [Update]14700
LeafUpdate dependency hook invocation (UpdateDependencyHookInvocationTestCase) [Update API]300
LeafUpdate dependency ordering (UpdateDependencyOrderingTestCase) [Update API]300
LeafUpdate feed functionality (UpdateFeedTestCase) [Aggregator]7400
LeafUpdate feed item functionality (UpdateFeedItemTestCase) [Aggregator]6100
LeafUpdate functionality (UpdateScriptFunctionalTest) [System]5800
LeafUpdate on cron functionality (AggregatorCronTestCase) [Aggregator]5300
LeafUpdate tests (DatabaseUpdateTestCase) [Database]3500
LeafUpdate tests, Complex (DatabaseUpdateComplexTestCase) [Database]5200
LeafUpdate tests, LOB (DatabaseUpdateLOBTestCase) [Database]1300
LeafUpload and extract module functionality (UpdateTestUploadCase) [Update]1800
LeafUpload user picture (UserPictureTestCase) [User]7600
LeafURL altering (UrlAlterFunctionalTest) [Path API]2800
LeafURL generation tests (CommonURLUnitTest) [System]8400
LeafUser administration (UserAdminTestCase) [User]6500
LeafUser autocompletion (UserAutocompleteTestCase) [User]2800
LeafUser blocks (UserBlocksUnitTests) [User]4300
LeafUser create (UserCreateTestCase) [User]2700
LeafUser creation (LocaleUserCreationTest) [Locale]6800
LeafUser edit (UserEditTestCase) [User]6800
LeafUser edited own account (UserEditedOwnAccountTestCase) [User]2300
LeafUser language settings (LocaleUserLanguageFunctionalTest) [Locale]5100
LeafUser login (UserLoginTestCase) [User]13200
LeafUser poll vote capability. (PollVoteCheckHostname) [Poll]12000
LeafUser registration (UserRegistrationTestCase) [User]8100
LeafUser role administration (UserRoleAdminTestCase) [User]3900
LeafUser save test (UserSaveTestCase) [User]300
LeafUser search (UserUserSearchTestCase) [User]3800
LeafUser signatures (UserSignatureTestCase) [User]4500
LeafUser time zones (UserTimeZoneFunctionalTest) [User]3100
LeafUser token replacement (UserTokenReplaceTestCase) [User]4300
LeafUsername/e-mail validation (UserValidationTestCase) [User]1900
LeafValid Url (ValidUrlTestCase) [System]9500
LeafVariable test (BootstrapVariableTestCase) [Bootstrap]700
LeafXML-RPC basic (XMLRPCBasicTestCase) [XML-RPC]500
LeafXML-RPC message (XMLRPCMessagesTestCase) [XML-RPC]300
LeafXML-RPC validator (XMLRPCValidator1IncTestCase) [XML-RPC]900