2352959-page-manager-arguments-11.patch

Test status
StatusResult
Last receivedMon, 08/24/2015 - 20:59:59
Last requestedMon, 08/24/2015 - 21:03:11
Last testedMon, 08/24/2015 - 21:04:20
Test count2
Environment status
PHP 5.5 MySQLfail
File information
File2352959-page-manager-arguments-11.patch
BranchPage Manager - 8.x-1.x
LinkIssue Link
SummaryFAILED: [[SimpleTest]]: [PHP 5.5 MySQL] 545 pass(es), 1 fail(s), and 0 exception(s).
Details

PHP 5.5 MySQL

  1. Setup environment
  2. Detect an invalid patch URL
  3. Detect invalid repository information
  4. Detect invalid patch format
  5. Detect a non-applicable patch
  6. Detect invalid PHP syntax
  7. Detect a Drupal installation failure
  8. Detect a test run failure
  9. Detect a failing test
    Review the test failures below then if necessary run them locally until the problem has been fixed.
  10. Complete test suite with all tests passing
545 pass(es), 1 fail(s), and 0 exception(s)

Non-pass

Test namePassFailException
ExpandDrupal\Tests\page_manager\Unit\PageManagerRoutesTest310
MessageGroupFilenameLineFunctionStatus
Drupal\Tests\page_manager\Unit\PageManagerRoutesTest::testAlterRoutesWithArgument Prophecy\Exception\Doubler\MethodNotFoundException: Method `Double\ConfigEntityStorageInterface\P9::expects()` is not defined. /var/lib/drupaltestbot/sites/default/files/checkout/sites/default/modules/page_manager/tests/src/Unit/PageManagerRoutesTest.php:174 /var/lib/drupaltestbot/sites/default/files/checkout/sites/default/modules/page_manager/tests/src/Unit/PageManagerRoutesTest.php:174 OtherPageManagerRoutesTest.php160Drupal\Tests\page_manager\Unit\PageManagerRoutesTest->testAlterRoutesWithArgument()

All

Test namePassFailException
LeafDrupal\page_manager\Tests\PageConfigSchemaTest300
LeafDrupal\page_manager\Tests\PageManagerAdminTest25800
LeafDrupal\page_manager\Tests\PageManagerTranslationIntegrationTest3800
LeafDrupal\page_manager\Tests\PageNodeSelectionTest7300
LeafDrupal\page_manager\Tests\PagePlaceholderTest2600
LeafDrupal\page_manager\Tests\StaticContextTest11200
LeafDrupal\Tests\page_manager\Unit\BlockDisplayVariantTest600
LeafDrupal\Tests\page_manager\Unit\BlockPluginCollectionTest100
LeafDrupal\Tests\page_manager\Unit\BlockVariantTraitTest400
LeafDrupal\Tests\page_manager\Unit\CurrentUserContextTest100
LeafDrupal\Tests\page_manager\Unit\PageAccessTest600
LeafDrupal\Tests\page_manager\Unit\PageExecutableTest400
ExpandDrupal\Tests\page_manager\Unit\PageManagerRoutesTest310
MessageGroupFilenameLineFunctionStatus
Drupal\Tests\page_manager\Unit\PageManagerRoutesTest::testAlterRoutesWithArgument Prophecy\Exception\Doubler\MethodNotFoundException: Method `Double\ConfigEntityStorageInterface\P9::expects()` is not defined. /var/lib/drupaltestbot/sites/default/files/checkout/sites/default/modules/page_manager/tests/src/Unit/PageManagerRoutesTest.php:174 /var/lib/drupaltestbot/sites/default/files/checkout/sites/default/modules/page_manager/tests/src/Unit/PageManagerRoutesTest.php:174 OtherPageManagerRoutesTest.php160Drupal\Tests\page_manager\Unit\PageManagerRoutesTest->testAlterRoutesWithArgument()
LeafDrupal\Tests\page_manager\Unit\PageTest200
LeafDrupal\Tests\page_manager\Unit\RouteParamContextTest100
LeafDrupal\Tests\page_manager\Unit\VariantAwareTraitTest700