895308-kill-file-directory-path.patch

Test status
StatusResult
Last receivedFri, 08/27/2010 - 14:50:42
Last requestedFri, 08/27/2010 - 14:51:01
Last testedFri, 08/27/2010 - 15:14:11
Test count1
Environment status
MySQLfail
File information
File895308-kill-file-directory-path.patch
BranchDrupal core - 7.x
LinkIssue Link
SummaryFAILED: [[SimpleTest]]: [MySQL] 23,143 pass(es), 62 fail(s), and 193 exception(s).
Details

MySQL

  1. Setup environment
  2. Detect an invalid patch URL
  3. Detect invalid repository information
  4. Detect invalid patch format
  5. Detect a non-applicable patch
  6. Detect invalid PHP syntax
  7. Detect a Drupal installation failure
  8. Detect a test run failure
  9. Detect a failing test
    Review the test failures below then if necessary run them locally until the problem has been fixed.
  10. Complete test suite with all tests passing
23,143 pass(es), 62 fail(s), and 193 exception(s)

Non-pass

Test namePassFailException
ExpandFile field display tests (FileFieldDisplayTestCase) [File]19112
MessageGroupFilenameLineFunctionStatus
Undefined index: undNoticefile.test521FileFieldDisplayTestCase->testNodeDisplay()
Undefined property: stdClass::$uriNoticefile.module706theme_file_link()
Undefined property: stdClass::$filemimeNoticefile.module744theme_file_icon()
Undefined property: stdClass::$filemimeNoticefile.module786file_icon_path()
Undefined property: stdClass::$filemimeNoticefile.module828file_icon_map()
Undefined property: stdClass::$filemimeNoticefile.module801file_icon_path()
Undefined property: stdClass::$filemimeNoticefile.module801file_icon_path()
Undefined property: stdClass::$filemimeNoticefile.module801file_icon_path()
Undefined property: stdClass::$filemimeNoticefile.module801file_icon_path()
Undefined property: stdClass::$filemimeNoticefile.module713theme_file_link()
Undefined property: stdClass::$filesizeNoticefile.module713theme_file_link()
Undefined property: stdClass::$filenameNoticefile.module719theme_file_link()
Default formatter displaying correctly on full node view.Otherfile.test523FileFieldDisplayTestCase->testNodeDisplay()
ExpandFile field file path tests (FileFieldPathTestCase) [File]2039
MessageGroupFilenameLineFunctionStatus
Undefined index: undNoticefile.test719FileFieldPathTestCase->testUploadPath()
Undefined property: stdClass::$uriNoticefile.test720FileFieldPathTestCase->testUploadPath()
Undefined property: stdClass::$uriNoticefile.test720FileFieldPathTestCase->testUploadPath()
The file was uploaded to the correct path.Otherfile.test720FileFieldPathTestCase->testUploadPath()
Undefined index: undNoticefile.test730FileFieldPathTestCase->testUploadPath()
Undefined property: stdClass::$uriNoticefile.test731FileFieldPathTestCase->testUploadPath()
Undefined property: stdClass::$uriNoticefile.test731FileFieldPathTestCase->testUploadPath()
The file was uploaded to the correct path.Otherfile.test731FileFieldPathTestCase->testUploadPath()
Undefined index: undNoticefile.test742FileFieldPathTestCase->testUploadPath()
Undefined property: stdClass::$uriNoticefile.test745FileFieldPathTestCase->testUploadPath()
Undefined property: stdClass::$uriNoticefile.test745FileFieldPathTestCase->testUploadPath()
The file was uploaded to the correct path with token replacements.Otherfile.test745FileFieldPathTestCase->testUploadPath()
ExpandFile field revision test (FileFieldRevisionTestCase) [File]381239
MessageGroupFilenameLineFunctionStatus
Undefined index: undNoticefile.test408FileFieldRevisionTestCase->testRevisions()
Undefined property: stdClass::$uriNoticefile.test165FileFieldTestCase->assertFileExists()
New file saved to disk on node creation.Otherfile.test410FileFieldRevisionTestCase->testRevisions()
Undefined property: stdClass::$fidNoticefile.test173FileFieldTestCase->assertFileEntryExists()
array_flip(): Can only flip STRING and INTEGER values!Warningentity.inc167DrupalDefaultEntityController->load()
Trying to get property of non-objectNoticefile.test175FileFieldTestCase->assertFileEntryExists()
Undefined property: stdClass::$uriNoticefile.test175FileFieldTestCase->assertFileEntryExists()
Undefined property: stdClass::$statusNoticefile.test200FileFieldTestCase->assertFileIsPermanent()
File is permanent.Otherfile.test412FileFieldRevisionTestCase->testRevisions()
Found the Remove buttonOtherfile.test156FileFieldTestCase->replaceNodeFile()
Found the requested form fields at node/1/editOtherfile.test156FileFieldTestCase->replaceNodeFile()
Undefined index: undNoticefile.test417FileFieldRevisionTestCase->testRevisions()
Undefined property: stdClass::$uriNoticefile.test165FileFieldTestCase->assertFileExists()
Replacement file exists on disk after creating new revision.Otherfile.test419FileFieldRevisionTestCase->testRevisions()
Undefined property: stdClass::$fidNoticefile.test173FileFieldTestCase->assertFileEntryExists()
array_flip(): Can only flip STRING and INTEGER values!Warningentity.inc167DrupalDefaultEntityController->load()
Trying to get property of non-objectNoticefile.test175FileFieldTestCase->assertFileEntryExists()
Undefined property: stdClass::$uriNoticefile.test175FileFieldTestCase->assertFileEntryExists()
Undefined property: stdClass::$statusNoticefile.test200FileFieldTestCase->assertFileIsPermanent()
Replacement file is permanent.Otherfile.test421FileFieldRevisionTestCase->testRevisions()
Undefined index: undNoticefile.test425FileFieldRevisionTestCase->testRevisions()
Undefined property: stdClass::$uriNoticefile.test165FileFieldTestCase->assertFileExists()
Original file still in place after replacing file in new revision.Otherfile.test426FileFieldRevisionTestCase->testRevisions()
Undefined property: stdClass::$fidNoticefile.test173FileFieldTestCase->assertFileEntryExists()
array_flip(): Can only flip STRING and INTEGER values!Warningentity.inc167DrupalDefaultEntityController->load()
Trying to get property of non-objectNoticefile.test175FileFieldTestCase->assertFileEntryExists()
Undefined property: stdClass::$uriNoticefile.test175FileFieldTestCase->assertFileEntryExists()
Undefined property: stdClass::$statusNoticefile.test200FileFieldTestCase->assertFileIsPermanent()
Original file is still permanent.Otherfile.test428FileFieldRevisionTestCase->testRevisions()
Undefined index: undNoticefile.test434FileFieldRevisionTestCase->testRevisions()
Undefined property: stdClass::$statusNoticefile.test200FileFieldTestCase->assertFileIsPermanent()
New revision file is permanent.Otherfile.test437FileFieldRevisionTestCase->testRevisions()
Undefined index: undNoticefile.test442FileFieldRevisionTestCase->testRevisions()
Undefined property: stdClass::$statusNoticefile.test200FileFieldTestCase->assertFileIsPermanent()
Original revision file still permanent after reverting to the original revision.Otherfile.test445FileFieldRevisionTestCase->testRevisions()
Undefined property: stdClass::$uriNoticefile.test165FileFieldTestCase->assertFileExists()
Second file is still available after deleting second revision, since it is being used by the third revision.Otherfile.test450FileFieldRevisionTestCase->testRevisions()
Undefined property: stdClass::$fidNoticefile.test173FileFieldTestCase->assertFileEntryExists()
array_flip(): Can only flip STRING and INTEGER values!Warningentity.inc167DrupalDefaultEntityController->load()
Trying to get property of non-objectNoticefile.test175FileFieldTestCase->assertFileEntryExists()
Undefined property: stdClass::$uriNoticefile.test175FileFieldTestCase->assertFileEntryExists()
Undefined property: stdClass::$statusNoticefile.test200FileFieldTestCase->assertFileIsPermanent()
Second file entry is still permanent after deleting second revision, since it is being used by the third revision.Otherfile.test452FileFieldRevisionTestCase->testRevisions()
Undefined index: fidNoticefile.field.inc252file_field_presave()
array_flip(): Can only flip STRING and INTEGER values!Warningentity.inc167DrupalDefaultEntityController->load()
Trying to get property of non-objectNoticefile.field.inc253file_field_presave()
Undefined property: stdClass::$uriNoticefile.inc535file_save()
Undefined index: fidNoticefile.field.inc294file_field_update()
Undefined index: fidNoticefile.field.inc315file_field_update()
Undefined property: stdClass::$fidNoticefile.inc609file_usage_add()
PDOException: SQLSTATE[23000]: Integrity constraint violation: 1048 Column 'fid' cannot be null: INSERT INTO {file_usage} (count, fid, module, type, id) VALUES (:db_insert_placeholder_0, :db_insert_placeholder_1, :db_insert_placeholder_2, :db_insert_placeholder_3, :db_insert_placeholder_4); Array ( [:db_insert_placeholder_0] => 1 [:db_insert_placeholder_1] => [:db_insert_placeholder_2] => file [:db_insert_placeholder_3] => user [:db_insert_placeholder_4] => 3 ) in file_usage_add() (line 616 of /var/lib/drupaltestbot/sites/default/files/checkout/includes/file.inc).Uncaught exceptiondatabase.inc1947PDOStatement->execute()
ExpandFile field validation tests (FileFieldValidateTestCase) [File]901254
MessageGroupFilenameLineFunctionStatus
array_flip(): Can only flip STRING and INTEGER values!Warningentity.inc167DrupalDefaultEntityController->load()
Trying to get property of non-objectNoticefile.test571FileFieldValidateTestCase->testRequired()
Undefined property: stdClass::$uriNoticefile.test165FileFieldTestCase->assertFileExists()
File exists after uploading to the required field.Otherfile.test572FileFieldValidateTestCase->testRequired()
Undefined property: stdClass::$fidNoticefile.test173FileFieldTestCase->assertFileEntryExists()
array_flip(): Can only flip STRING and INTEGER values!Warningentity.inc167DrupalDefaultEntityController->load()
Trying to get property of non-objectNoticefile.test175FileFieldTestCase->assertFileEntryExists()
Undefined property: stdClass::$uriNoticefile.test175FileFieldTestCase->assertFileEntryExists()
array_flip(): Can only flip STRING and INTEGER values!Warningentity.inc167DrupalDefaultEntityController->load()
Trying to get property of non-objectNoticefile.test587FileFieldValidateTestCase->testRequired()
Undefined property: stdClass::$uriNoticefile.test165FileFieldTestCase->assertFileExists()
File exists after uploading to the required multiple value field.Otherfile.test588FileFieldValidateTestCase->testRequired()
Undefined property: stdClass::$fidNoticefile.test173FileFieldTestCase->assertFileEntryExists()
array_flip(): Can only flip STRING and INTEGER values!Warningentity.inc167DrupalDefaultEntityController->load()
Trying to get property of non-objectNoticefile.test175FileFieldTestCase->assertFileEntryExists()
Undefined property: stdClass::$uriNoticefile.test175FileFieldTestCase->assertFileEntryExists()
array_flip(): Can only flip STRING and INTEGER values!Warningentity.inc167DrupalDefaultEntityController->load()
Trying to get property of non-objectNoticefile.test623FileFieldValidateTestCase->testFileMaxSize()
Undefined property: stdClass::$uriNoticefile.test165FileFieldTestCase->assertFileExists()
File exists after uploading a file (128 KB) under the max limit (1M).Otherfile.test624FileFieldValidateTestCase->testFileMaxSize()
Undefined property: stdClass::$fidNoticefile.test173FileFieldTestCase->assertFileEntryExists()
array_flip(): Can only flip STRING and INTEGER values!Warningentity.inc167DrupalDefaultEntityController->load()
Trying to get property of non-objectNoticefile.test175FileFieldTestCase->assertFileEntryExists()
Undefined property: stdClass::$uriNoticefile.test175FileFieldTestCase->assertFileEntryExists()
Node save failed when file (1.25 MB) exceeded the max upload size (1M).Otherfile.test630FileFieldValidateTestCase->testFileMaxSize()
array_flip(): Can only flip STRING and INTEGER values!Warningentity.inc167DrupalDefaultEntityController->load()
Trying to get property of non-objectNoticefile.test623FileFieldValidateTestCase->testFileMaxSize()
Undefined property: stdClass::$uriNoticefile.test165FileFieldTestCase->assertFileExists()
File exists after uploading a file (128 KB) under the max limit (1024K).Otherfile.test624FileFieldValidateTestCase->testFileMaxSize()
Undefined property: stdClass::$fidNoticefile.test173FileFieldTestCase->assertFileEntryExists()
array_flip(): Can only flip STRING and INTEGER values!Warningentity.inc167DrupalDefaultEntityController->load()
Trying to get property of non-objectNoticefile.test175FileFieldTestCase->assertFileEntryExists()
Undefined property: stdClass::$uriNoticefile.test175FileFieldTestCase->assertFileEntryExists()
Node save failed when file (1.25 MB) exceeded the max upload size (1024K).Otherfile.test630FileFieldValidateTestCase->testFileMaxSize()
array_flip(): Can only flip STRING and INTEGER values!Warningentity.inc167DrupalDefaultEntityController->load()
Trying to get property of non-objectNoticefile.test623FileFieldValidateTestCase->testFileMaxSize()
Undefined property: stdClass::$uriNoticefile.test165FileFieldTestCase->assertFileExists()
File exists after uploading a file (128 KB) under the max limit (1048576).Otherfile.test624FileFieldValidateTestCase->testFileMaxSize()
Undefined property: stdClass::$fidNoticefile.test173FileFieldTestCase->assertFileEntryExists()
array_flip(): Can only flip STRING and INTEGER values!Warningentity.inc167DrupalDefaultEntityController->load()
Trying to get property of non-objectNoticefile.test175FileFieldTestCase->assertFileEntryExists()
Undefined property: stdClass::$uriNoticefile.test175FileFieldTestCase->assertFileEntryExists()
Node save failed when file (1.25 MB) exceeded the max upload size (1048576).Otherfile.test630FileFieldValidateTestCase->testFileMaxSize()
array_flip(): Can only flip STRING and INTEGER values!Warningentity.inc167DrupalDefaultEntityController->load()
Trying to get property of non-objectNoticefile.test639FileFieldValidateTestCase->testFileMaxSize()
Undefined property: stdClass::$uriNoticefile.test165FileFieldTestCase->assertFileExists()
File exists after uploading a file (1.25 MB) with no max limit.Otherfile.test640FileFieldValidateTestCase->testFileMaxSize()
Undefined property: stdClass::$fidNoticefile.test173FileFieldTestCase->assertFileEntryExists()
array_flip(): Can only flip STRING and INTEGER values!Warningentity.inc167DrupalDefaultEntityController->load()
Trying to get property of non-objectNoticefile.test175FileFieldTestCase->assertFileEntryExists()
Undefined property: stdClass::$uriNoticefile.test175FileFieldTestCase->assertFileEntryExists()
Undefined index: undNoticefile.test666FileFieldValidateTestCase->testFileExtension()
Undefined property: stdClass::$uriNoticefile.test165FileFieldTestCase->assertFileExists()
File exists after uploading a file with no extension checking.Otherfile.test667FileFieldValidateTestCase->testFileExtension()
Undefined property: stdClass::$fidNoticefile.test173FileFieldTestCase->assertFileEntryExists()
array_flip(): Can only flip STRING and INTEGER values!Warningentity.inc167DrupalDefaultEntityController->load()
Trying to get property of non-objectNoticefile.test175FileFieldTestCase->assertFileEntryExists()
Undefined property: stdClass::$uriNoticefile.test175FileFieldTestCase->assertFileEntryExists()
Node save failed when file uploaded with the wrong extension.Otherfile.test676FileFieldValidateTestCase->testFileExtension()
Undefined index: undNoticefile.test684FileFieldValidateTestCase->testFileExtension()
Undefined property: stdClass::$uriNoticefile.test165FileFieldTestCase->assertFileExists()
File exists after uploading a file with extension checking.Otherfile.test685FileFieldValidateTestCase->testFileExtension()
Undefined property: stdClass::$fidNoticefile.test173FileFieldTestCase->assertFileEntryExists()
array_flip(): Can only flip STRING and INTEGER values!Warningentity.inc167DrupalDefaultEntityController->load()
Trying to get property of non-objectNoticefile.test175FileFieldTestCase->assertFileEntryExists()
Undefined property: stdClass::$uriNoticefile.test175FileFieldTestCase->assertFileEntryExists()
ExpandFile field widget test (FileFieldWidgetTestCase) [File]1031520
MessageGroupFilenameLineFunctionStatus
Undefined index: undNoticefile.test246FileFieldWidgetTestCase->testWidget()
Undefined property: stdClass::$uriNoticefile.test165FileFieldTestCase->assertFileExists()
New file saved to disk on node creation.Otherfile.test247FileFieldWidgetTestCase->testWidget()
Undefined property: stdClass::$uriNoticefile.test249FileFieldWidgetTestCase->testWidget()
Node with file does not display the "Upload" button.Otherfile.test254FileFieldWidgetTestCase->testWidget()
Node with file displays the "Remove" button.Otherfile.test255FileFieldWidgetTestCase->testWidget()
Found the Remove buttonOtherfile.test260FileFieldWidgetTestCase->testWidget()
Found the requested form fields at Otherfile.test260FileFieldWidgetTestCase->testWidget()
Undefined index: undNoticefile.test246FileFieldWidgetTestCase->testWidget()
Undefined property: stdClass::$uriNoticefile.test165FileFieldTestCase->assertFileExists()
New file saved to disk on node creation.Otherfile.test247FileFieldWidgetTestCase->testWidget()
Undefined property: stdClass::$uriNoticefile.test249FileFieldWidgetTestCase->testWidget()
Node with file does not display the "Upload" button.Otherfile.test254FileFieldWidgetTestCase->testWidget()
Node with file displays the "Remove" button.Otherfile.test255FileFieldWidgetTestCase->testWidget()
Undefined offset: 0Noticefile.test268FileFieldWidgetTestCase->testWidget()
Undefined offset: 0Noticefile.test269FileFieldWidgetTestCase->testWidget()
Undefined offset: 0Noticefile.test269FileFieldWidgetTestCase->testWidget()
Undefined index: Noticefile.test269FileFieldWidgetTestCase->testWidget()
Undefined index: Noticefile.test269FileFieldWidgetTestCase->testWidget()
Undefined index: #ajaxNoticeajax.inc279ajax_form_callback()
After clicking the "Remove" button, the "Upload" button is displayed.Otherfile.test275FileFieldWidgetTestCase->testWidget()
Found the Save buttonOtherfile.test278FileFieldWidgetTestCase->testWidget()
Found the requested form fields at Otherfile.test278FileFieldWidgetTestCase->testWidget()
Undefined index: undNoticefile.test290FileFieldWidgetTestCase->testWidget()
Undefined property: stdClass::$uriNoticefile.test165FileFieldTestCase->assertFileExists()
New file saved to disk on node creation.Otherfile.test291FileFieldWidgetTestCase->testWidget()
Undefined property: stdClass::$uriNoticefile.test293FileFieldWidgetTestCase->testWidget()
Upload destination setting disabled.Otherfile.test298FileFieldWidgetTestCase->testWidget()
Undefined index: undNoticefile.test352FileFieldWidgetTestCase->testPrivateFileComment()
Undefined property: stdClass::$uriNoticefile.test165FileFieldTestCase->assertFileExists()
New file saved to disk on node creation.Otherfile.test353FileFieldWidgetTestCase->testPrivateFileComment()
Undefined property: stdClass::$uriNoticefile.test355FileFieldWidgetTestCase->testPrivateFileComment()
Undefined property: stdClass::$uriNoticefile.test357FileFieldWidgetTestCase->testPrivateFileComment()
Undefined property: stdClass::$uriNoticefile.test362FileFieldWidgetTestCase->testPrivateFileComment()
Confirmed that access is denied for the file without the needed permission.Browserfile.test363FileFieldWidgetTestCase->testPrivateFileComment()
ExpandFile paths and directories (FileDirectoryTest) [File API]1620
MessageGroupFilenameLineFunctionStatus
Error reported for a non-writeable directory.Filefile.test901FileDirectoryTest->testFileCheckDirectoryHandling()
Expected directory permission to be 775, actually were 444.Otherfile.test908FileDirectoryTest->testFileCheckDirectoryHandling()
ExpandFile token replacement (FileTokenReplaceTestCase) [File]28752
MessageGroupFilenameLineFunctionStatus
Undefined index: undNoticefile.test807FileTokenReplaceTestCase->testFileTokenReplacement()
Undefined property: stdClass::$fidNoticefile.test812FileTokenReplaceTestCase->testFileTokenReplacement()
Undefined property: stdClass::$filenameNoticefile.test813FileTokenReplaceTestCase->testFileTokenReplacement()
Undefined property: stdClass::$uriNoticefile.test815FileTokenReplaceTestCase->testFileTokenReplacement()
Undefined property: stdClass::$filemimeNoticefile.test816FileTokenReplaceTestCase->testFileTokenReplacement()
Undefined property: stdClass::$filesizeNoticefile.test817FileTokenReplaceTestCase->testFileTokenReplacement()
Undefined property: stdClass::$uriNoticefile.test818FileTokenReplaceTestCase->testFileTokenReplacement()
Undefined property: stdClass::$timestampNoticefile.test819FileTokenReplaceTestCase->testFileTokenReplacement()
date_timezone_set() expects parameter 1 to be DateTime, boolean givenWarningcommon.inc1882format_date()
date_format() expects parameter 1 to be DateTime, boolean givenWarningcommon.inc1892format_date()
Undefined property: stdClass::$timestampNoticefile.test820FileTokenReplaceTestCase->testFileTokenReplacement()
date_timezone_set() expects parameter 1 to be DateTime, boolean givenWarningcommon.inc1882format_date()
date_format() expects parameter 1 to be DateTime, boolean givenWarningcommon.inc1892format_date()
Undefined property: stdClass::$uidNoticefile.test822FileTokenReplaceTestCase->testFileTokenReplacement()
No empty tokens generated.Otherfile.test825FileTokenReplaceTestCase->testFileTokenReplacement()
Undefined property: stdClass::$fidNoticesystem.tokens.inc224system_tokens()
Undefined property: stdClass::$filenameNoticesystem.tokens.inc229system_tokens()
Undefined property: stdClass::$uriNoticesystem.tokens.inc237system_tokens()
Undefined property: stdClass::$filemimeNoticesystem.tokens.inc241system_tokens()
Undefined property: stdClass::$filesizeNoticesystem.tokens.inc245system_tokens()
Undefined property: stdClass::$uriNoticesystem.tokens.inc249system_tokens()
Undefined property: stdClass::$timestampNoticesystem.tokens.inc254system_tokens()
date_timezone_set() expects parameter 1 to be DateTime, boolean givenWarningcommon.inc1882format_date()
date_format() expects parameter 1 to be DateTime, boolean givenWarningcommon.inc1892format_date()
Undefined property: stdClass::$timestampNoticesystem.tokens.inc265system_tokens()
Sanitized file token [file:timestamp:short] replaced.Otherfile.test829FileTokenReplaceTestCase->testFileTokenReplacement()
Undefined property: stdClass::$uidNoticesystem.tokens.inc258system_tokens()
array_flip(): Can only flip STRING and INTEGER values!Warningentity.inc167DrupalDefaultEntityController->load()
array_flip(): Can only flip STRING and INTEGER values!Warningentity.inc343DrupalDefaultEntityController->cacheGet()
Trying to get property of non-objectNoticesystem.tokens.inc259system_tokens()
Sanitized file token [file:owner] replaced.Otherfile.test829FileTokenReplaceTestCase->testFileTokenReplacement()
Undefined property: stdClass::$uidNoticesystem.tokens.inc268system_tokens()
array_flip(): Can only flip STRING and INTEGER values!Warningentity.inc167DrupalDefaultEntityController->load()
array_flip(): Can only flip STRING and INTEGER values!Warningentity.inc343DrupalDefaultEntityController->cacheGet()
Sanitized file token [file:owner:uid] replaced.Otherfile.test829FileTokenReplaceTestCase->testFileTokenReplacement()
Undefined property: stdClass::$filenameNoticefile.test833FileTokenReplaceTestCase->testFileTokenReplacement()
Undefined property: stdClass::$uriNoticefile.test835FileTokenReplaceTestCase->testFileTokenReplacement()
Undefined property: stdClass::$filemimeNoticefile.test836FileTokenReplaceTestCase->testFileTokenReplacement()
Undefined property: stdClass::$filesizeNoticefile.test837FileTokenReplaceTestCase->testFileTokenReplacement()
Undefined property: stdClass::$fidNoticesystem.tokens.inc224system_tokens()
Undefined property: stdClass::$filenameNoticesystem.tokens.inc229system_tokens()
Undefined property: stdClass::$uriNoticesystem.tokens.inc237system_tokens()
Undefined property: stdClass::$filemimeNoticesystem.tokens.inc241system_tokens()
Undefined property: stdClass::$filesizeNoticesystem.tokens.inc245system_tokens()
Undefined property: stdClass::$uriNoticesystem.tokens.inc249system_tokens()
Undefined property: stdClass::$timestampNoticesystem.tokens.inc254system_tokens()
date_timezone_set() expects parameter 1 to be DateTime, boolean givenWarningcommon.inc1882format_date()
date_format() expects parameter 1 to be DateTime, boolean givenWarningcommon.inc1892format_date()
Undefined property: stdClass::$timestampNoticesystem.tokens.inc265system_tokens()
Unsanitized file token [file:timestamp:short] replaced.Otherfile.test841FileTokenReplaceTestCase->testFileTokenReplacement()
Undefined property: stdClass::$uidNoticesystem.tokens.inc258system_tokens()
array_flip(): Can only flip STRING and INTEGER values!Warningentity.inc167DrupalDefaultEntityController->load()
array_flip(): Can only flip STRING and INTEGER values!Warningentity.inc343DrupalDefaultEntityController->cacheGet()
Trying to get property of non-objectNoticesystem.tokens.inc259system_tokens()
Unsanitized file token [file:owner] replaced.Otherfile.test841FileTokenReplaceTestCase->testFileTokenReplacement()
Undefined property: stdClass::$uidNoticesystem.tokens.inc268system_tokens()
array_flip(): Can only flip STRING and INTEGER values!Warningentity.inc167DrupalDefaultEntityController->load()
array_flip(): Can only flip STRING and INTEGER values!Warningentity.inc343DrupalDefaultEntityController->cacheGet()
Unsanitized file token [file:owner:uid] replaced.Otherfile.test841FileTokenReplaceTestCase->testFileTokenReplacement()
ExpandFile validator tests (FileValidatorTest) [File API]2705
MessageGroupFilenameLineFunctionStatus
copy(): Unable to find the wrapper "temp" - did you forget to enable it when you configured PHP?Warningfile.test431FileValidatorTest->testFileValidateImageResolution()
copy(): Unable to find the wrapper "temp" - did you forget to enable it when you configured PHP?Warningfile.test431FileValidatorTest->testFileValidateImageResolution()
copy(temp://druplicon.png): failed to open stream: No such file or directoryWarningfile.test431FileValidatorTest->testFileValidateImageResolution()
Undefined variable: temp_dirNoticefile.test432FileValidatorTest->testFileValidateImageResolution()
unlink(): No such file or directoryWarningfile.inc2032drupal_unlink()
ExpandImage field display tests (ImageFieldDisplayTestCase) [Image]1651
MessageGroupFilenameLineFunctionStatus
The test did not complete due to a fatal error.Completion checkimage.test625ImageFieldDisplayTestCase->testImageFieldFormatters()
The test did not complete due to a fatal error.Completion checkimage.test625ImageFieldDisplayTestCase->testImageFieldFormatters()
Undefined index: undNoticeimage.test635ImageFieldDisplayTestCase->testImageFieldFormatters()
Default formatter displaying correctly on full node view.Otherimage.test641ImageFieldDisplayTestCase->testImageFieldFormatters()
Image linked to file formatter displaying correctly on full node view.Otherimage.test650ImageFieldDisplayTestCase->testImageFieldFormatters()
Image linked to content formatter displaying correctly on full node view.Otherimage.test657ImageFieldDisplayTestCase->testImageFieldFormatters()
ExpandImage field validation tests (ImageFieldValidateTestCase) [Image]1620
MessageGroupFilenameLineFunctionStatus
Node save failed when minimum image resolution was not met.Otherimage.test828ImageFieldValidateTestCase->testResolution()
Image exceeding max resolution was properly resized.Otherimage.test830ImageFieldValidateTestCase->testResolution()
ExpandImage styles and effects UI configuration (ImageAdminStylesUnitTest) [Image]15011
MessageGroupFilenameLineFunctionStatus
The test did not complete due to a fatal error.Completion checkimage.test565ImageAdminStylesUnitTest->testStyleReplacement()
Undefined index: undNoticeimage.test585ImageAdminStylesUnitTest->testStyleReplacement()
ExpandSession tests (SessionTestCase) [Session]14510
MessageGroupFilenameLineFunctionStatus
Session data persists through browser close.Sessionsession.test99SessionTestCase->testDataPersistence()
ExpandTheme interface functionality (SystemThemeFunctionalTest) [System]10910
MessageGroupFilenameLineFunctionStatus
Logo path successfully changed.Othersystem.test1308SystemThemeFunctionalTest->testThemeSettings()

All

Test namePassFailException
Leaf403 functionality (AccessDeniedTestCase) [System]6900
Leaf404 functionality (PageNotFoundTestCase) [System]1800
LeafActions configuration (ActionsConfigurationTestCase) [Actions]3800
LeafActions executing in a potentially infinite loop (ActionLoopTestCase) [Actions]2100
LeafAdd feed functionality (AddFeedTestCase) [Aggregator]2800
LeafAdmin theme block admin accessibility (BlockAdminThemeTestCase) [Block]1800
LeafAdvanced search form (SearchAdvancedSearchForm) [Search]3100
LeafAJAX command form values (AJAXFormValuesTestCase) [AJAX]2800
LeafAJAX commands (AJAXCommandsTestCase) [AJAX]6300
LeafAJAX framework (AJAXFrameworkTestCase) [AJAX]800
LeafAJAX multi form (AJAXMultiFormTestCase) [AJAX]3500
LeafAnonymous comments (CommentAnonymous) [Comment]15600
LeafAutocompletion (ProfileTestAutocomplete) [Profile]5400
LeafBasic SQL syntax tests (DatabaseBasicSyntaxTestCase) [Database]2600
LeafBasic upgrade path (BasicUpgradePath) [Upgrade path]6900
LeafBatch percentages (BatchPercentagesUnitTestCase) [Batch API]1300
LeafBatch processing (BatchProcessingTestCase) [Batch API]14300
LeafBatch progress page (BatchPageTestCase) [Batch API]700
LeafBike shed (SearchBikeShed) [Search]1600
LeafBlock availability (BookBlockTestCase) [Book]1800
LeafBlock availability (NodeBlockTestCase) [Node]1800
LeafBlock availability (PollBlockTestCase) [Poll]10000
LeafBlock availability (ProfileBlockTestCase) [Profile]9000
LeafBlock availability (SearchBlockTestCase) [Search]5100
LeafBlock caching (BlockCacheTestCase) [Block]22800
LeafBlock functionality (BlockTestCase) [Block]26800
LeafBlock functionality (SystemBlockTestCase) [System]3400
LeafBlock HTML id (BlockHTMLIdTestCase) [Block]1500
LeafBlog functionality (BlogTestCase) [Blog]24100
LeafBook functionality (BookTestCase) [Book]26000
LeafBoot and exit hook invocation (HookBootExitTestCase) [Bootstrap]1800
LeafCache clear test (CacheClearCase) [Cache]1300
LeafCache emptiness test (CacheIsEmptyCase) [Cache]500
LeafCache saving test (CacheSavingCase) [Cache]500
LeafCancel account (UserCancelTestCase) [User]23700
LeafCascading stylesheets (CascadingStylesheetsTestCase) [System]3000
LeafCategorize feed functionality (CategorizeFeedTestCase) [Aggregator]1900
LeafCategorize feed item functionality (CategorizeFeedItemTestCase) [Aggregator]5300
LeafChecks display of aggregator items (AggregatorRenderingTestCase) [Aggregator]6800
LeafCJK tokenizer (SearchTokenizerTestCase) [Search]200
LeafColor functionality (ColorTestCase) [Color]6100
LeafComment approval (CommentApprovalTest) [Comment]15400
LeafComment blocks (CommentBlockFunctionalTest) [Comment]11500
LeafComment count toggle (SearchCommentCountToggleTestCase) [Search]3000
LeafComment interface (CommentInterfaceTest) [Comment]22300
LeafComment paging settings (CommentPagerTest) [Comment]20800
LeafComment preview (CommentPreviewTest) [Comment]7200
LeafComment Rebuild (CommentContentRebuild) [Comment]3200
LeafComment RSS (CommentRSSUnitTest) [Comment]2400
LeafComment Search tests (SearchCommentTestCase) [Search]13900
LeafComment token replacement (CommentTokenReplaceTestCase) [Comment]6400
LeafCompact mode (CompactModeTest) [System]2600
LeafConfig settings form (SearchConfigSettingsForm) [Search]11600
LeafConnection tests (DatabaseConnectionTestCase) [Database]3400
LeafContent language settings (LocaleContentFunctionalTest) [Locale]6400
LeafCore filters (FilterUnitTestCase) [Filter]13300
LeafCron run (CronRunTestCase) [System]4500
LeafCSS Unit Tests (CascadingStylesheetsUnitTest) [System]600
LeafCustom query syntax tests (DatabaseQueryTestCase) [Database]600
LeafDashboard access (DashboardAccessTestCase) [Dashboard]3400
LeafData API functions (DrupalDataApiTest) [System]3200
LeafDate and time (DateTimeFunctionalTest) [System]9600
LeafDBLog functionality (DBLogTestCase) [DBLog]44000
LeafDefault text format functionality (FilterDefaultFormatTestCase) [Filter]3300
LeafDelete/Truncate tests (DatabaseDeleteTruncateTestCase) [Database]2000
LeafDrupal error handlers (DrupalErrorHandlerUnitTest) [System]2800
LeafDrupal goto (DrupalGotoTest) [System]1800
LeafDrupal HTTP request (DrupalHTTPRequestTestCase) [System]2700
LeafDrupal match path (DrupalMatchPathTestCase) [Path API]4100
LeafDrupal render (DrupalRenderUnitTestCase) [System]700
LeafDrupal set/get regions (DrupalSetContentTestCase) [System]3800
LeafDrupal tags handling (DrupalTagsHandlingTestCase) [System]800
Leafdrupal_alter() tests (DrupalAlterTestCase) [System]500
LeafEmbedded forms (SearchEmbedForm) [Search]2900
LeafEmpty statement (DatabaseEmptyStatementTestCase) [Database]400
LeafEnable/disable modules (EnableDisableTestCase) [Module]5500
LeafEntity query (EntityFieldQueryTestCase) [Entity API]7300
LeafFeed parser functionality (FeedParserTestCase) [Aggregator]4000
LeafFetch tests (DatabaseFetchTestCase) [Database]3300
LeafFetch tests, part 2 (DatabaseFetch2TestCase) [Database]2600
LeafFetching multiple cache items (CacheGetMultipleUnitTest) [Cache]700
LeafField attach tests (other) (FieldAttachOtherTestCase) [Field API]4400
LeafField attach tests (storage-related) (FieldAttachStorageTestCase) [Field API]8300
LeafField bulk delete tests (FieldBulkDeleteTestCase) [Field API]4000
LeafField CRUD tests (FieldCrudTestCase) [Field API]5900
LeafField Display API tests (FieldDisplayAPITestCase) [Field API]4200
LeafField form tests (FieldFormTestCase) [Field API]16600
LeafField info tests (FieldInfoTestCase) [Field API]7900
LeafField instance CRUD tests (FieldInstanceCrudTestCase) [Field API]3200
LeafField SQL storage tests (FieldSqlStorageTestCase) [Field API]8300
LeafField translations tests (FieldTranslationsTestCase) [Field API]4800
LeafField UI tests (FieldUITestCase) [Field UI]15600
LeafFile copying (FileCopyTest) [File API]10600
LeafFile delete (FileDeleteTest) [File API]1800
LeafFile download (FileDownloadTest) [File API]3500
ExpandFile field display tests (FileFieldDisplayTestCase) [File]19112
MessageGroupFilenameLineFunctionStatus
Undefined index: undNoticefile.test521FileFieldDisplayTestCase->testNodeDisplay()
Undefined property: stdClass::$uriNoticefile.module706theme_file_link()
Undefined property: stdClass::$filemimeNoticefile.module744theme_file_icon()
Undefined property: stdClass::$filemimeNoticefile.module786file_icon_path()
Undefined property: stdClass::$filemimeNoticefile.module828file_icon_map()
Undefined property: stdClass::$filemimeNoticefile.module801file_icon_path()
Undefined property: stdClass::$filemimeNoticefile.module801file_icon_path()
Undefined property: stdClass::$filemimeNoticefile.module801file_icon_path()
Undefined property: stdClass::$filemimeNoticefile.module801file_icon_path()
Undefined property: stdClass::$filemimeNoticefile.module713theme_file_link()
Undefined property: stdClass::$filesizeNoticefile.module713theme_file_link()
Undefined property: stdClass::$filenameNoticefile.module719theme_file_link()
Default formatter displaying correctly on full node view.Otherfile.test523FileFieldDisplayTestCase->testNodeDisplay()
ExpandFile field file path tests (FileFieldPathTestCase) [File]2039
MessageGroupFilenameLineFunctionStatus
Undefined index: undNoticefile.test719FileFieldPathTestCase->testUploadPath()
Undefined property: stdClass::$uriNoticefile.test720FileFieldPathTestCase->testUploadPath()
Undefined property: stdClass::$uriNoticefile.test720FileFieldPathTestCase->testUploadPath()
The file was uploaded to the correct path.Otherfile.test720FileFieldPathTestCase->testUploadPath()
Undefined index: undNoticefile.test730FileFieldPathTestCase->testUploadPath()
Undefined property: stdClass::$uriNoticefile.test731FileFieldPathTestCase->testUploadPath()
Undefined property: stdClass::$uriNoticefile.test731FileFieldPathTestCase->testUploadPath()
The file was uploaded to the correct path.Otherfile.test731FileFieldPathTestCase->testUploadPath()
Undefined index: undNoticefile.test742FileFieldPathTestCase->testUploadPath()
Undefined property: stdClass::$uriNoticefile.test745FileFieldPathTestCase->testUploadPath()
Undefined property: stdClass::$uriNoticefile.test745FileFieldPathTestCase->testUploadPath()
The file was uploaded to the correct path with token replacements.Otherfile.test745FileFieldPathTestCase->testUploadPath()
ExpandFile field revision test (FileFieldRevisionTestCase) [File]381239
MessageGroupFilenameLineFunctionStatus
Undefined index: undNoticefile.test408FileFieldRevisionTestCase->testRevisions()
Undefined property: stdClass::$uriNoticefile.test165FileFieldTestCase->assertFileExists()
New file saved to disk on node creation.Otherfile.test410FileFieldRevisionTestCase->testRevisions()
Undefined property: stdClass::$fidNoticefile.test173FileFieldTestCase->assertFileEntryExists()
array_flip(): Can only flip STRING and INTEGER values!Warningentity.inc167DrupalDefaultEntityController->load()
Trying to get property of non-objectNoticefile.test175FileFieldTestCase->assertFileEntryExists()
Undefined property: stdClass::$uriNoticefile.test175FileFieldTestCase->assertFileEntryExists()
Undefined property: stdClass::$statusNoticefile.test200FileFieldTestCase->assertFileIsPermanent()
File is permanent.Otherfile.test412FileFieldRevisionTestCase->testRevisions()
Found the Remove buttonOtherfile.test156FileFieldTestCase->replaceNodeFile()
Found the requested form fields at node/1/editOtherfile.test156FileFieldTestCase->replaceNodeFile()
Undefined index: undNoticefile.test417FileFieldRevisionTestCase->testRevisions()
Undefined property: stdClass::$uriNoticefile.test165FileFieldTestCase->assertFileExists()
Replacement file exists on disk after creating new revision.Otherfile.test419FileFieldRevisionTestCase->testRevisions()
Undefined property: stdClass::$fidNoticefile.test173FileFieldTestCase->assertFileEntryExists()
array_flip(): Can only flip STRING and INTEGER values!Warningentity.inc167DrupalDefaultEntityController->load()
Trying to get property of non-objectNoticefile.test175FileFieldTestCase->assertFileEntryExists()
Undefined property: stdClass::$uriNoticefile.test175FileFieldTestCase->assertFileEntryExists()
Undefined property: stdClass::$statusNoticefile.test200FileFieldTestCase->assertFileIsPermanent()
Replacement file is permanent.Otherfile.test421FileFieldRevisionTestCase->testRevisions()
Undefined index: undNoticefile.test425FileFieldRevisionTestCase->testRevisions()
Undefined property: stdClass::$uriNoticefile.test165FileFieldTestCase->assertFileExists()
Original file still in place after replacing file in new revision.Otherfile.test426FileFieldRevisionTestCase->testRevisions()
Undefined property: stdClass::$fidNoticefile.test173FileFieldTestCase->assertFileEntryExists()
array_flip(): Can only flip STRING and INTEGER values!Warningentity.inc167DrupalDefaultEntityController->load()
Trying to get property of non-objectNoticefile.test175FileFieldTestCase->assertFileEntryExists()
Undefined property: stdClass::$uriNoticefile.test175FileFieldTestCase->assertFileEntryExists()
Undefined property: stdClass::$statusNoticefile.test200FileFieldTestCase->assertFileIsPermanent()
Original file is still permanent.Otherfile.test428FileFieldRevisionTestCase->testRevisions()
Undefined index: undNoticefile.test434FileFieldRevisionTestCase->testRevisions()
Undefined property: stdClass::$statusNoticefile.test200FileFieldTestCase->assertFileIsPermanent()
New revision file is permanent.Otherfile.test437FileFieldRevisionTestCase->testRevisions()
Undefined index: undNoticefile.test442FileFieldRevisionTestCase->testRevisions()
Undefined property: stdClass::$statusNoticefile.test200FileFieldTestCase->assertFileIsPermanent()
Original revision file still permanent after reverting to the original revision.Otherfile.test445FileFieldRevisionTestCase->testRevisions()
Undefined property: stdClass::$uriNoticefile.test165FileFieldTestCase->assertFileExists()
Second file is still available after deleting second revision, since it is being used by the third revision.Otherfile.test450FileFieldRevisionTestCase->testRevisions()
Undefined property: stdClass::$fidNoticefile.test173FileFieldTestCase->assertFileEntryExists()
array_flip(): Can only flip STRING and INTEGER values!Warningentity.inc167DrupalDefaultEntityController->load()
Trying to get property of non-objectNoticefile.test175FileFieldTestCase->assertFileEntryExists()
Undefined property: stdClass::$uriNoticefile.test175FileFieldTestCase->assertFileEntryExists()
Undefined property: stdClass::$statusNoticefile.test200FileFieldTestCase->assertFileIsPermanent()
Second file entry is still permanent after deleting second revision, since it is being used by the third revision.Otherfile.test452FileFieldRevisionTestCase->testRevisions()
Undefined index: fidNoticefile.field.inc252file_field_presave()
array_flip(): Can only flip STRING and INTEGER values!Warningentity.inc167DrupalDefaultEntityController->load()
Trying to get property of non-objectNoticefile.field.inc253file_field_presave()
Undefined property: stdClass::$uriNoticefile.inc535file_save()
Undefined index: fidNoticefile.field.inc294file_field_update()
Undefined index: fidNoticefile.field.inc315file_field_update()
Undefined property: stdClass::$fidNoticefile.inc609file_usage_add()
PDOException: SQLSTATE[23000]: Integrity constraint violation: 1048 Column 'fid' cannot be null: INSERT INTO {file_usage} (count, fid, module, type, id) VALUES (:db_insert_placeholder_0, :db_insert_placeholder_1, :db_insert_placeholder_2, :db_insert_placeholder_3, :db_insert_placeholder_4); Array ( [:db_insert_placeholder_0] => 1 [:db_insert_placeholder_1] => [:db_insert_placeholder_2] => file [:db_insert_placeholder_3] => user [:db_insert_placeholder_4] => 3 ) in file_usage_add() (line 616 of /var/lib/drupaltestbot/sites/default/files/checkout/includes/file.inc).Uncaught exceptiondatabase.inc1947PDOStatement->execute()
ExpandFile field validation tests (FileFieldValidateTestCase) [File]901254
MessageGroupFilenameLineFunctionStatus
array_flip(): Can only flip STRING and INTEGER values!Warningentity.inc167DrupalDefaultEntityController->load()
Trying to get property of non-objectNoticefile.test571FileFieldValidateTestCase->testRequired()
Undefined property: stdClass::$uriNoticefile.test165FileFieldTestCase->assertFileExists()
File exists after uploading to the required field.Otherfile.test572FileFieldValidateTestCase->testRequired()
Undefined property: stdClass::$fidNoticefile.test173FileFieldTestCase->assertFileEntryExists()
array_flip(): Can only flip STRING and INTEGER values!Warningentity.inc167DrupalDefaultEntityController->load()
Trying to get property of non-objectNoticefile.test175FileFieldTestCase->assertFileEntryExists()
Undefined property: stdClass::$uriNoticefile.test175FileFieldTestCase->assertFileEntryExists()
array_flip(): Can only flip STRING and INTEGER values!Warningentity.inc167DrupalDefaultEntityController->load()
Trying to get property of non-objectNoticefile.test587FileFieldValidateTestCase->testRequired()
Undefined property: stdClass::$uriNoticefile.test165FileFieldTestCase->assertFileExists()
File exists after uploading to the required multiple value field.Otherfile.test588FileFieldValidateTestCase->testRequired()
Undefined property: stdClass::$fidNoticefile.test173FileFieldTestCase->assertFileEntryExists()
array_flip(): Can only flip STRING and INTEGER values!Warningentity.inc167DrupalDefaultEntityController->load()
Trying to get property of non-objectNoticefile.test175FileFieldTestCase->assertFileEntryExists()
Undefined property: stdClass::$uriNoticefile.test175FileFieldTestCase->assertFileEntryExists()
array_flip(): Can only flip STRING and INTEGER values!Warningentity.inc167DrupalDefaultEntityController->load()
Trying to get property of non-objectNoticefile.test623FileFieldValidateTestCase->testFileMaxSize()
Undefined property: stdClass::$uriNoticefile.test165FileFieldTestCase->assertFileExists()
File exists after uploading a file (128 KB) under the max limit (1M).Otherfile.test624FileFieldValidateTestCase->testFileMaxSize()
Undefined property: stdClass::$fidNoticefile.test173FileFieldTestCase->assertFileEntryExists()
array_flip(): Can only flip STRING and INTEGER values!Warningentity.inc167DrupalDefaultEntityController->load()
Trying to get property of non-objectNoticefile.test175FileFieldTestCase->assertFileEntryExists()
Undefined property: stdClass::$uriNoticefile.test175FileFieldTestCase->assertFileEntryExists()
Node save failed when file (1.25 MB) exceeded the max upload size (1M).Otherfile.test630FileFieldValidateTestCase->testFileMaxSize()
array_flip(): Can only flip STRING and INTEGER values!Warningentity.inc167DrupalDefaultEntityController->load()
Trying to get property of non-objectNoticefile.test623FileFieldValidateTestCase->testFileMaxSize()
Undefined property: stdClass::$uriNoticefile.test165FileFieldTestCase->assertFileExists()
File exists after uploading a file (128 KB) under the max limit (1024K).Otherfile.test624FileFieldValidateTestCase->testFileMaxSize()
Undefined property: stdClass::$fidNoticefile.test173FileFieldTestCase->assertFileEntryExists()
array_flip(): Can only flip STRING and INTEGER values!Warningentity.inc167DrupalDefaultEntityController->load()
Trying to get property of non-objectNoticefile.test175FileFieldTestCase->assertFileEntryExists()
Undefined property: stdClass::$uriNoticefile.test175FileFieldTestCase->assertFileEntryExists()
Node save failed when file (1.25 MB) exceeded the max upload size (1024K).Otherfile.test630FileFieldValidateTestCase->testFileMaxSize()
array_flip(): Can only flip STRING and INTEGER values!Warningentity.inc167DrupalDefaultEntityController->load()
Trying to get property of non-objectNoticefile.test623FileFieldValidateTestCase->testFileMaxSize()
Undefined property: stdClass::$uriNoticefile.test165FileFieldTestCase->assertFileExists()
File exists after uploading a file (128 KB) under the max limit (1048576).Otherfile.test624FileFieldValidateTestCase->testFileMaxSize()
Undefined property: stdClass::$fidNoticefile.test173FileFieldTestCase->assertFileEntryExists()
array_flip(): Can only flip STRING and INTEGER values!Warningentity.inc167DrupalDefaultEntityController->load()
Trying to get property of non-objectNoticefile.test175FileFieldTestCase->assertFileEntryExists()
Undefined property: stdClass::$uriNoticefile.test175FileFieldTestCase->assertFileEntryExists()
Node save failed when file (1.25 MB) exceeded the max upload size (1048576).Otherfile.test630FileFieldValidateTestCase->testFileMaxSize()
array_flip(): Can only flip STRING and INTEGER values!Warningentity.inc167DrupalDefaultEntityController->load()
Trying to get property of non-objectNoticefile.test639FileFieldValidateTestCase->testFileMaxSize()
Undefined property: stdClass::$uriNoticefile.test165FileFieldTestCase->assertFileExists()
File exists after uploading a file (1.25 MB) with no max limit.Otherfile.test640FileFieldValidateTestCase->testFileMaxSize()
Undefined property: stdClass::$fidNoticefile.test173FileFieldTestCase->assertFileEntryExists()
array_flip(): Can only flip STRING and INTEGER values!Warningentity.inc167DrupalDefaultEntityController->load()
Trying to get property of non-objectNoticefile.test175FileFieldTestCase->assertFileEntryExists()
Undefined property: stdClass::$uriNoticefile.test175FileFieldTestCase->assertFileEntryExists()
Undefined index: undNoticefile.test666FileFieldValidateTestCase->testFileExtension()
Undefined property: stdClass::$uriNoticefile.test165FileFieldTestCase->assertFileExists()
File exists after uploading a file with no extension checking.Otherfile.test667FileFieldValidateTestCase->testFileExtension()
Undefined property: stdClass::$fidNoticefile.test173FileFieldTestCase->assertFileEntryExists()
array_flip(): Can only flip STRING and INTEGER values!Warningentity.inc167DrupalDefaultEntityController->load()
Trying to get property of non-objectNoticefile.test175FileFieldTestCase->assertFileEntryExists()
Undefined property: stdClass::$uriNoticefile.test175FileFieldTestCase->assertFileEntryExists()
Node save failed when file uploaded with the wrong extension.Otherfile.test676FileFieldValidateTestCase->testFileExtension()
Undefined index: undNoticefile.test684FileFieldValidateTestCase->testFileExtension()
Undefined property: stdClass::$uriNoticefile.test165FileFieldTestCase->assertFileExists()
File exists after uploading a file with extension checking.Otherfile.test685FileFieldValidateTestCase->testFileExtension()
Undefined property: stdClass::$fidNoticefile.test173FileFieldTestCase->assertFileEntryExists()
array_flip(): Can only flip STRING and INTEGER values!Warningentity.inc167DrupalDefaultEntityController->load()
Trying to get property of non-objectNoticefile.test175FileFieldTestCase->assertFileEntryExists()
Undefined property: stdClass::$uriNoticefile.test175FileFieldTestCase->assertFileEntryExists()
ExpandFile field widget test (FileFieldWidgetTestCase) [File]1031520
MessageGroupFilenameLineFunctionStatus
Undefined index: undNoticefile.test246FileFieldWidgetTestCase->testWidget()
Undefined property: stdClass::$uriNoticefile.test165FileFieldTestCase->assertFileExists()
New file saved to disk on node creation.Otherfile.test247FileFieldWidgetTestCase->testWidget()
Undefined property: stdClass::$uriNoticefile.test249FileFieldWidgetTestCase->testWidget()
Node with file does not display the "Upload" button.Otherfile.test254FileFieldWidgetTestCase->testWidget()
Node with file displays the "Remove" button.Otherfile.test255FileFieldWidgetTestCase->testWidget()
Found the Remove buttonOtherfile.test260FileFieldWidgetTestCase->testWidget()
Found the requested form fields at Otherfile.test260FileFieldWidgetTestCase->testWidget()
Undefined index: undNoticefile.test246FileFieldWidgetTestCase->testWidget()
Undefined property: stdClass::$uriNoticefile.test165FileFieldTestCase->assertFileExists()
New file saved to disk on node creation.Otherfile.test247FileFieldWidgetTestCase->testWidget()
Undefined property: stdClass::$uriNoticefile.test249FileFieldWidgetTestCase->testWidget()
Node with file does not display the "Upload" button.Otherfile.test254FileFieldWidgetTestCase->testWidget()
Node with file displays the "Remove" button.Otherfile.test255FileFieldWidgetTestCase->testWidget()
Undefined offset: 0Noticefile.test268FileFieldWidgetTestCase->testWidget()
Undefined offset: 0Noticefile.test269FileFieldWidgetTestCase->testWidget()
Undefined offset: 0Noticefile.test269FileFieldWidgetTestCase->testWidget()
Undefined index: Noticefile.test269FileFieldWidgetTestCase->testWidget()
Undefined index: Noticefile.test269FileFieldWidgetTestCase->testWidget()
Undefined index: #ajaxNoticeajax.inc279ajax_form_callback()
After clicking the "Remove" button, the "Upload" button is displayed.Otherfile.test275FileFieldWidgetTestCase->testWidget()
Found the Save buttonOtherfile.test278FileFieldWidgetTestCase->testWidget()
Found the requested form fields at Otherfile.test278FileFieldWidgetTestCase->testWidget()
Undefined index: undNoticefile.test290FileFieldWidgetTestCase->testWidget()
Undefined property: stdClass::$uriNoticefile.test165FileFieldTestCase->assertFileExists()
New file saved to disk on node creation.Otherfile.test291FileFieldWidgetTestCase->testWidget()
Undefined property: stdClass::$uriNoticefile.test293FileFieldWidgetTestCase->testWidget()
Upload destination setting disabled.Otherfile.test298FileFieldWidgetTestCase->testWidget()
Undefined index: undNoticefile.test352FileFieldWidgetTestCase->testPrivateFileComment()
Undefined property: stdClass::$uriNoticefile.test165FileFieldTestCase->assertFileExists()
New file saved to disk on node creation.Otherfile.test353FileFieldWidgetTestCase->testPrivateFileComment()
Undefined property: stdClass::$uriNoticefile.test355FileFieldWidgetTestCase->testPrivateFileComment()
Undefined property: stdClass::$uriNoticefile.test357FileFieldWidgetTestCase->testPrivateFileComment()
Undefined property: stdClass::$uriNoticefile.test362FileFieldWidgetTestCase->testPrivateFileComment()
Confirmed that access is denied for the file without the needed permission.Browserfile.test363FileFieldWidgetTestCase->testPrivateFileComment()
LeafFile loading (FileLoadTest) [File API]2900
LeafFile mimetypes (FileMimeTypeTest) [File API]3800
LeafFile moving (FileMoveTest) [File API]10500
LeafFile naming (FileNameMungingTest) [File API]400
ExpandFile paths and directories (FileDirectoryTest) [File API]1620
MessageGroupFilenameLineFunctionStatus
Error reported for a non-writeable directory.Filefile.test901FileDirectoryTest->testFileCheckDirectoryHandling()
Expected directory permission to be 775, actually were 444.Otherfile.test908FileDirectoryTest->testFileCheckDirectoryHandling()
LeafFile save data (FileSaveDataTest) [File API]8800
LeafFile saving (FileSaveTest) [File API]1400
LeafFile scan directory (FileScanDirectoryTest) [File API]2300
LeafFile space used tests (FileSpaceUsedTest) [File API]1100
ExpandFile token replacement (FileTokenReplaceTestCase) [File]28752
MessageGroupFilenameLineFunctionStatus
Undefined index: undNoticefile.test807FileTokenReplaceTestCase->testFileTokenReplacement()
Undefined property: stdClass::$fidNoticefile.test812FileTokenReplaceTestCase->testFileTokenReplacement()
Undefined property: stdClass::$filenameNoticefile.test813FileTokenReplaceTestCase->testFileTokenReplacement()
Undefined property: stdClass::$uriNoticefile.test815FileTokenReplaceTestCase->testFileTokenReplacement()
Undefined property: stdClass::$filemimeNoticefile.test816FileTokenReplaceTestCase->testFileTokenReplacement()
Undefined property: stdClass::$filesizeNoticefile.test817FileTokenReplaceTestCase->testFileTokenReplacement()
Undefined property: stdClass::$uriNoticefile.test818FileTokenReplaceTestCase->testFileTokenReplacement()
Undefined property: stdClass::$timestampNoticefile.test819FileTokenReplaceTestCase->testFileTokenReplacement()
date_timezone_set() expects parameter 1 to be DateTime, boolean givenWarningcommon.inc1882format_date()
date_format() expects parameter 1 to be DateTime, boolean givenWarningcommon.inc1892format_date()
Undefined property: stdClass::$timestampNoticefile.test820FileTokenReplaceTestCase->testFileTokenReplacement()
date_timezone_set() expects parameter 1 to be DateTime, boolean givenWarningcommon.inc1882format_date()
date_format() expects parameter 1 to be DateTime, boolean givenWarningcommon.inc1892format_date()
Undefined property: stdClass::$uidNoticefile.test822FileTokenReplaceTestCase->testFileTokenReplacement()
No empty tokens generated.Otherfile.test825FileTokenReplaceTestCase->testFileTokenReplacement()
Undefined property: stdClass::$fidNoticesystem.tokens.inc224system_tokens()
Undefined property: stdClass::$filenameNoticesystem.tokens.inc229system_tokens()
Undefined property: stdClass::$uriNoticesystem.tokens.inc237system_tokens()
Undefined property: stdClass::$filemimeNoticesystem.tokens.inc241system_tokens()
Undefined property: stdClass::$filesizeNoticesystem.tokens.inc245system_tokens()
Undefined property: stdClass::$uriNoticesystem.tokens.inc249system_tokens()
Undefined property: stdClass::$timestampNoticesystem.tokens.inc254system_tokens()
date_timezone_set() expects parameter 1 to be DateTime, boolean givenWarningcommon.inc1882format_date()
date_format() expects parameter 1 to be DateTime, boolean givenWarningcommon.inc1892format_date()
Undefined property: stdClass::$timestampNoticesystem.tokens.inc265system_tokens()
Sanitized file token [file:timestamp:short] replaced.Otherfile.test829FileTokenReplaceTestCase->testFileTokenReplacement()
Undefined property: stdClass::$uidNoticesystem.tokens.inc258system_tokens()
array_flip(): Can only flip STRING and INTEGER values!Warningentity.inc167DrupalDefaultEntityController->load()
array_flip(): Can only flip STRING and INTEGER values!Warningentity.inc343DrupalDefaultEntityController->cacheGet()
Trying to get property of non-objectNoticesystem.tokens.inc259system_tokens()
Sanitized file token [file:owner] replaced.Otherfile.test829FileTokenReplaceTestCase->testFileTokenReplacement()
Undefined property: stdClass::$uidNoticesystem.tokens.inc268system_tokens()
array_flip(): Can only flip STRING and INTEGER values!Warningentity.inc167DrupalDefaultEntityController->load()
array_flip(): Can only flip STRING and INTEGER values!Warningentity.inc343DrupalDefaultEntityController->cacheGet()
Sanitized file token [file:owner:uid] replaced.Otherfile.test829FileTokenReplaceTestCase->testFileTokenReplacement()
Undefined property: stdClass::$filenameNoticefile.test833FileTokenReplaceTestCase->testFileTokenReplacement()
Undefined property: stdClass::$uriNoticefile.test835FileTokenReplaceTestCase->testFileTokenReplacement()
Undefined property: stdClass::$filemimeNoticefile.test836FileTokenReplaceTestCase->testFileTokenReplacement()
Undefined property: stdClass::$filesizeNoticefile.test837FileTokenReplaceTestCase->testFileTokenReplacement()
Undefined property: stdClass::$fidNoticesystem.tokens.inc224system_tokens()
Undefined property: stdClass::$filenameNoticesystem.tokens.inc229system_tokens()
Undefined property: stdClass::$uriNoticesystem.tokens.inc237system_tokens()
Undefined property: stdClass::$filemimeNoticesystem.tokens.inc241system_tokens()
Undefined property: stdClass::$filesizeNoticesystem.tokens.inc245system_tokens()
Undefined property: stdClass::$uriNoticesystem.tokens.inc249system_tokens()
Undefined property: stdClass::$timestampNoticesystem.tokens.inc254system_tokens()
date_timezone_set() expects parameter 1 to be DateTime, boolean givenWarningcommon.inc1882format_date()
date_format() expects parameter 1 to be DateTime, boolean givenWarningcommon.inc1892format_date()
Undefined property: stdClass::$timestampNoticesystem.tokens.inc265system_tokens()
Unsanitized file token [file:timestamp:short] replaced.Otherfile.test841FileTokenReplaceTestCase->testFileTokenReplacement()
Undefined property: stdClass::$uidNoticesystem.tokens.inc258system_tokens()
array_flip(): Can only flip STRING and INTEGER values!Warningentity.inc167DrupalDefaultEntityController->load()
array_flip(): Can only flip STRING and INTEGER values!Warningentity.inc343DrupalDefaultEntityController->cacheGet()
Trying to get property of non-objectNoticesystem.tokens.inc259system_tokens()
Unsanitized file token [file:owner] replaced.Otherfile.test841FileTokenReplaceTestCase->testFileTokenReplacement()
Undefined property: stdClass::$uidNoticesystem.tokens.inc268system_tokens()
array_flip(): Can only flip STRING and INTEGER values!Warningentity.inc167DrupalDefaultEntityController->load()
array_flip(): Can only flip STRING and INTEGER values!Warningentity.inc343DrupalDefaultEntityController->cacheGet()
Unsanitized file token [file:owner:uid] replaced.Otherfile.test841FileTokenReplaceTestCase->testFileTokenReplacement()
LeafFile uploading (FileSaveUploadTest) [File API]26300
LeafFile URL rewriting (FileURLRewritingTest) [File]1500
LeafFile usage (FileUsageTest) [File]2000
LeafFile validate (FileValidateTest) [File API]1100
ExpandFile validator tests (FileValidatorTest) [File API]2705
MessageGroupFilenameLineFunctionStatus
copy(): Unable to find the wrapper "temp" - did you forget to enable it when you configured PHP?Warningfile.test431FileValidatorTest->testFileValidateImageResolution()
copy(): Unable to find the wrapper "temp" - did you forget to enable it when you configured PHP?Warningfile.test431FileValidatorTest->testFileValidateImageResolution()
copy(temp://druplicon.png): failed to open stream: No such file or directoryWarningfile.test431FileValidatorTest->testFileValidateImageResolution()
Undefined variable: temp_dirNoticefile.test432FileValidatorTest->testFileValidateImageResolution()
unlink(): No such file or directoryWarningfile.inc2032drupal_unlink()
LeafFileTransfer unit tests (FileTranferTest) [System]200
LeafFilter administration functionality (FilterAdminTestCase) [Filter]14500
LeafFilter CRUD operations (FilterCRUDTestCase) [Filter]21500
LeafFilter format access (FilterFormatAccessTestCase) [Filter]13400
LeafFilter format hooks (FilterHooksTestCase) [Filter]3300
LeafFingerprinting meta tag (AdminMetaTagTestCase) [System]300
LeafFlood control mechanism (FloodFunctionalTest) [System]600
LeafForm alter hooks (FormAlterTestCase) [Form API]300
LeafForm API file inclusion (FormsFileInclusionTestCase) [Form API]900
LeafForm element and label output test (FormsElementsLabelsTestCase) [Form API]1500
LeafForm element validation (FormsTestCase) [Form API]23600
LeafForm rebuilding (FormsRebuildTestCase) [Form API]4900
LeafForm state values clearance (FormStateValuesCleanTestCase) [Form API]1300
LeafForm triggering element determination (FormsTriggeringElementTestCase) [Form API]5400
LeafForm validation handlers (FormValidationTestCase) [Form API]5200
LeafForm wrapper callback (FormsFormWrapperTestCase) [Form API]400
LeafFormat date (FormatDateUnitTest) [System]4300
LeafForum functionality (ForumTestCase) [Forum]77000
LeafFront page (FrontPageTestCase) [System]3600
LeafGet filename test (BootstrapGetFilenameTestCase) [Bootstrap]400
LeafGraph (GraphUnitTest) [System]2800
LeafHelp functionality (HelpTestCase) [Help]52600
LeafHTML Attributes (DrupalAttributesUnitTest) [System]600
LeafHTML identifiers (DrupalHTMLIdentifierTestCase) [System]1000
LeafHTML in page titles (PageTitleFiltering) [System]4000
LeafHTTP file retrieval (RetrieveFileTestCase) [System]700
LeafImage effects (ImageEffectsUnitTest) [Image]3300
ExpandImage field display tests (ImageFieldDisplayTestCase) [Image]1651
MessageGroupFilenameLineFunctionStatus
The test did not complete due to a fatal error.Completion checkimage.test625ImageFieldDisplayTestCase->testImageFieldFormatters()
The test did not complete due to a fatal error.Completion checkimage.test625ImageFieldDisplayTestCase->testImageFieldFormatters()
Undefined index: undNoticeimage.test635ImageFieldDisplayTestCase->testImageFieldFormatters()
Default formatter displaying correctly on full node view.Otherimage.test641ImageFieldDisplayTestCase->testImageFieldFormatters()
Image linked to file formatter displaying correctly on full node view.Otherimage.test650ImageFieldDisplayTestCase->testImageFieldFormatters()
Image linked to content formatter displaying correctly on full node view.Otherimage.test657ImageFieldDisplayTestCase->testImageFieldFormatters()
ExpandImage field validation tests (ImageFieldValidateTestCase) [Image]1620
MessageGroupFilenameLineFunctionStatus
Node save failed when minimum image resolution was not met.Otherimage.test828ImageFieldValidateTestCase->testResolution()
Image exceeding max resolution was properly resized.Otherimage.test830ImageFieldValidateTestCase->testResolution()
LeafImage GD manipulation tests (ImageToolkitGdTestCase) [Image]100
ExpandImage styles and effects UI configuration (ImageAdminStylesUnitTest) [Image]15011
MessageGroupFilenameLineFunctionStatus
The test did not complete due to a fatal error.Completion checkimage.test565ImageAdminStylesUnitTest->testStyleReplacement()
Undefined index: undNoticeimage.test585ImageAdminStylesUnitTest->testStyleReplacement()
LeafImage styles path and URL functions (ImageStylesPathAndUrlUnitTest) [Image]2100
LeafImage toolkit tests (ImageToolkitUnitTest) [Image]4400
LeafImport feeds from OPML functionality (ImportOPMLTestCase) [Aggregator]5300
LeafInfo file format parser (InfoFileParserTestCase) [System]900
LeafInsert tests (DatabaseInsertTestCase) [Database]4500
LeafInsert tests, default fields (DatabaseInsertDefaultsTestCase) [Database]1900
LeafInsert tests, LOB fields (DatabaseInsertLOBTestCase) [Database]1300
LeafInvalid data (DatabaseInvalidDataTestCase) [Database]700
LeafIP address and HTTP_HOST test (BootstrapIPAddressTestCase) [Bootstrap]1100
LeafIP address blocking (IPAddressBlockingTestCase) [System]4200
LeafJavaScript (JavaScriptTestCase) [System]4000
LeafJSON (DrupalJSONTest) [System]1400
LeafKeywords and conditions (SearchKeywordsConditions) [Search]2500
LeafLanguage configuration (LocaleConfigurationTest) [Locale]7800
LeafLanguage switching (LocaleLanguageSwitchingFunctionalTest) [Locale]2100
LeafList field (ListFieldTestCase) [Field types]1400
LeafList field UI (ListFieldUITestCase) [Field types]2400
LeafLoad multiple nodes (NodeLoadMultipleUnitTest) [Node]3600
LeafLocale uninstall (EN) (LocaleUninstallFunctionalTest) [Locale]3100
LeafLocale uninstall (FR) (LocaleUninstallFrenchFunctionalTest) [Locale]3100
LeafLocalize date formats (LocaleDateFormatsFunctionalTest) [Locale]3500
LeafLocking framework tests (LockFunctionalTest) [System]1700
LeafMail system (MailTestCase) [System]100
LeafMain content rendering fallback (SystemMainContentFallback) [System]7000
LeafMenu link creation/deletion (MenuTestCase) [Menu]64400
LeafMenu rebuild test (MenuRebuildTestCase) [Menu]500
LeafMenu router (MenuRouterTestCase) [Menu]15900
LeafMenu settings for nodes (MenuNodeTestCase) [Menu]4700
LeafMenu tree generation (MenuTreeDataTestCase) [Menu]400
LeafMerge tests (DatabaseMergeTestCase) [Database]7500
LeafMiscellaneous AJAX tests (AJAXElementValidation) [AJAX]800
LeafMissing update dependencies (UpdateDependencyMissingTestCase) [Update API]300
LeafModule API (ModuleUnitTest) [Module]3300
LeafModule dependencies (ModuleDependencyTestCase) [Module]9500
LeafModule installation (ModuleInstallTestCase) [Module]200
LeafModule uninstallation (ModuleUninstallTestCase) [Module]100
LeafModule versions (ModuleVersionTestCase) [Module]5000
LeafMultilingual fields (LocaleMultilingualFieldsFunctionalTest) [Locale]5200
LeafMultistep form using form storage (FormsFormStorageTestCase) [Form API]12100
LeafMultistep node form basic options (MultiStepNodeFormBasicOptionsTest) [Node]1500
LeafNew default theme blocks (NewDefaultThemeBlocks) [Block]2400
LeafNo help (NoHelpTestCase) [Help]1100
LeafNode access (NodeAccessUnitTest) [Node]3100
LeafNode access rebuild (NodeAccessRebuildTestCase) [Node]1600
LeafNode access records (NodeAccessRecordsUnitTest) [Node]2200
LeafNode administration (NodeAdminTestCase) [Node]11900
LeafNode blocks (NodeBlockFunctionalTest) [Node]8300
LeafNode creation (NodeCreationTestCase) [Node]2500
LeafNode edit (PageEditTestCase) [Node]9300
LeafNode edit permissions (PageViewTestCase) [Node]3200
LeafNode entity query alter (NodeEntityFieldQueryAlter) [Node]3000
LeafNode feed (NodeFeedTestCase) [Node]100
LeafNode post information display (NodePostSettingsTestCase) [Node]3400
LeafNode preview (PagePreviewTestCase) [Node]3500
LeafNode query alter (NodeQueryAlter) [Node]5100
LeafNode revisions (NodeRevisionsTestCase) [Node]4400
LeafNode RSS Content (NodeRSSContentTestCase) [Node]1600
LeafNode save (NodeSaveTestCase) [Node]2800
LeafNode title (NodeTitleTestCase) [Node]2000
LeafNode title XSS filtering (NodeTitleXSSTestCase) [Node]2000
LeafNode token replacement (NodeTokenReplaceTestCase) [Node]3400
LeafNode types (NodeTypeTestCase) [Node]8400
LeafNon default theme admin (NonDefaultBlockAdmin) [Block]1000
LeafOpenID account registration (OpenIDRegistrationTestCase) [OpenID]13100
LeafOpenID discovery and login (OpenIDFunctionalTestCase) [OpenID]24800
LeafOpenID helper functions (OpenIDUnitTest) [OpenID]3200
LeafOptions widgets (OptionsWidgetsTestCase) [Field types]22900
LeafPage cache test (BootstrapPageCacheTestCase) [Bootstrap]7800
LeafPager query tests (DatabaseSelectPagerDefaultTestCase) [Database]3400
LeafParsing .info files (ParseInfoFilesTestCase) [System]300
LeafPath alias functionality (PathTestCase) [Path]10200
LeafPath aliases with languages (PathLanguageUITestCase) [Path]6900
LeafPath aliases with translated nodes (PathLanguageTestCase) [Path]6300
LeafPath language settings (LocalePathFunctionalTest) [Locale]3600
LeafPaths on non-English monolingual sites (PathMonolingualTestCase) [Path]3400
LeafPersonal contact form (ContactPersonalTestCase) [Contact]14200
LeafPHP filter access check (PHPAccessTestCase) [PHP]3700
LeafPHP filter functionality (PHPFilterTestCase) [PHP]4100
LeafPoll add choice (PollJSAddChoice) [Poll]1500
LeafPoll create (PollCreateTestCase) [Poll]12100
LeafPoll expiration (PollExpirationTestCase) [Poll]3200
LeafPoll token replacement (PollTokenReplaceTestCase) [Poll]10600
LeafPoll upgrade path (PollUpgradePathTestCase) [Upgrade path]21200
LeafPoll vote (PollVoteTestCase) [Poll]8000
LeafProfile browsing (ProfileTestBrowsing) [Profile]3200
LeafProgrammatic form submissions (FormsProgrammaticTestCase) [Form API]1800
LeafQuery altering tests (DatabaseAlterTestCase) [Database]5500
LeafQuery logging (DatabaseLoggingTestCase) [Database]3800
LeafQuery tagging tests (DatabaseTaggingTestCase) [Database]2800
LeafQueue functionality (QueueTestCase) [System]700
LeafRange query test (DatabaseRangeQueryTestCase) [Database]200
LeafRDF comment mapping (RdfCommentAttributesTestCase) [RDF]20400
LeafRDF mapping CRUD functions (RdfCrudTestCase) [RDF]900
LeafRDF mapping definition functionality (RdfMappingDefinitionTestCase) [RDF]5800
LeafRDF mapping hook (RdfMappingHookTestCase) [RDF]500
LeafRDF namespaces (RdfGetRdfNamespacesTestCase) [RDF]400
LeafRDF namespaces XML serialization tests (DrupalGetRdfNamespacesTestCase) [System]600
LeafRDF tracker page mapping (RdfTrackerAttributesTestCase) [RDF]3200
LeafRDFa markup (RdfRdfaMarkupTestCase) [RDF]2100
LeafRebuild arbitrary forms (FormsArbitraryRebuildTestCase) [Form API]1400
LeafRebuild content (NodeBuildContent) [Node]100
LeafRegistry parse file test (RegistryParseFileTestCase) [System]200
LeafRegistry parse files test (RegistryParseFilesTestCase) [System]600
LeafRegression tests (DatabaseRegressionTestCase) [Database]2700
LeafRemove feed functionality (RemoveFeedTestCase) [Aggregator]2300
LeafRemove feed item functionality (RemoveFeedItemTestCase) [Aggregator]19600
LeafRequired modules (ModuleRequiredTestCase) [Module]2100
LeafRequirements hook failure (HookRequirementsTestCase) [Module]1500
LeafResettable static variables test (BootstrapResettableStaticTestCase) [Bootstrap]500
LeafRole assignment (UserRolesAssignmentTestCase) [User]5300
LeafRole permissions (UserPermissionsTestCase) [User]5000
LeafSchema API (SchemaTestCase) [Database]2700
LeafSearch engine phrase queries (SearchExactTestCase) [Search]2200
LeafSearch engine queries (SearchMatchTestCase) [Search]14400
LeafSearch engine ranking (SearchRankingTestCase) [Search]6000
LeafSearch excerpt extraction (SearchExcerptTestCase) [Search]500
LeafSearch expression insert/extract (SearchExpressionInsertExtractTestCase) [Search]2400
LeafSearch page override (SearchPageOverride) [Search]1200
LeafSearch simplify (SearchSimplifyTestCase) [Search]33800
LeafSecurity (FilterSecurityTestCase) [Filter]2600
LeafSelect tests (DatabaseSelectTestCase) [Database]11700
LeafSelect tests, complex (DatabaseSelectComplexTestCase) [Database]11500
LeafSelect tests, ordered (DatabaseSelectOrderedTestCase) [Database]2600
LeafSelect tests, subqueries (DatabaseSelectSubqueryTestCase) [Database]2400
LeafSequences API (DatabaseNextIdCase) [Database]200
LeafSession https handling (SessionHttpsTestCase) [Session]6800
ExpandSession tests (SessionTestCase) [Session]14510
MessageGroupFilenameLineFunctionStatus
Session data persists through browser close.Sessionsession.test99SessionTestCase->testDataPersistence()
LeafShortcut link functionality (ShortcutLinksTestCase) [Shortcut]9600
LeafShortcut set functionality (ShortcutSetsTestCase) [Shortcut]15300
LeafShutdown functions (ShutdownFunctionsTest) [System]400
LeafSimpleTest browser (SimpleTestBrowserTestCase) [SimpleTest]1600
LeafSimpleTest e-mail capturing (SimpleTestMailCaptureTestCase) [SimpleTest]1300
LeafSimpleTest error collector (DrupalErrorCollectionUnitTest) [SimpleTest]1500
LeafSimpleTest functionality (SimpleTestFunctionalTest) [SimpleTest]9100
LeafSite maintenance mode functionality (SiteMaintenanceTestCase) [System]8000
LeafSite-wide contact form (ContactSitewideTestCase) [Contact]23700
LeafSize parsing test (CommonSizeTestCase) [System]3500
LeafStatistics logging tests (StatisticsLoggingTestCase) [Statistics]1200
LeafStatistics reports tests (StatisticsReportsTestCase) [Statistics]8000
LeafStatistics token replacement (StatisticsTokenReplaceTestCase) [Statistics]2900
LeafStream wrappers (StreamWrapperTest) [File API]1500
LeafString filtering tests (CommonXssUnitTest) [System]700
LeafString translate, search and validate (LocaleTranslationFunctionalTest) [Locale]25000
LeafString translation using st() (LocaleInstallTest) [Locale]100
LeafSummary length (SummaryLengthTestCase) [Node]1500
LeafSyslog functionality (SyslogTestCase) [Syslog]1600
LeafTableselect form element type test (FormsElementsTableSelectFunctionalTest) [Form API]6300
LeafTablesort query tests (DatabaseSelectTableSortDefaultTestCase) [Database]3400
LeafTaxonomy term functions and forms. (TaxonomyTermTestCase) [Taxonomy]21200
LeafTaxonomy term hooks (TaxonomyHooksTestCase) [Taxonomy]1900
LeafTaxonomy term multiple loading (TaxonomyLoadMultipleUnitTest) [Taxonomy]3400
LeafTaxonomy term reference field (TaxonomyTermFieldTestCase) [Taxonomy]5000
LeafTaxonomy term unit tests (TaxonomyTermUnitTest) [Taxonomy]200
LeafTaxonomy term URL aliases (PathTaxonomyTermTestCase) [Path]3400
LeafTaxonomy token replacement (TaxonomyTokenReplaceTestCase) [Taxonomy]10600
LeafTaxonomy vocabularies (TaxonomyVocabularyUnitTest) [Taxonomy]6300
LeafTaxonomy vocabulary interface (TaxonomyVocabularyFunctionalTest) [Taxonomy]13400
LeafTemporary query test (DatabaseTemporaryQueryTestCase) [Database]500
LeafTest date field (ProfileTestDate) [Profile]4900
LeafTest field weights (ProfileTestWeights) [Profile]5300
LeafTest select field (ProfileTestSelect) [Profile]4500
LeafTest single fields (ProfileTestFields) [Profile]18000
LeafTest statistics admin. (StatisticsAdminTestCase) [Statistics]10400
LeafTest user actions (TriggerUserActionTestCase) [Trigger]6500
LeafTest user triggers (TriggerUserTokenTestCase) [Trigger]18500
LeafTesting SimpleTest setUp (SimpleTestFolderTestCase) [SimpleTest]100
LeafText field (TextFieldTestCase) [Field types]19700
LeafText summary (TextSummaryTestCase) [Field types]11600
LeafText translation (TextTranslationTestCase) [Field types]10400
LeafTheme API (ThemeUnitTest) [Theme]1100
LeafTheme fast initialization (ThemeFastTestCase) [Theme]2000
LeafTheme initialization in hook_init() (ThemeHookInitUnitTest) [Theme]600
ExpandTheme interface functionality (SystemThemeFunctionalTest) [System]10910
MessageGroupFilenameLineFunctionStatus
Logo path successfully changed.Othersystem.test1308SystemThemeFunctionalTest->testThemeSettings()
LeafTheme item list (ThemeItemListUnitTest) [Theme]100
LeafTheme Table (ThemeTableUnitTest) [Theme]600
LeafTimer test (BootstrapTimerTestCase) [Bootstrap]500
LeafToken replacement (TokenReplaceTestCase) [System]3400
LeafTop visitor blocking (StatisticsBlockVisitorsTestCase) [Statistics]4500
LeafTracker (TrackerTest) [Tracker]21900
LeafTransaction tests (DatabaseTransactionTestCase) [Database]3100
LeafTranslation export (LocaleExportFunctionalTest) [Locale]2900
LeafTranslation functionality (TranslationTestCase) [Translation]7500
LeafTranslation import (LocaleImportFunctionalTest) [Locale]9100
LeafTrigger content (node) actions (TriggerContentTestCase) [Trigger]35300
LeafTrigger cron (system) actions (TriggerCronTestCase) [Trigger]3300
LeafTrigger orphaned actions (TriggerOrphanedActionsTestCase) [Trigger]3700
LeafTrigger other actions (TriggerOtherTestCase) [Trigger]11200
LeafUI language negotiation (LocaleUILanguageNegotiationTest) [Locale]4700
LeafUnassigned text format functionality (FilterNoFormatTestCase) [Filter]100
LeafUnicode handling (UnicodeUnitTest) [System]24100
LeafUnmanaged file copying (FileUnmanagedCopyTest) [File API]3100
LeafUnmanaged file delete (FileUnmanagedDeleteTest) [File API]800
LeafUnmanaged file moving (FileUnmanagedMoveTest) [File API]2200
LeafUnmanaged file save data (FileUnmanagedSaveDataTest) [File API]700
LeafUnmanaged recursive file delete (FileUnmanagedDeleteRecursiveTest) [File API]1700
LeafUpdate contrib functionality (UpdateTestContribCase) [Update]13700
LeafUpdate core functionality (UpdateCoreTestCase) [Update]14700
LeafUpdate dependency hook invocation (UpdateDependencyHookInvocationTestCase) [Update API]300
LeafUpdate dependency ordering (UpdateDependencyOrderingTestCase) [Update API]300
LeafUpdate feed functionality (UpdateFeedTestCase) [Aggregator]7400
LeafUpdate feed item functionality (UpdateFeedItemTestCase) [Aggregator]6100
LeafUpdate functionality (UpdateScriptFunctionalTest) [System]6700
LeafUpdate on cron functionality (AggregatorCronTestCase) [Aggregator]5300
LeafUpdate tests (DatabaseUpdateTestCase) [Database]3500
LeafUpdate tests, Complex (DatabaseUpdateComplexTestCase) [Database]5200
LeafUpdate tests, LOB (DatabaseUpdateLOBTestCase) [Database]1300
LeafUpload and extract module functionality (UpdateTestUploadCase) [Update]1800
LeafUpload user picture (UserPictureTestCase) [User]7600
LeafURL altering (UrlAlterFunctionalTest) [Path API]2800
LeafURL generation tests (CommonURLUnitTest) [System]5600
LeafUser administration (UserAdminTestCase) [User]6500
LeafUser autocompletion (UserAutocompleteTestCase) [User]2800
LeafUser blocks (UserBlocksUnitTests) [User]4300
LeafUser create (UserCreateTestCase) [User]2700
LeafUser creation (LocaleUserCreationTest) [Locale]6800
LeafUser edit (UserEditTestCase) [User]6800
LeafUser edited own account (UserEditedOwnAccountTestCase) [User]2300
LeafUser language settings (LocaleUserLanguageFunctionalTest) [Locale]5100
LeafUser login (UserLoginTestCase) [User]13200
LeafUser poll vote capability. (PollVoteCheckHostname) [Poll]12000
LeafUser registration (UserRegistrationTestCase) [User]8100
LeafUser role administration (UserRoleAdminTestCase) [User]3900
LeafUser save test (UserSaveTestCase) [User]300
LeafUser search (UserUserSearchTestCase) [User]3800
LeafUser signatures (UserSignatureTestCase) [User]4500
LeafUser time zones (UserTimeZoneFunctionalTest) [User]3100
LeafUser token replacement (UserTokenReplaceTestCase) [User]4300
LeafUsername/e-mail validation (UserValidationTestCase) [User]1900
LeafValid Url (ValidUrlTestCase) [System]7900
LeafVariable test (BootstrapVariableTestCase) [Bootstrap]700
LeafXML-RPC basic (XMLRPCBasicTestCase) [XML-RPC]500
LeafXML-RPC message (XMLRPCMessagesTestCase) [XML-RPC]300
LeafXML-RPC validator (XMLRPCValidator1IncTestCase) [XML-RPC]900