895014-node-type-delete.patch

Test status
StatusResult
Last receivedFri, 08/27/2010 - 11:30:31
Last requestedFri, 08/27/2010 - 11:31:01
Last testedFri, 08/27/2010 - 11:53:51
Test count1
Environment status
MySQLfail
File information
File895014-node-type-delete.patch
BranchDrupal core - 7.x
LinkIssue Link
SummaryFAILED: [[SimpleTest]]: [MySQL] 22,714 pass(es), 164 fail(s), and 141 exception(s).
Details

MySQL

  1. Setup environment
  2. Detect an invalid patch URL
  3. Detect invalid repository information
  4. Detect invalid patch format
  5. Detect a non-applicable patch
  6. Detect invalid PHP syntax
  7. Detect a Drupal installation failure
  8. Detect a test run failure
  9. Detect a failing test
    Review the test failures below then if necessary run them locally until the problem has been fixed.
  10. Complete test suite with all tests passing
22,714 pass(es), 164 fail(s), and 141 exception(s)

Non-pass

Test namePassFailException
ExpandBasic upgrade path (BasicUpgradePath) [Upgrade path]421915
MessageGroupFilenameLineFunctionStatus
Undefined property: stdClass::$disabledNoticenode.module704_node_types_build()
Undefined property: stdClass::$disabledNoticenode.module724_node_types_build()
Undefined property: stdClass::$disabledNoticenode.module704_node_types_build()
Undefined property: stdClass::$disabledNoticenode.module724_node_types_build()
Undefined property: stdClass::$disabledNoticenode.module704_node_types_build()
Undefined property: stdClass::$disabledNoticenode.module724_node_types_build()
Undefined property: stdClass::$disabledNoticenode.module704_node_types_build()
Undefined property: stdClass::$disabledNoticenode.module724_node_types_build()
Failed: PDOException: SQLSTATE[42S22]: Column not found: 1054 Unknown column 'disabled' in 'where clause': SELECT nt.* FROM {node_type} nt WHERE (disabled = :db_condition_placeholder_0) ORDER BY nt.type ASC; Array ( [:db_condition_placeholder_0] => 0 ) in _node_types_build() (line 701 of /var/lib/drupaltestbot/sites/default/files/checkout/modules/node/node.module).Otherupgrade.test247UpgradePathTestCase->performUpgrade()
Failed: PDOException: SQLSTATE[01000]: Warning: 1265 Data truncated for column 'defining_module' at row 1: ALTER TABLE {node_type} CHANGE `defining_module` `defining_module` VARCHAR(255) NOT NULL COMMENT 'The module defining this node type.'; Array ( ) in db_add_field() (line 2693 of /var/lib/drupaltestbot/sites/default/files/checkout/includes/database/database.inc).Otherupgrade.test247UpgradePathTestCase->performUpgrade()
The upgrade was completed successfully.Otherupgrade.test350BasicUpgradePath->testBasicUpgrade()
SQLSTATE[42S02]: Base table or view not found: 1146 Table 'drupaltestbotmysql.simpletest764400blocked_ips' doesn't exist: SELECT 1 FROM {blocked_ips} WHERE ip = :ip; Array ( [:ip] => 127.0.0.1 ) PDOExceptionbootstrap.inc1804drupal_is_denied()
HTTP response expected 200, actual 500Browserupgrade.test354BasicUpgradePath->testBasicUpgrade()
SQLSTATE[42S02]: Base table or view not found: 1146 Table 'drupaltestbotmysql.simpletest764400blocked_ips' doesn't exist: SELECT 1 FROM {blocked_ips} WHERE ip = :ip; Array ( [:ip] => 127.0.0.1 ) PDOExceptionbootstrap.inc1804drupal_is_denied()
Undefined variable: url_targetNoticedrupal_web_test_case.php2220DrupalWebTestCase->clickLink()
Clicked link Edit () from http://pifr-mysql/checkout/?q=userBrowserupgrade.test358BasicUpgradePath->testBasicUpgrade()
We are still logged in as admin at the end of the upgrade.Otherupgrade.test359BasicUpgradePath->testBasicUpgrade()
SQLSTATE[42S02]: Base table or view not found: 1146 Table 'drupaltestbotmysql.simpletest764400blocked_ips' doesn't exist: SELECT 1 FROM {blocked_ips} WHERE ip = :ip; Array ( [:ip] => 127.0.0.1 ) PDOExceptionbootstrap.inc1804drupal_is_denied()
SQLSTATE[42S02]: Base table or view not found: 1146 Table 'drupaltestbotmysql.simpletest764400blocked_ips' doesn't exist: SELECT 1 FROM {blocked_ips} WHERE ip = :ip; Array ( [:ip] => 127.0.0.1 ) PDOExceptionbootstrap.inc1804drupal_is_denied()
Username field found.Logoutupgrade.test362BasicUpgradePath->testBasicUpgrade()
SQLSTATE[42S02]: Base table or view not found: 1146 Table 'drupaltestbotmysql.simpletest764400blocked_ips' doesn't exist: SELECT 1 FROM {blocked_ips} WHERE ip = :ip; Array ( [:ip] => 127.0.0.1 ) PDOExceptionbootstrap.inc1804drupal_is_denied()
Failed to set field name to adminOtherupgrade.test367BasicUpgradePath->testBasicUpgrade()
Failed to set field pass to adminOtherupgrade.test367BasicUpgradePath->testBasicUpgrade()
Found the Log in buttonOtherupgrade.test367BasicUpgradePath->testBasicUpgrade()
Found the requested form fields at userOtherupgrade.test367BasicUpgradePath->testBasicUpgrade()
User admin successfully logged in.User loginupgrade.test367BasicUpgradePath->testBasicUpgrade()
SQLSTATE[42S02]: Base table or view not found: 1146 Table 'drupaltestbotmysql.simpletest764400blocked_ips' doesn't exist: SELECT 1 FROM {blocked_ips} WHERE ip = :ip; Array ( [:ip] => 127.0.0.1 ) PDOExceptionbootstrap.inc1804drupal_is_denied()
"Content" foundOtherupgrade.test374BasicUpgradePath->testBasicUpgrade()
"Appearance" foundOtherupgrade.test375BasicUpgradePath->testBasicUpgrade()
"People" foundOtherupgrade.test376BasicUpgradePath->testBasicUpgrade()
"Configuration" foundOtherupgrade.test377BasicUpgradePath->testBasicUpgrade()
"Reports" foundOtherupgrade.test378BasicUpgradePath->testBasicUpgrade()
"Structure" foundOtherupgrade.test379BasicUpgradePath->testBasicUpgrade()
"Modules" foundOtherupgrade.test380BasicUpgradePath->testBasicUpgrade()
ExpandBlock availability (BookBlockTestCase) [Book]011
MessageGroupFilenameLineFunctionStatus
The test did not complete due to a fatal error.Completion checkbook.test267BookBlockTestCase->testBookNavigationBlock()
Undefined property: stdClass::$defining_moduleNoticenode.module511node_type_save()
ExpandBook functionality (BookTestCase) [Book]011
MessageGroupFilenameLineFunctionStatus
The test did not complete due to a fatal error.Completion checkbook.test62BookTestCase->testBook()
Undefined property: stdClass::$defining_moduleNoticenode.module511node_type_save()
ExpandField UI tests (FieldUITestCase) [Field UI]811
MessageGroupFilenameLineFunctionStatus
The test did not complete due to a fatal error.Completion checkfield_ui.test47FieldUITestCase->testCRUDFields()
Undefined property: stdClass::$defining_moduleNoticenode.module511node_type_save()
ExpandList field UI (ListFieldUITestCase) [Field types]811
MessageGroupFilenameLineFunctionStatus
The test did not complete due to a fatal error.Completion checklist.test134ListFieldUITestCase->testAllowedValues()
Undefined property: stdClass::$defining_moduleNoticenode.module511node_type_save()
ExpandModule dependencies (ModuleDependencyTestCase) [Module]9411
MessageGroupFilenameLineFunctionStatus
Attempt to create an instance of field taxonomy_forums on bundle forum that already has an instance of that field.FieldExceptionfield.crud.inc673field_create_instance()
Modules status has been updated.Othersystem.test318ModuleDependencyTestCase->testEnableForumTaxonomyFieldDependency()
ExpandNode types (NodeTypeTestCase) [Node]5202
MessageGroupFilenameLineFunctionStatus
Undefined property: stdClass::$defining_moduleNoticenode.module511node_type_save()
PDOException: SQLSTATE[23000]: Integrity constraint violation: 1048 Column 'defining_module' cannot be null: INSERT INTO {node_type} (type, name, base, has_title, title_label, description, help, custom, modified, locked, disabled, defining_module, orig_type) VALUES (:db_insert_placeholder_0, :db_insert_placeholder_1, :db_insert_placeholder_2, :db_insert_placeholder_3, :db_insert_placeholder_4, :db_insert_placeholder_5, :db_insert_placeholder_6, :db_insert_placeholder_7, :db_insert_placeholder_8, :db_insert_placeholder_9, :db_insert_placeholder_10, :db_insert_placeholder_11, :db_insert_placeholder_12); Array ( [:db_insert_placeholder_0] => wrbln54v [:db_insert_placeholder_1] => wrbln54v [:db_insert_placeholder_2] => node_content [:db_insert_placeholder_3] => 1 [:db_insert_placeholder_4] => Title [:db_insert_placeholder_5] => [:db_insert_placeholder_6] => [:db_insert_placeholder_7] => 1 [:db_insert_placeholder_8] => 1 [:db_insert_placeholder_9] => 0 [:db_insert_placeholder_10] => 0 [:db_insert_placeholder_11] => [:db_insert_placeholder_12] => wrbln54v ) in node_type_save() (line 530 of /var/lib/drupaltestbot/sites/default/files/checkout/modules/node/node.module).Uncaught exceptiondatabase.inc1947PDOStatement->execute()
ExpandPoll upgrade path (PollUpgradePathTestCase) [Upgrade path]41140115
MessageGroupFilenameLineFunctionStatus
Undefined property: stdClass::$disabledNoticenode.module704_node_types_build()
Undefined property: stdClass::$disabledNoticenode.module724_node_types_build()
Undefined property: stdClass::$disabledNoticenode.module704_node_types_build()
Undefined property: stdClass::$disabledNoticenode.module704_node_types_build()
Undefined property: stdClass::$disabledNoticenode.module724_node_types_build()
SQLSTATE[42S22]: Column not found: 1054 Unknown column 'base' in 'field list': UPDATE {node_type} SET type=:db_update_placeholder_0, name=:db_update_placeholder_1, base=:db_update_placeholder_2, has_title=:db_update_placeholder_3, title_label=:db_update_placeholder_4, description=:db_update_placeholder_5, help=:db_update_placeholder_6, custom=:db_update_placeholder_7, modified=:db_update_placeholder_8, locked=:db_update_placeholder_9, disabled=:db_update_placeholder_10, defining_module=:db_update_placeholder_11 WHERE (type = :db_condition_placeholder_0) ; Array ( [:db_update_placeholder_0] => poll [:db_update_placeholder_1] => Poll [:db_update_placeholder_2] => poll [:db_update_placeholder_3] => 1 [:db_update_placeholder_4] => Question [:db_update_placeholder_5] => A poll is a question with a set of possible responses. A poll, once created, automatically provides a simple running count of the number of votes received for each response. [:db_update_placeholder_6] => [:db_update_placeholder_7] => 0 [:db_update_placeholder_8] => 0 [:db_update_placeholder_9] => 1 [:db_update_placeholder_10] => 0 [:db_update_placeholder_11] => poll [:db_condition_placeholder_0] => poll ) PDOExceptionnode.module518node_type_save()
HTTP response expected 200, actual 500Browserupgrade.test238UpgradePathTestCase->performUpgrade()
The upgrade was completed successfully.Otherupgrade.poll.test34PollUpgradePathTestCase->testPollUpgrade()
SQLSTATE[42S02]: Base table or view not found: 1146 Table 'drupaltestbotmysql.simpletest95493blocked_ips' doesn't exist: SELECT 1 FROM {blocked_ips} WHERE ip = :ip; Array ( [:ip] => 127.0.0.1 ) PDOExceptionbootstrap.inc1804drupal_is_denied()
SQLSTATE[42S02]: Base table or view not found: 1146 Table 'drupaltestbotmysql.simpletest95493blocked_ips' doesn't exist: SELECT 1 FROM {blocked_ips} WHERE ip = :ip; Array ( [:ip] => 127.0.0.1 ) PDOExceptionbootstrap.inc1804drupal_is_denied()
Choice text is displayed correctly on poll viewOtherupgrade.poll.test46PollUpgradePathTestCase->testPollUpgrade()
Choice text is displayed correctly on poll viewOtherupgrade.poll.test46PollUpgradePathTestCase->testPollUpgrade()
Undefined variable: url_targetNoticedrupal_web_test_case.php2220DrupalWebTestCase->clickLink()
Clicked link Results () from http://pifr-mysql/checkout/?q=content/poll/0Browserupgrade.poll.test50PollUpgradePathTestCase->testPollUpgrade()
Choice text is displayed correctly on result viewOtherupgrade.poll.test53PollUpgradePathTestCase->testPollUpgrade()
Choice text is displayed correctly on result viewOtherupgrade.poll.test53PollUpgradePathTestCase->testPollUpgrade()
Undefined offset: 0Noticeupgrade.poll.test61PollUpgradePathTestCase->testPollUpgrade()
Undefined offset: 0Noticeupgrade.poll.test61PollUpgradePathTestCase->testPollUpgrade()
The number of votes is displayed correctly: expected 3, got Otherupgrade.poll.test61PollUpgradePathTestCase->testPollUpgrade()
Undefined offset: 1Noticeupgrade.poll.test61PollUpgradePathTestCase->testPollUpgrade()
Undefined offset: 1Noticeupgrade.poll.test61PollUpgradePathTestCase->testPollUpgrade()
The number of votes is displayed correctly: expected 2, got Otherupgrade.poll.test61PollUpgradePathTestCase->testPollUpgrade()
SQLSTATE[42S02]: Base table or view not found: 1146 Table 'drupaltestbotmysql.simpletest95493blocked_ips' doesn't exist: SELECT 1 FROM {blocked_ips} WHERE ip = :ip; Array ( [:ip] => 127.0.0.1 ) PDOExceptionbootstrap.inc1804drupal_is_denied()
Choice text is displayed correctly on poll viewOtherupgrade.poll.test46PollUpgradePathTestCase->testPollUpgrade()
Choice text is displayed correctly on poll viewOtherupgrade.poll.test46PollUpgradePathTestCase->testPollUpgrade()
Choice text is displayed correctly on poll viewOtherupgrade.poll.test46PollUpgradePathTestCase->testPollUpgrade()
Undefined variable: url_targetNoticedrupal_web_test_case.php2220DrupalWebTestCase->clickLink()
Clicked link Results () from http://pifr-mysql/checkout/?q=content/poll/1Browserupgrade.poll.test50PollUpgradePathTestCase->testPollUpgrade()
Choice text is displayed correctly on result viewOtherupgrade.poll.test53PollUpgradePathTestCase->testPollUpgrade()
Choice text is displayed correctly on result viewOtherupgrade.poll.test53PollUpgradePathTestCase->testPollUpgrade()
Choice text is displayed correctly on result viewOtherupgrade.poll.test53PollUpgradePathTestCase->testPollUpgrade()
Undefined offset: 0Noticeupgrade.poll.test61PollUpgradePathTestCase->testPollUpgrade()
Undefined offset: 0Noticeupgrade.poll.test61PollUpgradePathTestCase->testPollUpgrade()
The number of votes is displayed correctly: expected 2, got Otherupgrade.poll.test61PollUpgradePathTestCase->testPollUpgrade()
Undefined offset: 1Noticeupgrade.poll.test61PollUpgradePathTestCase->testPollUpgrade()
Undefined offset: 1Noticeupgrade.poll.test61PollUpgradePathTestCase->testPollUpgrade()
The number of votes is displayed correctly: expected 2, got Otherupgrade.poll.test61PollUpgradePathTestCase->testPollUpgrade()
Undefined offset: 2Noticeupgrade.poll.test61PollUpgradePathTestCase->testPollUpgrade()
Undefined offset: 2Noticeupgrade.poll.test61PollUpgradePathTestCase->testPollUpgrade()
The number of votes is displayed correctly: expected 2, got Otherupgrade.poll.test61PollUpgradePathTestCase->testPollUpgrade()
SQLSTATE[42S02]: Base table or view not found: 1146 Table 'drupaltestbotmysql.simpletest95493blocked_ips' doesn't exist: SELECT 1 FROM {blocked_ips} WHERE ip = :ip; Array ( [:ip] => 127.0.0.1 ) PDOExceptionbootstrap.inc1804drupal_is_denied()
Choice text is displayed correctly on poll viewOtherupgrade.poll.test46PollUpgradePathTestCase->testPollUpgrade()
Choice text is displayed correctly on poll viewOtherupgrade.poll.test46PollUpgradePathTestCase->testPollUpgrade()
Choice text is displayed correctly on poll viewOtherupgrade.poll.test46PollUpgradePathTestCase->testPollUpgrade()
Choice text is displayed correctly on poll viewOtherupgrade.poll.test46PollUpgradePathTestCase->testPollUpgrade()
Undefined variable: url_targetNoticedrupal_web_test_case.php2220DrupalWebTestCase->clickLink()
Clicked link Results () from http://pifr-mysql/checkout/?q=content/poll/2Browserupgrade.poll.test50PollUpgradePathTestCase->testPollUpgrade()
Choice text is displayed correctly on result viewOtherupgrade.poll.test53PollUpgradePathTestCase->testPollUpgrade()
Choice text is displayed correctly on result viewOtherupgrade.poll.test53PollUpgradePathTestCase->testPollUpgrade()
Choice text is displayed correctly on result viewOtherupgrade.poll.test53PollUpgradePathTestCase->testPollUpgrade()
Choice text is displayed correctly on result viewOtherupgrade.poll.test53PollUpgradePathTestCase->testPollUpgrade()
Undefined offset: 0Noticeupgrade.poll.test61PollUpgradePathTestCase->testPollUpgrade()
Undefined offset: 0Noticeupgrade.poll.test61PollUpgradePathTestCase->testPollUpgrade()
The number of votes is displayed correctly: expected 2, got Otherupgrade.poll.test61PollUpgradePathTestCase->testPollUpgrade()
Undefined offset: 1Noticeupgrade.poll.test61PollUpgradePathTestCase->testPollUpgrade()
Undefined offset: 1Noticeupgrade.poll.test61PollUpgradePathTestCase->testPollUpgrade()
The number of votes is displayed correctly: expected 2, got Otherupgrade.poll.test61PollUpgradePathTestCase->testPollUpgrade()
Undefined offset: 2Noticeupgrade.poll.test61PollUpgradePathTestCase->testPollUpgrade()
Undefined offset: 2Noticeupgrade.poll.test61PollUpgradePathTestCase->testPollUpgrade()
The number of votes is displayed correctly: expected 2, got Otherupgrade.poll.test61PollUpgradePathTestCase->testPollUpgrade()
Undefined offset: 3Noticeupgrade.poll.test61PollUpgradePathTestCase->testPollUpgrade()
Undefined offset: 3Noticeupgrade.poll.test61PollUpgradePathTestCase->testPollUpgrade()
The number of votes is displayed correctly: expected 1, got Otherupgrade.poll.test61PollUpgradePathTestCase->testPollUpgrade()
SQLSTATE[42S02]: Base table or view not found: 1146 Table 'drupaltestbotmysql.simpletest95493blocked_ips' doesn't exist: SELECT 1 FROM {blocked_ips} WHERE ip = :ip; Array ( [:ip] => 127.0.0.1 ) PDOExceptionbootstrap.inc1804drupal_is_denied()
Choice text is displayed correctly on poll viewOtherupgrade.poll.test46PollUpgradePathTestCase->testPollUpgrade()
Choice text is displayed correctly on poll viewOtherupgrade.poll.test46PollUpgradePathTestCase->testPollUpgrade()
Choice text is displayed correctly on poll viewOtherupgrade.poll.test46PollUpgradePathTestCase->testPollUpgrade()
Choice text is displayed correctly on poll viewOtherupgrade.poll.test46PollUpgradePathTestCase->testPollUpgrade()
Choice text is displayed correctly on poll viewOtherupgrade.poll.test46PollUpgradePathTestCase->testPollUpgrade()
Undefined variable: url_targetNoticedrupal_web_test_case.php2220DrupalWebTestCase->clickLink()
Clicked link Results () from http://pifr-mysql/checkout/?q=content/poll/3Browserupgrade.poll.test50PollUpgradePathTestCase->testPollUpgrade()
Choice text is displayed correctly on result viewOtherupgrade.poll.test53PollUpgradePathTestCase->testPollUpgrade()
Choice text is displayed correctly on result viewOtherupgrade.poll.test53PollUpgradePathTestCase->testPollUpgrade()
Choice text is displayed correctly on result viewOtherupgrade.poll.test53PollUpgradePathTestCase->testPollUpgrade()
Choice text is displayed correctly on result viewOtherupgrade.poll.test53PollUpgradePathTestCase->testPollUpgrade()
Choice text is displayed correctly on result viewOtherupgrade.poll.test53PollUpgradePathTestCase->testPollUpgrade()
Undefined offset: 0Noticeupgrade.poll.test61PollUpgradePathTestCase->testPollUpgrade()
Undefined offset: 0Noticeupgrade.poll.test61PollUpgradePathTestCase->testPollUpgrade()
The number of votes is displayed correctly: expected 2, got Otherupgrade.poll.test61PollUpgradePathTestCase->testPollUpgrade()
Undefined offset: 1Noticeupgrade.poll.test61PollUpgradePathTestCase->testPollUpgrade()
Undefined offset: 1Noticeupgrade.poll.test61PollUpgradePathTestCase->testPollUpgrade()
The number of votes is displayed correctly: expected 2, got Otherupgrade.poll.test61PollUpgradePathTestCase->testPollUpgrade()
Undefined offset: 2Noticeupgrade.poll.test61PollUpgradePathTestCase->testPollUpgrade()
Undefined offset: 2Noticeupgrade.poll.test61PollUpgradePathTestCase->testPollUpgrade()
The number of votes is displayed correctly: expected 2, got Otherupgrade.poll.test61PollUpgradePathTestCase->testPollUpgrade()
Undefined offset: 3Noticeupgrade.poll.test61PollUpgradePathTestCase->testPollUpgrade()
Undefined offset: 3Noticeupgrade.poll.test61PollUpgradePathTestCase->testPollUpgrade()
The number of votes is displayed correctly: expected 1, got Otherupgrade.poll.test61PollUpgradePathTestCase->testPollUpgrade()
Undefined offset: 4Noticeupgrade.poll.test61PollUpgradePathTestCase->testPollUpgrade()
Undefined offset: 4Noticeupgrade.poll.test61PollUpgradePathTestCase->testPollUpgrade()
The number of votes is displayed correctly: expected 1, got Otherupgrade.poll.test61PollUpgradePathTestCase->testPollUpgrade()
SQLSTATE[42S02]: Base table or view not found: 1146 Table 'drupaltestbotmysql.simpletest95493blocked_ips' doesn't exist: SELECT 1 FROM {blocked_ips} WHERE ip = :ip; Array ( [:ip] => 127.0.0.1 ) PDOExceptionbootstrap.inc1804drupal_is_denied()
Choice text is displayed correctly on poll viewOtherupgrade.poll.test46PollUpgradePathTestCase->testPollUpgrade()
Choice text is displayed correctly on poll viewOtherupgrade.poll.test46PollUpgradePathTestCase->testPollUpgrade()
Undefined variable: url_targetNoticedrupal_web_test_case.php2220DrupalWebTestCase->clickLink()
Clicked link Results () from http://pifr-mysql/checkout/?q=content/poll/4Browserupgrade.poll.test50PollUpgradePathTestCase->testPollUpgrade()
Choice text is displayed correctly on result viewOtherupgrade.poll.test53PollUpgradePathTestCase->testPollUpgrade()
Choice text is displayed correctly on result viewOtherupgrade.poll.test53PollUpgradePathTestCase->testPollUpgrade()
Undefined offset: 0Noticeupgrade.poll.test61PollUpgradePathTestCase->testPollUpgrade()
Undefined offset: 0Noticeupgrade.poll.test61PollUpgradePathTestCase->testPollUpgrade()
The number of votes is displayed correctly: expected 3, got Otherupgrade.poll.test61PollUpgradePathTestCase->testPollUpgrade()
Undefined offset: 1Noticeupgrade.poll.test61PollUpgradePathTestCase->testPollUpgrade()
Undefined offset: 1Noticeupgrade.poll.test61PollUpgradePathTestCase->testPollUpgrade()
The number of votes is displayed correctly: expected 2, got Otherupgrade.poll.test61PollUpgradePathTestCase->testPollUpgrade()
SQLSTATE[42S02]: Base table or view not found: 1146 Table 'drupaltestbotmysql.simpletest95493blocked_ips' doesn't exist: SELECT 1 FROM {blocked_ips} WHERE ip = :ip; Array ( [:ip] => 127.0.0.1 ) PDOExceptionbootstrap.inc1804drupal_is_denied()
Choice text is displayed correctly on poll viewOtherupgrade.poll.test46PollUpgradePathTestCase->testPollUpgrade()
Choice text is displayed correctly on poll viewOtherupgrade.poll.test46PollUpgradePathTestCase->testPollUpgrade()
Choice text is displayed correctly on poll viewOtherupgrade.poll.test46PollUpgradePathTestCase->testPollUpgrade()
Undefined variable: url_targetNoticedrupal_web_test_case.php2220DrupalWebTestCase->clickLink()
Clicked link Results () from http://pifr-mysql/checkout/?q=content/poll/5Browserupgrade.poll.test50PollUpgradePathTestCase->testPollUpgrade()
Choice text is displayed correctly on result viewOtherupgrade.poll.test53PollUpgradePathTestCase->testPollUpgrade()
Choice text is displayed correctly on result viewOtherupgrade.poll.test53PollUpgradePathTestCase->testPollUpgrade()
Choice text is displayed correctly on result viewOtherupgrade.poll.test53PollUpgradePathTestCase->testPollUpgrade()
Undefined offset: 0Noticeupgrade.poll.test61PollUpgradePathTestCase->testPollUpgrade()
Undefined offset: 0Noticeupgrade.poll.test61PollUpgradePathTestCase->testPollUpgrade()
The number of votes is displayed correctly: expected 2, got Otherupgrade.poll.test61PollUpgradePathTestCase->testPollUpgrade()
Undefined offset: 1Noticeupgrade.poll.test61PollUpgradePathTestCase->testPollUpgrade()
Undefined offset: 1Noticeupgrade.poll.test61PollUpgradePathTestCase->testPollUpgrade()
The number of votes is displayed correctly: expected 2, got Otherupgrade.poll.test61PollUpgradePathTestCase->testPollUpgrade()
Undefined offset: 2Noticeupgrade.poll.test61PollUpgradePathTestCase->testPollUpgrade()
Undefined offset: 2Noticeupgrade.poll.test61PollUpgradePathTestCase->testPollUpgrade()
The number of votes is displayed correctly: expected 2, got Otherupgrade.poll.test61PollUpgradePathTestCase->testPollUpgrade()
SQLSTATE[42S02]: Base table or view not found: 1146 Table 'drupaltestbotmysql.simpletest95493blocked_ips' doesn't exist: SELECT 1 FROM {blocked_ips} WHERE ip = :ip; Array ( [:ip] => 127.0.0.1 ) PDOExceptionbootstrap.inc1804drupal_is_denied()
Choice text is displayed correctly on poll viewOtherupgrade.poll.test46PollUpgradePathTestCase->testPollUpgrade()
Choice text is displayed correctly on poll viewOtherupgrade.poll.test46PollUpgradePathTestCase->testPollUpgrade()
Choice text is displayed correctly on poll viewOtherupgrade.poll.test46PollUpgradePathTestCase->testPollUpgrade()
Choice text is displayed correctly on poll viewOtherupgrade.poll.test46PollUpgradePathTestCase->testPollUpgrade()
Undefined variable: url_targetNoticedrupal_web_test_case.php2220DrupalWebTestCase->clickLink()
Clicked link Results () from http://pifr-mysql/checkout/?q=content/poll/6Browserupgrade.poll.test50PollUpgradePathTestCase->testPollUpgrade()
Choice text is displayed correctly on result viewOtherupgrade.poll.test53PollUpgradePathTestCase->testPollUpgrade()
Choice text is displayed correctly on result viewOtherupgrade.poll.test53PollUpgradePathTestCase->testPollUpgrade()
Choice text is displayed correctly on result viewOtherupgrade.poll.test53PollUpgradePathTestCase->testPollUpgrade()
Choice text is displayed correctly on result viewOtherupgrade.poll.test53PollUpgradePathTestCase->testPollUpgrade()
Undefined offset: 0Noticeupgrade.poll.test61PollUpgradePathTestCase->testPollUpgrade()
Undefined offset: 0Noticeupgrade.poll.test61PollUpgradePathTestCase->testPollUpgrade()
The number of votes is displayed correctly: expected 2, got Otherupgrade.poll.test61PollUpgradePathTestCase->testPollUpgrade()
Undefined offset: 1Noticeupgrade.poll.test61PollUpgradePathTestCase->testPollUpgrade()
Undefined offset: 1Noticeupgrade.poll.test61PollUpgradePathTestCase->testPollUpgrade()
The number of votes is displayed correctly: expected 2, got Otherupgrade.poll.test61PollUpgradePathTestCase->testPollUpgrade()
Undefined offset: 2Noticeupgrade.poll.test61PollUpgradePathTestCase->testPollUpgrade()
Undefined offset: 2Noticeupgrade.poll.test61PollUpgradePathTestCase->testPollUpgrade()
The number of votes is displayed correctly: expected 2, got Otherupgrade.poll.test61PollUpgradePathTestCase->testPollUpgrade()
Undefined offset: 3Noticeupgrade.poll.test61PollUpgradePathTestCase->testPollUpgrade()
Undefined offset: 3Noticeupgrade.poll.test61PollUpgradePathTestCase->testPollUpgrade()
The number of votes is displayed correctly: expected 1, got Otherupgrade.poll.test61PollUpgradePathTestCase->testPollUpgrade()
SQLSTATE[42S02]: Base table or view not found: 1146 Table 'drupaltestbotmysql.simpletest95493blocked_ips' doesn't exist: SELECT 1 FROM {blocked_ips} WHERE ip = :ip; Array ( [:ip] => 127.0.0.1 ) PDOExceptionbootstrap.inc1804drupal_is_denied()
Choice text is displayed correctly on poll viewOtherupgrade.poll.test46PollUpgradePathTestCase->testPollUpgrade()
Choice text is displayed correctly on poll viewOtherupgrade.poll.test46PollUpgradePathTestCase->testPollUpgrade()
Choice text is displayed correctly on poll viewOtherupgrade.poll.test46PollUpgradePathTestCase->testPollUpgrade()
Choice text is displayed correctly on poll viewOtherupgrade.poll.test46PollUpgradePathTestCase->testPollUpgrade()
Choice text is displayed correctly on poll viewOtherupgrade.poll.test46PollUpgradePathTestCase->testPollUpgrade()
Undefined variable: url_targetNoticedrupal_web_test_case.php2220DrupalWebTestCase->clickLink()
Clicked link Results () from http://pifr-mysql/checkout/?q=content/poll/7Browserupgrade.poll.test50PollUpgradePathTestCase->testPollUpgrade()
Choice text is displayed correctly on result viewOtherupgrade.poll.test53PollUpgradePathTestCase->testPollUpgrade()
Choice text is displayed correctly on result viewOtherupgrade.poll.test53PollUpgradePathTestCase->testPollUpgrade()
Choice text is displayed correctly on result viewOtherupgrade.poll.test53PollUpgradePathTestCase->testPollUpgrade()
Choice text is displayed correctly on result viewOtherupgrade.poll.test53PollUpgradePathTestCase->testPollUpgrade()
Choice text is displayed correctly on result viewOtherupgrade.poll.test53PollUpgradePathTestCase->testPollUpgrade()
Undefined offset: 0Noticeupgrade.poll.test61PollUpgradePathTestCase->testPollUpgrade()
Undefined offset: 0Noticeupgrade.poll.test61PollUpgradePathTestCase->testPollUpgrade()
The number of votes is displayed correctly: expected 2, got Otherupgrade.poll.test61PollUpgradePathTestCase->testPollUpgrade()
Undefined offset: 1Noticeupgrade.poll.test61PollUpgradePathTestCase->testPollUpgrade()
Undefined offset: 1Noticeupgrade.poll.test61PollUpgradePathTestCase->testPollUpgrade()
The number of votes is displayed correctly: expected 2, got Otherupgrade.poll.test61PollUpgradePathTestCase->testPollUpgrade()
Undefined offset: 2Noticeupgrade.poll.test61PollUpgradePathTestCase->testPollUpgrade()
Undefined offset: 2Noticeupgrade.poll.test61PollUpgradePathTestCase->testPollUpgrade()
The number of votes is displayed correctly: expected 2, got Otherupgrade.poll.test61PollUpgradePathTestCase->testPollUpgrade()
Undefined offset: 3Noticeupgrade.poll.test61PollUpgradePathTestCase->testPollUpgrade()
Undefined offset: 3Noticeupgrade.poll.test61PollUpgradePathTestCase->testPollUpgrade()
The number of votes is displayed correctly: expected 1, got Otherupgrade.poll.test61PollUpgradePathTestCase->testPollUpgrade()
Undefined offset: 4Noticeupgrade.poll.test61PollUpgradePathTestCase->testPollUpgrade()
Undefined offset: 4Noticeupgrade.poll.test61PollUpgradePathTestCase->testPollUpgrade()
The number of votes is displayed correctly: expected 1, got Otherupgrade.poll.test61PollUpgradePathTestCase->testPollUpgrade()
SQLSTATE[42S02]: Base table or view not found: 1146 Table 'drupaltestbotmysql.simpletest95493blocked_ips' doesn't exist: SELECT 1 FROM {blocked_ips} WHERE ip = :ip; Array ( [:ip] => 127.0.0.1 ) PDOExceptionbootstrap.inc1804drupal_is_denied()
Choice text is displayed correctly on poll viewOtherupgrade.poll.test46PollUpgradePathTestCase->testPollUpgrade()
Choice text is displayed correctly on poll viewOtherupgrade.poll.test46PollUpgradePathTestCase->testPollUpgrade()
Undefined variable: url_targetNoticedrupal_web_test_case.php2220DrupalWebTestCase->clickLink()
Clicked link Results () from http://pifr-mysql/checkout/?q=content/poll/8Browserupgrade.poll.test50PollUpgradePathTestCase->testPollUpgrade()
Choice text is displayed correctly on result viewOtherupgrade.poll.test53PollUpgradePathTestCase->testPollUpgrade()
Choice text is displayed correctly on result viewOtherupgrade.poll.test53PollUpgradePathTestCase->testPollUpgrade()
Undefined offset: 0Noticeupgrade.poll.test61PollUpgradePathTestCase->testPollUpgrade()
Undefined offset: 0Noticeupgrade.poll.test61PollUpgradePathTestCase->testPollUpgrade()
The number of votes is displayed correctly: expected 3, got Otherupgrade.poll.test61PollUpgradePathTestCase->testPollUpgrade()
Undefined offset: 1Noticeupgrade.poll.test61PollUpgradePathTestCase->testPollUpgrade()
Undefined offset: 1Noticeupgrade.poll.test61PollUpgradePathTestCase->testPollUpgrade()
The number of votes is displayed correctly: expected 2, got Otherupgrade.poll.test61PollUpgradePathTestCase->testPollUpgrade()
SQLSTATE[42S02]: Base table or view not found: 1146 Table 'drupaltestbotmysql.simpletest95493blocked_ips' doesn't exist: SELECT 1 FROM {blocked_ips} WHERE ip = :ip; Array ( [:ip] => 127.0.0.1 ) PDOExceptionbootstrap.inc1804drupal_is_denied()
Choice text is displayed correctly on poll viewOtherupgrade.poll.test46PollUpgradePathTestCase->testPollUpgrade()
Choice text is displayed correctly on poll viewOtherupgrade.poll.test46PollUpgradePathTestCase->testPollUpgrade()
Choice text is displayed correctly on poll viewOtherupgrade.poll.test46PollUpgradePathTestCase->testPollUpgrade()
Undefined variable: url_targetNoticedrupal_web_test_case.php2220DrupalWebTestCase->clickLink()
Clicked link Results () from http://pifr-mysql/checkout/?q=content/poll/9Browserupgrade.poll.test50PollUpgradePathTestCase->testPollUpgrade()
Choice text is displayed correctly on result viewOtherupgrade.poll.test53PollUpgradePathTestCase->testPollUpgrade()
Choice text is displayed correctly on result viewOtherupgrade.poll.test53PollUpgradePathTestCase->testPollUpgrade()
Choice text is displayed correctly on result viewOtherupgrade.poll.test53PollUpgradePathTestCase->testPollUpgrade()
Undefined offset: 0Noticeupgrade.poll.test61PollUpgradePathTestCase->testPollUpgrade()
Undefined offset: 0Noticeupgrade.poll.test61PollUpgradePathTestCase->testPollUpgrade()
The number of votes is displayed correctly: expected 2, got Otherupgrade.poll.test61PollUpgradePathTestCase->testPollUpgrade()
Undefined offset: 1Noticeupgrade.poll.test61PollUpgradePathTestCase->testPollUpgrade()
Undefined offset: 1Noticeupgrade.poll.test61PollUpgradePathTestCase->testPollUpgrade()
The number of votes is displayed correctly: expected 2, got Otherupgrade.poll.test61PollUpgradePathTestCase->testPollUpgrade()
Undefined offset: 2Noticeupgrade.poll.test61PollUpgradePathTestCase->testPollUpgrade()
Undefined offset: 2Noticeupgrade.poll.test61PollUpgradePathTestCase->testPollUpgrade()
The number of votes is displayed correctly: expected 2, got Otherupgrade.poll.test61PollUpgradePathTestCase->testPollUpgrade()
SQLSTATE[42S02]: Base table or view not found: 1146 Table 'drupaltestbotmysql.simpletest95493blocked_ips' doesn't exist: SELECT 1 FROM {blocked_ips} WHERE ip = :ip; Array ( [:ip] => 127.0.0.1 ) PDOExceptionbootstrap.inc1804drupal_is_denied()
Choice text is displayed correctly on poll viewOtherupgrade.poll.test46PollUpgradePathTestCase->testPollUpgrade()
Choice text is displayed correctly on poll viewOtherupgrade.poll.test46PollUpgradePathTestCase->testPollUpgrade()
Choice text is displayed correctly on poll viewOtherupgrade.poll.test46PollUpgradePathTestCase->testPollUpgrade()
Choice text is displayed correctly on poll viewOtherupgrade.poll.test46PollUpgradePathTestCase->testPollUpgrade()
Undefined variable: url_targetNoticedrupal_web_test_case.php2220DrupalWebTestCase->clickLink()
Clicked link Results () from http://pifr-mysql/checkout/?q=content/poll/10Browserupgrade.poll.test50PollUpgradePathTestCase->testPollUpgrade()
Choice text is displayed correctly on result viewOtherupgrade.poll.test53PollUpgradePathTestCase->testPollUpgrade()
Choice text is displayed correctly on result viewOtherupgrade.poll.test53PollUpgradePathTestCase->testPollUpgrade()
Choice text is displayed correctly on result viewOtherupgrade.poll.test53PollUpgradePathTestCase->testPollUpgrade()
Choice text is displayed correctly on result viewOtherupgrade.poll.test53PollUpgradePathTestCase->testPollUpgrade()
Undefined offset: 0Noticeupgrade.poll.test61PollUpgradePathTestCase->testPollUpgrade()
Undefined offset: 0Noticeupgrade.poll.test61PollUpgradePathTestCase->testPollUpgrade()
The number of votes is displayed correctly: expected 2, got Otherupgrade.poll.test61PollUpgradePathTestCase->testPollUpgrade()
Undefined offset: 1Noticeupgrade.poll.test61PollUpgradePathTestCase->testPollUpgrade()
Undefined offset: 1Noticeupgrade.poll.test61PollUpgradePathTestCase->testPollUpgrade()
The number of votes is displayed correctly: expected 2, got Otherupgrade.poll.test61PollUpgradePathTestCase->testPollUpgrade()
Undefined offset: 2Noticeupgrade.poll.test61PollUpgradePathTestCase->testPollUpgrade()
Undefined offset: 2Noticeupgrade.poll.test61PollUpgradePathTestCase->testPollUpgrade()
The number of votes is displayed correctly: expected 2, got Otherupgrade.poll.test61PollUpgradePathTestCase->testPollUpgrade()
Undefined offset: 3Noticeupgrade.poll.test61PollUpgradePathTestCase->testPollUpgrade()
Undefined offset: 3Noticeupgrade.poll.test61PollUpgradePathTestCase->testPollUpgrade()
The number of votes is displayed correctly: expected 1, got Otherupgrade.poll.test61PollUpgradePathTestCase->testPollUpgrade()
SQLSTATE[42S02]: Base table or view not found: 1146 Table 'drupaltestbotmysql.simpletest95493blocked_ips' doesn't exist: SELECT 1 FROM {blocked_ips} WHERE ip = :ip; Array ( [:ip] => 127.0.0.1 ) PDOExceptionbootstrap.inc1804drupal_is_denied()
Choice text is displayed correctly on poll viewOtherupgrade.poll.test46PollUpgradePathTestCase->testPollUpgrade()
Choice text is displayed correctly on poll viewOtherupgrade.poll.test46PollUpgradePathTestCase->testPollUpgrade()
Choice text is displayed correctly on poll viewOtherupgrade.poll.test46PollUpgradePathTestCase->testPollUpgrade()
Choice text is displayed correctly on poll viewOtherupgrade.poll.test46PollUpgradePathTestCase->testPollUpgrade()
Choice text is displayed correctly on poll viewOtherupgrade.poll.test46PollUpgradePathTestCase->testPollUpgrade()
Undefined variable: url_targetNoticedrupal_web_test_case.php2220DrupalWebTestCase->clickLink()
Clicked link Results () from http://pifr-mysql/checkout/?q=content/poll/11Browserupgrade.poll.test50PollUpgradePathTestCase->testPollUpgrade()
Choice text is displayed correctly on result viewOtherupgrade.poll.test53PollUpgradePathTestCase->testPollUpgrade()
Choice text is displayed correctly on result viewOtherupgrade.poll.test53PollUpgradePathTestCase->testPollUpgrade()
Choice text is displayed correctly on result viewOtherupgrade.poll.test53PollUpgradePathTestCase->testPollUpgrade()
Choice text is displayed correctly on result viewOtherupgrade.poll.test53PollUpgradePathTestCase->testPollUpgrade()
Choice text is displayed correctly on result viewOtherupgrade.poll.test53PollUpgradePathTestCase->testPollUpgrade()
Undefined offset: 0Noticeupgrade.poll.test61PollUpgradePathTestCase->testPollUpgrade()
Undefined offset: 0Noticeupgrade.poll.test61PollUpgradePathTestCase->testPollUpgrade()
The number of votes is displayed correctly: expected 2, got Otherupgrade.poll.test61PollUpgradePathTestCase->testPollUpgrade()
Undefined offset: 1Noticeupgrade.poll.test61PollUpgradePathTestCase->testPollUpgrade()
Undefined offset: 1Noticeupgrade.poll.test61PollUpgradePathTestCase->testPollUpgrade()
The number of votes is displayed correctly: expected 2, got Otherupgrade.poll.test61PollUpgradePathTestCase->testPollUpgrade()
Undefined offset: 2Noticeupgrade.poll.test61PollUpgradePathTestCase->testPollUpgrade()
Undefined offset: 2Noticeupgrade.poll.test61PollUpgradePathTestCase->testPollUpgrade()
The number of votes is displayed correctly: expected 2, got Otherupgrade.poll.test61PollUpgradePathTestCase->testPollUpgrade()
Undefined offset: 3Noticeupgrade.poll.test61PollUpgradePathTestCase->testPollUpgrade()
Undefined offset: 3Noticeupgrade.poll.test61PollUpgradePathTestCase->testPollUpgrade()
The number of votes is displayed correctly: expected 1, got Otherupgrade.poll.test61PollUpgradePathTestCase->testPollUpgrade()
Undefined offset: 4Noticeupgrade.poll.test61PollUpgradePathTestCase->testPollUpgrade()
Undefined offset: 4Noticeupgrade.poll.test61PollUpgradePathTestCase->testPollUpgrade()
The number of votes is displayed correctly: expected 1, got Otherupgrade.poll.test61PollUpgradePathTestCase->testPollUpgrade()
ExpandRDF mapping definition functionality (RdfMappingDefinitionTestCase) [RDF]4804
MessageGroupFilenameLineFunctionStatus
Undefined property: stdClass::$defining_moduleNoticenode.module511node_type_save()
PDOException: SQLSTATE[23000]: Integrity constraint violation: 1048 Column 'defining_module' cannot be null: INSERT INTO {node_type} (type, name, base, has_title, title_label, description, help, custom, modified, locked, disabled, defining_module, orig_type) VALUES (:db_insert_placeholder_0, :db_insert_placeholder_1, :db_insert_placeholder_2, :db_insert_placeholder_3, :db_insert_placeholder_4, :db_insert_placeholder_5, :db_insert_placeholder_6, :db_insert_placeholder_7, :db_insert_placeholder_8, :db_insert_placeholder_9, :db_insert_placeholder_10, :db_insert_placeholder_11, :db_insert_placeholder_12); Array ( [:db_insert_placeholder_0] => test_bundle_hook_install [:db_insert_placeholder_1] => qdlr0eyv [:db_insert_placeholder_2] => node_content [:db_insert_placeholder_3] => 1 [:db_insert_placeholder_4] => Title [:db_insert_placeholder_5] => [:db_insert_placeholder_6] => [:db_insert_placeholder_7] => 1 [:db_insert_placeholder_8] => 1 [:db_insert_placeholder_9] => 0 [:db_insert_placeholder_10] => 0 [:db_insert_placeholder_11] => [:db_insert_placeholder_12] => test_bundle_hook_install ) in node_type_save() (line 530 of /var/lib/drupaltestbot/sites/default/files/checkout/modules/node/node.module).Uncaught exceptiondatabase.inc1947PDOStatement->execute()
Undefined property: stdClass::$defining_moduleNoticenode.module511node_type_save()
PDOException: SQLSTATE[23000]: Integrity constraint violation: 1048 Column 'defining_module' cannot be null: INSERT INTO {node_type} (type, name, base, has_title, title_label, description, help, custom, modified, locked, disabled, defining_module, orig_type) VALUES (:db_insert_placeholder_0, :db_insert_placeholder_1, :db_insert_placeholder_2, :db_insert_placeholder_3, :db_insert_placeholder_4, :db_insert_placeholder_5, :db_insert_placeholder_6, :db_insert_placeholder_7, :db_insert_placeholder_8, :db_insert_placeholder_9, :db_insert_placeholder_10, :db_insert_placeholder_11, :db_insert_placeholder_12); Array ( [:db_insert_placeholder_0] => u7mum1b0 [:db_insert_placeholder_1] => u7mum1b0 [:db_insert_placeholder_2] => node_content [:db_insert_placeholder_3] => 1 [:db_insert_placeholder_4] => Title [:db_insert_placeholder_5] => [:db_insert_placeholder_6] => [:db_insert_placeholder_7] => 1 [:db_insert_placeholder_8] => 1 [:db_insert_placeholder_9] => 0 [:db_insert_placeholder_10] => 0 [:db_insert_placeholder_11] => [:db_insert_placeholder_12] => u7mum1b0 ) in node_type_save() (line 530 of /var/lib/drupaltestbot/sites/default/files/checkout/modules/node/node.module).Uncaught exceptiondatabase.inc1947PDOStatement->execute()

All

Test namePassFailException
Leaf403 functionality (AccessDeniedTestCase) [System]6900
Leaf404 functionality (PageNotFoundTestCase) [System]1800
LeafActions configuration (ActionsConfigurationTestCase) [Actions]3800
LeafActions executing in a potentially infinite loop (ActionLoopTestCase) [Actions]2300
LeafAdd feed functionality (AddFeedTestCase) [Aggregator]2800
LeafAdmin theme block admin accessibility (BlockAdminThemeTestCase) [Block]1800
LeafAdvanced search form (SearchAdvancedSearchForm) [Search]3100
LeafAJAX command form values (AJAXFormValuesTestCase) [AJAX]2800
LeafAJAX commands (AJAXCommandsTestCase) [AJAX]6300
LeafAJAX framework (AJAXFrameworkTestCase) [AJAX]800
LeafAJAX multi form (AJAXMultiFormTestCase) [AJAX]3500
LeafAnonymous comments (CommentAnonymous) [Comment]15600
LeafAutocompletion (ProfileTestAutocomplete) [Profile]5400
LeafBasic SQL syntax tests (DatabaseBasicSyntaxTestCase) [Database]2600
ExpandBasic upgrade path (BasicUpgradePath) [Upgrade path]421915
MessageGroupFilenameLineFunctionStatus
Undefined property: stdClass::$disabledNoticenode.module704_node_types_build()
Undefined property: stdClass::$disabledNoticenode.module724_node_types_build()
Undefined property: stdClass::$disabledNoticenode.module704_node_types_build()
Undefined property: stdClass::$disabledNoticenode.module724_node_types_build()
Undefined property: stdClass::$disabledNoticenode.module704_node_types_build()
Undefined property: stdClass::$disabledNoticenode.module724_node_types_build()
Undefined property: stdClass::$disabledNoticenode.module704_node_types_build()
Undefined property: stdClass::$disabledNoticenode.module724_node_types_build()
Failed: PDOException: SQLSTATE[42S22]: Column not found: 1054 Unknown column 'disabled' in 'where clause': SELECT nt.* FROM {node_type} nt WHERE (disabled = :db_condition_placeholder_0) ORDER BY nt.type ASC; Array ( [:db_condition_placeholder_0] => 0 ) in _node_types_build() (line 701 of /var/lib/drupaltestbot/sites/default/files/checkout/modules/node/node.module).Otherupgrade.test247UpgradePathTestCase->performUpgrade()
Failed: PDOException: SQLSTATE[01000]: Warning: 1265 Data truncated for column 'defining_module' at row 1: ALTER TABLE {node_type} CHANGE `defining_module` `defining_module` VARCHAR(255) NOT NULL COMMENT 'The module defining this node type.'; Array ( ) in db_add_field() (line 2693 of /var/lib/drupaltestbot/sites/default/files/checkout/includes/database/database.inc).Otherupgrade.test247UpgradePathTestCase->performUpgrade()
The upgrade was completed successfully.Otherupgrade.test350BasicUpgradePath->testBasicUpgrade()
SQLSTATE[42S02]: Base table or view not found: 1146 Table 'drupaltestbotmysql.simpletest764400blocked_ips' doesn't exist: SELECT 1 FROM {blocked_ips} WHERE ip = :ip; Array ( [:ip] => 127.0.0.1 ) PDOExceptionbootstrap.inc1804drupal_is_denied()
HTTP response expected 200, actual 500Browserupgrade.test354BasicUpgradePath->testBasicUpgrade()
SQLSTATE[42S02]: Base table or view not found: 1146 Table 'drupaltestbotmysql.simpletest764400blocked_ips' doesn't exist: SELECT 1 FROM {blocked_ips} WHERE ip = :ip; Array ( [:ip] => 127.0.0.1 ) PDOExceptionbootstrap.inc1804drupal_is_denied()
Undefined variable: url_targetNoticedrupal_web_test_case.php2220DrupalWebTestCase->clickLink()
Clicked link Edit () from http://pifr-mysql/checkout/?q=userBrowserupgrade.test358BasicUpgradePath->testBasicUpgrade()
We are still logged in as admin at the end of the upgrade.Otherupgrade.test359BasicUpgradePath->testBasicUpgrade()
SQLSTATE[42S02]: Base table or view not found: 1146 Table 'drupaltestbotmysql.simpletest764400blocked_ips' doesn't exist: SELECT 1 FROM {blocked_ips} WHERE ip = :ip; Array ( [:ip] => 127.0.0.1 ) PDOExceptionbootstrap.inc1804drupal_is_denied()
SQLSTATE[42S02]: Base table or view not found: 1146 Table 'drupaltestbotmysql.simpletest764400blocked_ips' doesn't exist: SELECT 1 FROM {blocked_ips} WHERE ip = :ip; Array ( [:ip] => 127.0.0.1 ) PDOExceptionbootstrap.inc1804drupal_is_denied()
Username field found.Logoutupgrade.test362BasicUpgradePath->testBasicUpgrade()
SQLSTATE[42S02]: Base table or view not found: 1146 Table 'drupaltestbotmysql.simpletest764400blocked_ips' doesn't exist: SELECT 1 FROM {blocked_ips} WHERE ip = :ip; Array ( [:ip] => 127.0.0.1 ) PDOExceptionbootstrap.inc1804drupal_is_denied()
Failed to set field name to adminOtherupgrade.test367BasicUpgradePath->testBasicUpgrade()
Failed to set field pass to adminOtherupgrade.test367BasicUpgradePath->testBasicUpgrade()
Found the Log in buttonOtherupgrade.test367BasicUpgradePath->testBasicUpgrade()
Found the requested form fields at userOtherupgrade.test367BasicUpgradePath->testBasicUpgrade()
User admin successfully logged in.User loginupgrade.test367BasicUpgradePath->testBasicUpgrade()
SQLSTATE[42S02]: Base table or view not found: 1146 Table 'drupaltestbotmysql.simpletest764400blocked_ips' doesn't exist: SELECT 1 FROM {blocked_ips} WHERE ip = :ip; Array ( [:ip] => 127.0.0.1 ) PDOExceptionbootstrap.inc1804drupal_is_denied()
"Content" foundOtherupgrade.test374BasicUpgradePath->testBasicUpgrade()
"Appearance" foundOtherupgrade.test375BasicUpgradePath->testBasicUpgrade()
"People" foundOtherupgrade.test376BasicUpgradePath->testBasicUpgrade()
"Configuration" foundOtherupgrade.test377BasicUpgradePath->testBasicUpgrade()
"Reports" foundOtherupgrade.test378BasicUpgradePath->testBasicUpgrade()
"Structure" foundOtherupgrade.test379BasicUpgradePath->testBasicUpgrade()
"Modules" foundOtherupgrade.test380BasicUpgradePath->testBasicUpgrade()
LeafBatch percentages (BatchPercentagesUnitTestCase) [Batch API]1300
LeafBatch processing (BatchProcessingTestCase) [Batch API]14300
LeafBatch progress page (BatchPageTestCase) [Batch API]700
LeafBike shed (SearchBikeShed) [Search]1600
ExpandBlock availability (BookBlockTestCase) [Book]011
MessageGroupFilenameLineFunctionStatus
The test did not complete due to a fatal error.Completion checkbook.test267BookBlockTestCase->testBookNavigationBlock()
Undefined property: stdClass::$defining_moduleNoticenode.module511node_type_save()
LeafBlock availability (NodeBlockTestCase) [Node]1800
LeafBlock availability (PollBlockTestCase) [Poll]10000
LeafBlock availability (ProfileBlockTestCase) [Profile]9000
LeafBlock availability (SearchBlockTestCase) [Search]5100
LeafBlock caching (BlockCacheTestCase) [Block]22800
LeafBlock functionality (BlockTestCase) [Block]26800
LeafBlock functionality (SystemBlockTestCase) [System]3400
LeafBlock HTML id (BlockHTMLIdTestCase) [Block]1500
LeafBlog functionality (BlogTestCase) [Blog]24100
ExpandBook functionality (BookTestCase) [Book]011
MessageGroupFilenameLineFunctionStatus
The test did not complete due to a fatal error.Completion checkbook.test62BookTestCase->testBook()
Undefined property: stdClass::$defining_moduleNoticenode.module511node_type_save()
LeafBoot and exit hook invocation (HookBootExitTestCase) [Bootstrap]1800
LeafCache clear test (CacheClearCase) [Cache]1300
LeafCache emptiness test (CacheIsEmptyCase) [Cache]500
LeafCache saving test (CacheSavingCase) [Cache]500
LeafCancel account (UserCancelTestCase) [User]23700
LeafCascading stylesheets (CascadingStylesheetsTestCase) [System]2100
LeafCategorize feed functionality (CategorizeFeedTestCase) [Aggregator]1900
LeafCategorize feed item functionality (CategorizeFeedItemTestCase) [Aggregator]5300
LeafChecks display of aggregator items (AggregatorRenderingTestCase) [Aggregator]6800
LeafCJK tokenizer (SearchTokenizerTestCase) [Search]200
LeafColor functionality (ColorTestCase) [Color]6100
LeafComment approval (CommentApprovalTest) [Comment]15400
LeafComment blocks (CommentBlockFunctionalTest) [Comment]11500
LeafComment count toggle (SearchCommentCountToggleTestCase) [Search]3000
LeafComment interface (CommentInterfaceTest) [Comment]22300
LeafComment paging settings (CommentPagerTest) [Comment]20800
LeafComment preview (CommentPreviewTest) [Comment]7200
LeafComment Rebuild (CommentContentRebuild) [Comment]3200
LeafComment RSS (CommentRSSUnitTest) [Comment]2400
LeafComment Search tests (SearchCommentTestCase) [Search]13900
LeafComment token replacement (CommentTokenReplaceTestCase) [Comment]6400
LeafCompact mode (CompactModeTest) [System]2600
LeafConfig settings form (SearchConfigSettingsForm) [Search]11600
LeafConnection tests (DatabaseConnectionTestCase) [Database]3400
LeafContent language settings (LocaleContentFunctionalTest) [Locale]6400
LeafCore filters (FilterUnitTestCase) [Filter]13300
LeafCron run (CronRunTestCase) [System]4500
LeafCSS Unit Tests (CascadingStylesheetsUnitTest) [System]600
LeafCustom query syntax tests (DatabaseQueryTestCase) [Database]600
LeafDashboard access (DashboardAccessTestCase) [Dashboard]3400
LeafData API functions (DrupalDataApiTest) [System]3200
LeafDate and time (DateTimeFunctionalTest) [System]9600
LeafDBLog functionality (DBLogTestCase) [DBLog]44000
LeafDefault text format functionality (FilterDefaultFormatTestCase) [Filter]3300
LeafDelete/Truncate tests (DatabaseDeleteTruncateTestCase) [Database]2000
LeafDrupal error handlers (DrupalErrorHandlerUnitTest) [System]2800
LeafDrupal goto (DrupalGotoTest) [System]1800
LeafDrupal HTTP request (DrupalHTTPRequestTestCase) [System]2700
LeafDrupal match path (DrupalMatchPathTestCase) [Path API]4100
LeafDrupal render (DrupalRenderUnitTestCase) [System]700
LeafDrupal set/get regions (DrupalSetContentTestCase) [System]3800
LeafDrupal tags handling (DrupalTagsHandlingTestCase) [System]800
Leafdrupal_alter() tests (DrupalAlterTestCase) [System]500
LeafEmbedded forms (SearchEmbedForm) [Search]2900
LeafEmpty statement (DatabaseEmptyStatementTestCase) [Database]400
LeafEnable/disable modules (EnableDisableTestCase) [Module]5500
LeafEntity query (EntityFieldQueryTestCase) [Entity API]7300
LeafFeed parser functionality (FeedParserTestCase) [Aggregator]4000
LeafFetch tests (DatabaseFetchTestCase) [Database]3300
LeafFetch tests, part 2 (DatabaseFetch2TestCase) [Database]2600
LeafFetching multiple cache items (CacheGetMultipleUnitTest) [Cache]700
LeafField attach tests (other) (FieldAttachOtherTestCase) [Field API]4400
LeafField attach tests (storage-related) (FieldAttachStorageTestCase) [Field API]8300
LeafField bulk delete tests (FieldBulkDeleteTestCase) [Field API]4000
LeafField CRUD tests (FieldCrudTestCase) [Field API]5900
LeafField Display API tests (FieldDisplayAPITestCase) [Field API]4200
LeafField form tests (FieldFormTestCase) [Field API]16600
LeafField info tests (FieldInfoTestCase) [Field API]7900
LeafField instance CRUD tests (FieldInstanceCrudTestCase) [Field API]3200
LeafField SQL storage tests (FieldSqlStorageTestCase) [Field API]8300
LeafField translations tests (FieldTranslationsTestCase) [Field API]5200
ExpandField UI tests (FieldUITestCase) [Field UI]811
MessageGroupFilenameLineFunctionStatus
The test did not complete due to a fatal error.Completion checkfield_ui.test47FieldUITestCase->testCRUDFields()
Undefined property: stdClass::$defining_moduleNoticenode.module511node_type_save()
LeafFile copying (FileCopyTest) [File API]10600
LeafFile delete (FileDeleteTest) [File API]1800
LeafFile download (FileDownloadTest) [File API]3500
LeafFile field display tests (FileFieldDisplayTestCase) [File]2000
LeafFile field file path tests (FileFieldPathTestCase) [File]2300
LeafFile field revision test (FileFieldRevisionTestCase) [File]6700
LeafFile field validation tests (FileFieldValidateTestCase) [File]10200
LeafFile field widget test (FileFieldWidgetTestCase) [File]11400
LeafFile loading (FileLoadTest) [File API]2900
LeafFile mimetypes (FileMimeTypeTest) [File API]3800
LeafFile moving (FileMoveTest) [File API]10500
LeafFile naming (FileNameMungingTest) [File API]400
LeafFile paths and directories (FileDirectoryTest) [File API]2000
LeafFile save data (FileSaveDataTest) [File API]8800
LeafFile saving (FileSaveTest) [File API]1400
LeafFile scan directory (FileScanDirectoryTest) [File API]2300
LeafFile space used tests (FileSpaceUsedTest) [File API]1100
LeafFile token replacement (FileTokenReplaceTestCase) [File]3500
LeafFile uploading (FileSaveUploadTest) [File API]26300
LeafFile URL rewriting (FileURLRewritingTest) [File]1500
LeafFile usage (FileUsageTest) [File]2000
LeafFile validate (FileValidateTest) [File API]1100
LeafFile validator tests (FileValidatorTest) [File API]2700
LeafFileTransfer unit tests (FileTranferTest) [System]200
LeafFilter administration functionality (FilterAdminTestCase) [Filter]14500
LeafFilter CRUD operations (FilterCRUDTestCase) [Filter]21500
LeafFilter format access (FilterFormatAccessTestCase) [Filter]13400
LeafFilter format hooks (FilterHooksTestCase) [Filter]3300
LeafFingerprinting meta tag (AdminMetaTagTestCase) [System]300
LeafFlood control mechanism (FloodFunctionalTest) [System]600
LeafForm alter hooks (FormAlterTestCase) [Form API]300
LeafForm API file inclusion (FormsFileInclusionTestCase) [Form API]900
LeafForm element and label output test (FormsElementsLabelsTestCase) [Form API]1500
LeafForm element validation (FormsTestCase) [Form API]29700
LeafForm rebuilding (FormsRebuildTestCase) [Form API]4900
LeafForm state values clearance (FormStateValuesCleanTestCase) [Form API]1300
LeafForm triggering element determination (FormsTriggeringElementTestCase) [Form API]4800
LeafForm validation handlers (FormValidationTestCase) [Form API]3000
LeafForm wrapper callback (FormsFormWrapperTestCase) [Form API]400
LeafFormat date (FormatDateUnitTest) [System]4300
LeafForum functionality (ForumTestCase) [Forum]78700
LeafFront page (FrontPageTestCase) [System]3600
LeafGet filename test (BootstrapGetFilenameTestCase) [Bootstrap]400
LeafGraph (GraphUnitTest) [System]2800
LeafHelp functionality (HelpTestCase) [Help]30800
LeafHTML Attributes (DrupalAttributesUnitTest) [System]600
LeafHTML identifiers (DrupalHTMLIdentifierTestCase) [System]1000
LeafHTML in page titles (PageTitleFiltering) [System]4000
LeafHTTP file retrieval (RetrieveFileTestCase) [System]700
LeafImage effects (ImageEffectsUnitTest) [Image]3800
LeafImage field display tests (ImageFieldDisplayTestCase) [Image]10400
LeafImage field validation tests (ImageFieldValidateTestCase) [Image]2600
LeafImage GD manipulation tests (ImageToolkitGdTestCase) [Image]100
LeafImage styles and effects UI configuration (ImageAdminStylesUnitTest) [Image]26200
LeafImage styles path and URL functions (ImageStylesPathAndUrlUnitTest) [Image]2100
LeafImage toolkit tests (ImageToolkitUnitTest) [Image]4400
LeafImport feeds from OPML functionality (ImportOPMLTestCase) [Aggregator]5300
LeafInfo file format parser (InfoFileParserTestCase) [System]900
LeafInsert tests (DatabaseInsertTestCase) [Database]4500
LeafInsert tests, default fields (DatabaseInsertDefaultsTestCase) [Database]1900
LeafInsert tests, LOB fields (DatabaseInsertLOBTestCase) [Database]1300
LeafInvalid data (DatabaseInvalidDataTestCase) [Database]700
LeafIP address and HTTP_HOST test (BootstrapIPAddressTestCase) [Bootstrap]1100
LeafIP address blocking (IPAddressBlockingTestCase) [System]4200
LeafJavaScript (JavaScriptTestCase) [System]3500
LeafJSON (DrupalJSONTest) [System]1400
LeafKeywords and conditions (SearchKeywordsConditions) [Search]2500
LeafLanguage configuration (LocaleConfigurationTest) [Locale]7800
LeafLanguage switching (LocaleLanguageSwitchingFunctionalTest) [Locale]2100
LeafList field (ListFieldTestCase) [Field types]1400
ExpandList field UI (ListFieldUITestCase) [Field types]811
MessageGroupFilenameLineFunctionStatus
The test did not complete due to a fatal error.Completion checklist.test134ListFieldUITestCase->testAllowedValues()
Undefined property: stdClass::$defining_moduleNoticenode.module511node_type_save()
LeafLoad multiple nodes (NodeLoadMultipleUnitTest) [Node]3600
LeafLocale uninstall (EN) (LocaleUninstallFunctionalTest) [Locale]3100
LeafLocale uninstall (FR) (LocaleUninstallFrenchFunctionalTest) [Locale]3100
LeafLocalize date formats (LocaleDateFormatsFunctionalTest) [Locale]3500
LeafLocking framework tests (LockFunctionalTest) [System]1700
LeafMail system (MailTestCase) [System]100
LeafMain content rendering fallback (SystemMainContentFallback) [System]6600
LeafMenu link creation/deletion (MenuTestCase) [Menu]64400
LeafMenu rebuild test (MenuRebuildTestCase) [Menu]500
LeafMenu router (MenuRouterTestCase) [Menu]15900
LeafMenu settings for nodes (MenuNodeTestCase) [Menu]4700
LeafMenu tree generation (MenuTreeDataTestCase) [Menu]400
LeafMerge tests (DatabaseMergeTestCase) [Database]7500
LeafMiscellaneous AJAX tests (AJAXElementValidation) [AJAX]800
LeafMissing update dependencies (UpdateDependencyMissingTestCase) [Update API]300
LeafModule API (ModuleUnitTest) [Module]3300
ExpandModule dependencies (ModuleDependencyTestCase) [Module]9411
MessageGroupFilenameLineFunctionStatus
Attempt to create an instance of field taxonomy_forums on bundle forum that already has an instance of that field.FieldExceptionfield.crud.inc673field_create_instance()
Modules status has been updated.Othersystem.test318ModuleDependencyTestCase->testEnableForumTaxonomyFieldDependency()
LeafModule installation (ModuleInstallTestCase) [Module]200
LeafModule uninstallation (ModuleUninstallTestCase) [Module]100
LeafModule versions (ModuleVersionTestCase) [Module]5000
LeafMultilingual fields (LocaleMultilingualFieldsFunctionalTest) [Locale]5200
LeafMultistep form using form storage (FormsFormStorageTestCase) [Form API]16100
LeafMultistep node form basic options (MultiStepNodeFormBasicOptionsTest) [Node]1500
LeafNew default theme blocks (NewDefaultThemeBlocks) [Block]2400
LeafNo help (NoHelpTestCase) [Help]1100
LeafNode access (NodeAccessUnitTest) [Node]3100
LeafNode access rebuild (NodeAccessRebuildTestCase) [Node]1600
LeafNode access records (NodeAccessRecordsUnitTest) [Node]2200
LeafNode administration (NodeAdminTestCase) [Node]11900
LeafNode blocks (NodeBlockFunctionalTest) [Node]8300
LeafNode creation (NodeCreationTestCase) [Node]2500
LeafNode edit (PageEditTestCase) [Node]9300
LeafNode edit permissions (PageViewTestCase) [Node]3200
LeafNode entity query alter (NodeEntityFieldQueryAlter) [Node]3000
LeafNode feed (NodeFeedTestCase) [Node]100
LeafNode post information display (NodePostSettingsTestCase) [Node]3400
LeafNode preview (PagePreviewTestCase) [Node]3500
LeafNode query alter (NodeQueryAlter) [Node]5100
LeafNode revisions (NodeRevisionsTestCase) [Node]4400
LeafNode RSS Content (NodeRSSContentTestCase) [Node]1600
LeafNode save (NodeSaveTestCase) [Node]2800
LeafNode title (NodeTitleTestCase) [Node]2000
LeafNode title XSS filtering (NodeTitleXSSTestCase) [Node]2000
LeafNode token replacement (NodeTokenReplaceTestCase) [Node]3400
LeafNode type persist (NodeTypePersistTestCase) [Node]6200
ExpandNode types (NodeTypeTestCase) [Node]5202
MessageGroupFilenameLineFunctionStatus
Undefined property: stdClass::$defining_moduleNoticenode.module511node_type_save()
PDOException: SQLSTATE[23000]: Integrity constraint violation: 1048 Column 'defining_module' cannot be null: INSERT INTO {node_type} (type, name, base, has_title, title_label, description, help, custom, modified, locked, disabled, defining_module, orig_type) VALUES (:db_insert_placeholder_0, :db_insert_placeholder_1, :db_insert_placeholder_2, :db_insert_placeholder_3, :db_insert_placeholder_4, :db_insert_placeholder_5, :db_insert_placeholder_6, :db_insert_placeholder_7, :db_insert_placeholder_8, :db_insert_placeholder_9, :db_insert_placeholder_10, :db_insert_placeholder_11, :db_insert_placeholder_12); Array ( [:db_insert_placeholder_0] => wrbln54v [:db_insert_placeholder_1] => wrbln54v [:db_insert_placeholder_2] => node_content [:db_insert_placeholder_3] => 1 [:db_insert_placeholder_4] => Title [:db_insert_placeholder_5] => [:db_insert_placeholder_6] => [:db_insert_placeholder_7] => 1 [:db_insert_placeholder_8] => 1 [:db_insert_placeholder_9] => 0 [:db_insert_placeholder_10] => 0 [:db_insert_placeholder_11] => [:db_insert_placeholder_12] => wrbln54v ) in node_type_save() (line 530 of /var/lib/drupaltestbot/sites/default/files/checkout/modules/node/node.module).Uncaught exceptiondatabase.inc1947PDOStatement->execute()
LeafNon default theme admin (NonDefaultBlockAdmin) [Block]1000
LeafOpenID account registration (OpenIDRegistrationTestCase) [OpenID]13100
LeafOpenID discovery and login (OpenIDFunctionalTestCase) [OpenID]24800
LeafOpenID helper functions (OpenIDUnitTest) [OpenID]3200
LeafOptions widgets (OptionsWidgetsTestCase) [Field types]22900
LeafPage cache test (BootstrapPageCacheTestCase) [Bootstrap]7800
LeafPager query tests (DatabaseSelectPagerDefaultTestCase) [Database]3400
LeafParsing .info files (ParseInfoFilesTestCase) [System]300
LeafPath alias functionality (PathTestCase) [Path]10200
LeafPath aliases with languages (PathLanguageUITestCase) [Path]6900
LeafPath aliases with translated nodes (PathLanguageTestCase) [Path]6300
LeafPath language settings (LocalePathFunctionalTest) [Locale]3600
LeafPaths on non-English monolingual sites (PathMonolingualTestCase) [Path]3400
LeafPersonal contact form (ContactPersonalTestCase) [Contact]14200
LeafPHP filter access check (PHPAccessTestCase) [PHP]3700
LeafPHP filter functionality (PHPFilterTestCase) [PHP]4100
LeafPoll add choice (PollJSAddChoice) [Poll]1500
LeafPoll create (PollCreateTestCase) [Poll]12100
LeafPoll expiration (PollExpirationTestCase) [Poll]3200
LeafPoll token replacement (PollTokenReplaceTestCase) [Poll]10600
ExpandPoll upgrade path (PollUpgradePathTestCase) [Upgrade path]41140115
MessageGroupFilenameLineFunctionStatus
Undefined property: stdClass::$disabledNoticenode.module704_node_types_build()
Undefined property: stdClass::$disabledNoticenode.module724_node_types_build()
Undefined property: stdClass::$disabledNoticenode.module704_node_types_build()
Undefined property: stdClass::$disabledNoticenode.module704_node_types_build()
Undefined property: stdClass::$disabledNoticenode.module724_node_types_build()
SQLSTATE[42S22]: Column not found: 1054 Unknown column 'base' in 'field list': UPDATE {node_type} SET type=:db_update_placeholder_0, name=:db_update_placeholder_1, base=:db_update_placeholder_2, has_title=:db_update_placeholder_3, title_label=:db_update_placeholder_4, description=:db_update_placeholder_5, help=:db_update_placeholder_6, custom=:db_update_placeholder_7, modified=:db_update_placeholder_8, locked=:db_update_placeholder_9, disabled=:db_update_placeholder_10, defining_module=:db_update_placeholder_11 WHERE (type = :db_condition_placeholder_0) ; Array ( [:db_update_placeholder_0] => poll [:db_update_placeholder_1] => Poll [:db_update_placeholder_2] => poll [:db_update_placeholder_3] => 1 [:db_update_placeholder_4] => Question [:db_update_placeholder_5] => A poll is a question with a set of possible responses. A poll, once created, automatically provides a simple running count of the number of votes received for each response. [:db_update_placeholder_6] => [:db_update_placeholder_7] => 0 [:db_update_placeholder_8] => 0 [:db_update_placeholder_9] => 1 [:db_update_placeholder_10] => 0 [:db_update_placeholder_11] => poll [:db_condition_placeholder_0] => poll ) PDOExceptionnode.module518node_type_save()
HTTP response expected 200, actual 500Browserupgrade.test238UpgradePathTestCase->performUpgrade()
The upgrade was completed successfully.Otherupgrade.poll.test34PollUpgradePathTestCase->testPollUpgrade()
SQLSTATE[42S02]: Base table or view not found: 1146 Table 'drupaltestbotmysql.simpletest95493blocked_ips' doesn't exist: SELECT 1 FROM {blocked_ips} WHERE ip = :ip; Array ( [:ip] => 127.0.0.1 ) PDOExceptionbootstrap.inc1804drupal_is_denied()
SQLSTATE[42S02]: Base table or view not found: 1146 Table 'drupaltestbotmysql.simpletest95493blocked_ips' doesn't exist: SELECT 1 FROM {blocked_ips} WHERE ip = :ip; Array ( [:ip] => 127.0.0.1 ) PDOExceptionbootstrap.inc1804drupal_is_denied()
Choice text is displayed correctly on poll viewOtherupgrade.poll.test46PollUpgradePathTestCase->testPollUpgrade()
Choice text is displayed correctly on poll viewOtherupgrade.poll.test46PollUpgradePathTestCase->testPollUpgrade()
Undefined variable: url_targetNoticedrupal_web_test_case.php2220DrupalWebTestCase->clickLink()
Clicked link Results () from http://pifr-mysql/checkout/?q=content/poll/0Browserupgrade.poll.test50PollUpgradePathTestCase->testPollUpgrade()
Choice text is displayed correctly on result viewOtherupgrade.poll.test53PollUpgradePathTestCase->testPollUpgrade()
Choice text is displayed correctly on result viewOtherupgrade.poll.test53PollUpgradePathTestCase->testPollUpgrade()
Undefined offset: 0Noticeupgrade.poll.test61PollUpgradePathTestCase->testPollUpgrade()
Undefined offset: 0Noticeupgrade.poll.test61PollUpgradePathTestCase->testPollUpgrade()
The number of votes is displayed correctly: expected 3, got Otherupgrade.poll.test61PollUpgradePathTestCase->testPollUpgrade()
Undefined offset: 1Noticeupgrade.poll.test61PollUpgradePathTestCase->testPollUpgrade()
Undefined offset: 1Noticeupgrade.poll.test61PollUpgradePathTestCase->testPollUpgrade()
The number of votes is displayed correctly: expected 2, got Otherupgrade.poll.test61PollUpgradePathTestCase->testPollUpgrade()
SQLSTATE[42S02]: Base table or view not found: 1146 Table 'drupaltestbotmysql.simpletest95493blocked_ips' doesn't exist: SELECT 1 FROM {blocked_ips} WHERE ip = :ip; Array ( [:ip] => 127.0.0.1 ) PDOExceptionbootstrap.inc1804drupal_is_denied()
Choice text is displayed correctly on poll viewOtherupgrade.poll.test46PollUpgradePathTestCase->testPollUpgrade()
Choice text is displayed correctly on poll viewOtherupgrade.poll.test46PollUpgradePathTestCase->testPollUpgrade()
Choice text is displayed correctly on poll viewOtherupgrade.poll.test46PollUpgradePathTestCase->testPollUpgrade()
Undefined variable: url_targetNoticedrupal_web_test_case.php2220DrupalWebTestCase->clickLink()
Clicked link Results () from http://pifr-mysql/checkout/?q=content/poll/1Browserupgrade.poll.test50PollUpgradePathTestCase->testPollUpgrade()
Choice text is displayed correctly on result viewOtherupgrade.poll.test53PollUpgradePathTestCase->testPollUpgrade()
Choice text is displayed correctly on result viewOtherupgrade.poll.test53PollUpgradePathTestCase->testPollUpgrade()
Choice text is displayed correctly on result viewOtherupgrade.poll.test53PollUpgradePathTestCase->testPollUpgrade()
Undefined offset: 0Noticeupgrade.poll.test61PollUpgradePathTestCase->testPollUpgrade()
Undefined offset: 0Noticeupgrade.poll.test61PollUpgradePathTestCase->testPollUpgrade()
The number of votes is displayed correctly: expected 2, got Otherupgrade.poll.test61PollUpgradePathTestCase->testPollUpgrade()
Undefined offset: 1Noticeupgrade.poll.test61PollUpgradePathTestCase->testPollUpgrade()
Undefined offset: 1Noticeupgrade.poll.test61PollUpgradePathTestCase->testPollUpgrade()
The number of votes is displayed correctly: expected 2, got Otherupgrade.poll.test61PollUpgradePathTestCase->testPollUpgrade()
Undefined offset: 2Noticeupgrade.poll.test61PollUpgradePathTestCase->testPollUpgrade()
Undefined offset: 2Noticeupgrade.poll.test61PollUpgradePathTestCase->testPollUpgrade()
The number of votes is displayed correctly: expected 2, got Otherupgrade.poll.test61PollUpgradePathTestCase->testPollUpgrade()
SQLSTATE[42S02]: Base table or view not found: 1146 Table 'drupaltestbotmysql.simpletest95493blocked_ips' doesn't exist: SELECT 1 FROM {blocked_ips} WHERE ip = :ip; Array ( [:ip] => 127.0.0.1 ) PDOExceptionbootstrap.inc1804drupal_is_denied()
Choice text is displayed correctly on poll viewOtherupgrade.poll.test46PollUpgradePathTestCase->testPollUpgrade()
Choice text is displayed correctly on poll viewOtherupgrade.poll.test46PollUpgradePathTestCase->testPollUpgrade()
Choice text is displayed correctly on poll viewOtherupgrade.poll.test46PollUpgradePathTestCase->testPollUpgrade()
Choice text is displayed correctly on poll viewOtherupgrade.poll.test46PollUpgradePathTestCase->testPollUpgrade()
Undefined variable: url_targetNoticedrupal_web_test_case.php2220DrupalWebTestCase->clickLink()
Clicked link Results () from http://pifr-mysql/checkout/?q=content/poll/2Browserupgrade.poll.test50PollUpgradePathTestCase->testPollUpgrade()
Choice text is displayed correctly on result viewOtherupgrade.poll.test53PollUpgradePathTestCase->testPollUpgrade()
Choice text is displayed correctly on result viewOtherupgrade.poll.test53PollUpgradePathTestCase->testPollUpgrade()
Choice text is displayed correctly on result viewOtherupgrade.poll.test53PollUpgradePathTestCase->testPollUpgrade()
Choice text is displayed correctly on result viewOtherupgrade.poll.test53PollUpgradePathTestCase->testPollUpgrade()
Undefined offset: 0Noticeupgrade.poll.test61PollUpgradePathTestCase->testPollUpgrade()
Undefined offset: 0Noticeupgrade.poll.test61PollUpgradePathTestCase->testPollUpgrade()
The number of votes is displayed correctly: expected 2, got Otherupgrade.poll.test61PollUpgradePathTestCase->testPollUpgrade()
Undefined offset: 1Noticeupgrade.poll.test61PollUpgradePathTestCase->testPollUpgrade()
Undefined offset: 1Noticeupgrade.poll.test61PollUpgradePathTestCase->testPollUpgrade()
The number of votes is displayed correctly: expected 2, got Otherupgrade.poll.test61PollUpgradePathTestCase->testPollUpgrade()
Undefined offset: 2Noticeupgrade.poll.test61PollUpgradePathTestCase->testPollUpgrade()
Undefined offset: 2Noticeupgrade.poll.test61PollUpgradePathTestCase->testPollUpgrade()
The number of votes is displayed correctly: expected 2, got Otherupgrade.poll.test61PollUpgradePathTestCase->testPollUpgrade()
Undefined offset: 3Noticeupgrade.poll.test61PollUpgradePathTestCase->testPollUpgrade()
Undefined offset: 3Noticeupgrade.poll.test61PollUpgradePathTestCase->testPollUpgrade()
The number of votes is displayed correctly: expected 1, got Otherupgrade.poll.test61PollUpgradePathTestCase->testPollUpgrade()
SQLSTATE[42S02]: Base table or view not found: 1146 Table 'drupaltestbotmysql.simpletest95493blocked_ips' doesn't exist: SELECT 1 FROM {blocked_ips} WHERE ip = :ip; Array ( [:ip] => 127.0.0.1 ) PDOExceptionbootstrap.inc1804drupal_is_denied()
Choice text is displayed correctly on poll viewOtherupgrade.poll.test46PollUpgradePathTestCase->testPollUpgrade()
Choice text is displayed correctly on poll viewOtherupgrade.poll.test46PollUpgradePathTestCase->testPollUpgrade()
Choice text is displayed correctly on poll viewOtherupgrade.poll.test46PollUpgradePathTestCase->testPollUpgrade()
Choice text is displayed correctly on poll viewOtherupgrade.poll.test46PollUpgradePathTestCase->testPollUpgrade()
Choice text is displayed correctly on poll viewOtherupgrade.poll.test46PollUpgradePathTestCase->testPollUpgrade()
Undefined variable: url_targetNoticedrupal_web_test_case.php2220DrupalWebTestCase->clickLink()
Clicked link Results () from http://pifr-mysql/checkout/?q=content/poll/3Browserupgrade.poll.test50PollUpgradePathTestCase->testPollUpgrade()
Choice text is displayed correctly on result viewOtherupgrade.poll.test53PollUpgradePathTestCase->testPollUpgrade()
Choice text is displayed correctly on result viewOtherupgrade.poll.test53PollUpgradePathTestCase->testPollUpgrade()
Choice text is displayed correctly on result viewOtherupgrade.poll.test53PollUpgradePathTestCase->testPollUpgrade()
Choice text is displayed correctly on result viewOtherupgrade.poll.test53PollUpgradePathTestCase->testPollUpgrade()
Choice text is displayed correctly on result viewOtherupgrade.poll.test53PollUpgradePathTestCase->testPollUpgrade()
Undefined offset: 0Noticeupgrade.poll.test61PollUpgradePathTestCase->testPollUpgrade()
Undefined offset: 0Noticeupgrade.poll.test61PollUpgradePathTestCase->testPollUpgrade()
The number of votes is displayed correctly: expected 2, got Otherupgrade.poll.test61PollUpgradePathTestCase->testPollUpgrade()
Undefined offset: 1Noticeupgrade.poll.test61PollUpgradePathTestCase->testPollUpgrade()
Undefined offset: 1Noticeupgrade.poll.test61PollUpgradePathTestCase->testPollUpgrade()
The number of votes is displayed correctly: expected 2, got Otherupgrade.poll.test61PollUpgradePathTestCase->testPollUpgrade()
Undefined offset: 2Noticeupgrade.poll.test61PollUpgradePathTestCase->testPollUpgrade()
Undefined offset: 2Noticeupgrade.poll.test61PollUpgradePathTestCase->testPollUpgrade()
The number of votes is displayed correctly: expected 2, got Otherupgrade.poll.test61PollUpgradePathTestCase->testPollUpgrade()
Undefined offset: 3Noticeupgrade.poll.test61PollUpgradePathTestCase->testPollUpgrade()
Undefined offset: 3Noticeupgrade.poll.test61PollUpgradePathTestCase->testPollUpgrade()
The number of votes is displayed correctly: expected 1, got Otherupgrade.poll.test61PollUpgradePathTestCase->testPollUpgrade()
Undefined offset: 4Noticeupgrade.poll.test61PollUpgradePathTestCase->testPollUpgrade()
Undefined offset: 4Noticeupgrade.poll.test61PollUpgradePathTestCase->testPollUpgrade()
The number of votes is displayed correctly: expected 1, got Otherupgrade.poll.test61PollUpgradePathTestCase->testPollUpgrade()
SQLSTATE[42S02]: Base table or view not found: 1146 Table 'drupaltestbotmysql.simpletest95493blocked_ips' doesn't exist: SELECT 1 FROM {blocked_ips} WHERE ip = :ip; Array ( [:ip] => 127.0.0.1 ) PDOExceptionbootstrap.inc1804drupal_is_denied()
Choice text is displayed correctly on poll viewOtherupgrade.poll.test46PollUpgradePathTestCase->testPollUpgrade()
Choice text is displayed correctly on poll viewOtherupgrade.poll.test46PollUpgradePathTestCase->testPollUpgrade()
Undefined variable: url_targetNoticedrupal_web_test_case.php2220DrupalWebTestCase->clickLink()
Clicked link Results () from http://pifr-mysql/checkout/?q=content/poll/4Browserupgrade.poll.test50PollUpgradePathTestCase->testPollUpgrade()
Choice text is displayed correctly on result viewOtherupgrade.poll.test53PollUpgradePathTestCase->testPollUpgrade()
Choice text is displayed correctly on result viewOtherupgrade.poll.test53PollUpgradePathTestCase->testPollUpgrade()
Undefined offset: 0Noticeupgrade.poll.test61PollUpgradePathTestCase->testPollUpgrade()
Undefined offset: 0Noticeupgrade.poll.test61PollUpgradePathTestCase->testPollUpgrade()
The number of votes is displayed correctly: expected 3, got Otherupgrade.poll.test61PollUpgradePathTestCase->testPollUpgrade()
Undefined offset: 1Noticeupgrade.poll.test61PollUpgradePathTestCase->testPollUpgrade()
Undefined offset: 1Noticeupgrade.poll.test61PollUpgradePathTestCase->testPollUpgrade()
The number of votes is displayed correctly: expected 2, got Otherupgrade.poll.test61PollUpgradePathTestCase->testPollUpgrade()
SQLSTATE[42S02]: Base table or view not found: 1146 Table 'drupaltestbotmysql.simpletest95493blocked_ips' doesn't exist: SELECT 1 FROM {blocked_ips} WHERE ip = :ip; Array ( [:ip] => 127.0.0.1 ) PDOExceptionbootstrap.inc1804drupal_is_denied()
Choice text is displayed correctly on poll viewOtherupgrade.poll.test46PollUpgradePathTestCase->testPollUpgrade()
Choice text is displayed correctly on poll viewOtherupgrade.poll.test46PollUpgradePathTestCase->testPollUpgrade()
Choice text is displayed correctly on poll viewOtherupgrade.poll.test46PollUpgradePathTestCase->testPollUpgrade()
Undefined variable: url_targetNoticedrupal_web_test_case.php2220DrupalWebTestCase->clickLink()
Clicked link Results () from http://pifr-mysql/checkout/?q=content/poll/5Browserupgrade.poll.test50PollUpgradePathTestCase->testPollUpgrade()
Choice text is displayed correctly on result viewOtherupgrade.poll.test53PollUpgradePathTestCase->testPollUpgrade()
Choice text is displayed correctly on result viewOtherupgrade.poll.test53PollUpgradePathTestCase->testPollUpgrade()
Choice text is displayed correctly on result viewOtherupgrade.poll.test53PollUpgradePathTestCase->testPollUpgrade()
Undefined offset: 0Noticeupgrade.poll.test61PollUpgradePathTestCase->testPollUpgrade()
Undefined offset: 0Noticeupgrade.poll.test61PollUpgradePathTestCase->testPollUpgrade()
The number of votes is displayed correctly: expected 2, got Otherupgrade.poll.test61PollUpgradePathTestCase->testPollUpgrade()
Undefined offset: 1Noticeupgrade.poll.test61PollUpgradePathTestCase->testPollUpgrade()
Undefined offset: 1Noticeupgrade.poll.test61PollUpgradePathTestCase->testPollUpgrade()
The number of votes is displayed correctly: expected 2, got Otherupgrade.poll.test61PollUpgradePathTestCase->testPollUpgrade()
Undefined offset: 2Noticeupgrade.poll.test61PollUpgradePathTestCase->testPollUpgrade()
Undefined offset: 2Noticeupgrade.poll.test61PollUpgradePathTestCase->testPollUpgrade()
The number of votes is displayed correctly: expected 2, got Otherupgrade.poll.test61PollUpgradePathTestCase->testPollUpgrade()
SQLSTATE[42S02]: Base table or view not found: 1146 Table 'drupaltestbotmysql.simpletest95493blocked_ips' doesn't exist: SELECT 1 FROM {blocked_ips} WHERE ip = :ip; Array ( [:ip] => 127.0.0.1 ) PDOExceptionbootstrap.inc1804drupal_is_denied()
Choice text is displayed correctly on poll viewOtherupgrade.poll.test46PollUpgradePathTestCase->testPollUpgrade()
Choice text is displayed correctly on poll viewOtherupgrade.poll.test46PollUpgradePathTestCase->testPollUpgrade()
Choice text is displayed correctly on poll viewOtherupgrade.poll.test46PollUpgradePathTestCase->testPollUpgrade()
Choice text is displayed correctly on poll viewOtherupgrade.poll.test46PollUpgradePathTestCase->testPollUpgrade()
Undefined variable: url_targetNoticedrupal_web_test_case.php2220DrupalWebTestCase->clickLink()
Clicked link Results () from http://pifr-mysql/checkout/?q=content/poll/6Browserupgrade.poll.test50PollUpgradePathTestCase->testPollUpgrade()
Choice text is displayed correctly on result viewOtherupgrade.poll.test53PollUpgradePathTestCase->testPollUpgrade()
Choice text is displayed correctly on result viewOtherupgrade.poll.test53PollUpgradePathTestCase->testPollUpgrade()
Choice text is displayed correctly on result viewOtherupgrade.poll.test53PollUpgradePathTestCase->testPollUpgrade()
Choice text is displayed correctly on result viewOtherupgrade.poll.test53PollUpgradePathTestCase->testPollUpgrade()
Undefined offset: 0Noticeupgrade.poll.test61PollUpgradePathTestCase->testPollUpgrade()
Undefined offset: 0Noticeupgrade.poll.test61PollUpgradePathTestCase->testPollUpgrade()
The number of votes is displayed correctly: expected 2, got Otherupgrade.poll.test61PollUpgradePathTestCase->testPollUpgrade()
Undefined offset: 1Noticeupgrade.poll.test61PollUpgradePathTestCase->testPollUpgrade()
Undefined offset: 1Noticeupgrade.poll.test61PollUpgradePathTestCase->testPollUpgrade()
The number of votes is displayed correctly: expected 2, got Otherupgrade.poll.test61PollUpgradePathTestCase->testPollUpgrade()
Undefined offset: 2Noticeupgrade.poll.test61PollUpgradePathTestCase->testPollUpgrade()
Undefined offset: 2Noticeupgrade.poll.test61PollUpgradePathTestCase->testPollUpgrade()
The number of votes is displayed correctly: expected 2, got Otherupgrade.poll.test61PollUpgradePathTestCase->testPollUpgrade()
Undefined offset: 3Noticeupgrade.poll.test61PollUpgradePathTestCase->testPollUpgrade()
Undefined offset: 3Noticeupgrade.poll.test61PollUpgradePathTestCase->testPollUpgrade()
The number of votes is displayed correctly: expected 1, got Otherupgrade.poll.test61PollUpgradePathTestCase->testPollUpgrade()
SQLSTATE[42S02]: Base table or view not found: 1146 Table 'drupaltestbotmysql.simpletest95493blocked_ips' doesn't exist: SELECT 1 FROM {blocked_ips} WHERE ip = :ip; Array ( [:ip] => 127.0.0.1 ) PDOExceptionbootstrap.inc1804drupal_is_denied()
Choice text is displayed correctly on poll viewOtherupgrade.poll.test46PollUpgradePathTestCase->testPollUpgrade()
Choice text is displayed correctly on poll viewOtherupgrade.poll.test46PollUpgradePathTestCase->testPollUpgrade()
Choice text is displayed correctly on poll viewOtherupgrade.poll.test46PollUpgradePathTestCase->testPollUpgrade()
Choice text is displayed correctly on poll viewOtherupgrade.poll.test46PollUpgradePathTestCase->testPollUpgrade()
Choice text is displayed correctly on poll viewOtherupgrade.poll.test46PollUpgradePathTestCase->testPollUpgrade()
Undefined variable: url_targetNoticedrupal_web_test_case.php2220DrupalWebTestCase->clickLink()
Clicked link Results () from http://pifr-mysql/checkout/?q=content/poll/7Browserupgrade.poll.test50PollUpgradePathTestCase->testPollUpgrade()
Choice text is displayed correctly on result viewOtherupgrade.poll.test53PollUpgradePathTestCase->testPollUpgrade()
Choice text is displayed correctly on result viewOtherupgrade.poll.test53PollUpgradePathTestCase->testPollUpgrade()
Choice text is displayed correctly on result viewOtherupgrade.poll.test53PollUpgradePathTestCase->testPollUpgrade()
Choice text is displayed correctly on result viewOtherupgrade.poll.test53PollUpgradePathTestCase->testPollUpgrade()
Choice text is displayed correctly on result viewOtherupgrade.poll.test53PollUpgradePathTestCase->testPollUpgrade()
Undefined offset: 0Noticeupgrade.poll.test61PollUpgradePathTestCase->testPollUpgrade()
Undefined offset: 0Noticeupgrade.poll.test61PollUpgradePathTestCase->testPollUpgrade()
The number of votes is displayed correctly: expected 2, got Otherupgrade.poll.test61PollUpgradePathTestCase->testPollUpgrade()
Undefined offset: 1Noticeupgrade.poll.test61PollUpgradePathTestCase->testPollUpgrade()
Undefined offset: 1Noticeupgrade.poll.test61PollUpgradePathTestCase->testPollUpgrade()
The number of votes is displayed correctly: expected 2, got Otherupgrade.poll.test61PollUpgradePathTestCase->testPollUpgrade()
Undefined offset: 2Noticeupgrade.poll.test61PollUpgradePathTestCase->testPollUpgrade()
Undefined offset: 2Noticeupgrade.poll.test61PollUpgradePathTestCase->testPollUpgrade()
The number of votes is displayed correctly: expected 2, got Otherupgrade.poll.test61PollUpgradePathTestCase->testPollUpgrade()
Undefined offset: 3Noticeupgrade.poll.test61PollUpgradePathTestCase->testPollUpgrade()
Undefined offset: 3Noticeupgrade.poll.test61PollUpgradePathTestCase->testPollUpgrade()
The number of votes is displayed correctly: expected 1, got Otherupgrade.poll.test61PollUpgradePathTestCase->testPollUpgrade()
Undefined offset: 4Noticeupgrade.poll.test61PollUpgradePathTestCase->testPollUpgrade()
Undefined offset: 4Noticeupgrade.poll.test61PollUpgradePathTestCase->testPollUpgrade()
The number of votes is displayed correctly: expected 1, got Otherupgrade.poll.test61PollUpgradePathTestCase->testPollUpgrade()
SQLSTATE[42S02]: Base table or view not found: 1146 Table 'drupaltestbotmysql.simpletest95493blocked_ips' doesn't exist: SELECT 1 FROM {blocked_ips} WHERE ip = :ip; Array ( [:ip] => 127.0.0.1 ) PDOExceptionbootstrap.inc1804drupal_is_denied()
Choice text is displayed correctly on poll viewOtherupgrade.poll.test46PollUpgradePathTestCase->testPollUpgrade()
Choice text is displayed correctly on poll viewOtherupgrade.poll.test46PollUpgradePathTestCase->testPollUpgrade()
Undefined variable: url_targetNoticedrupal_web_test_case.php2220DrupalWebTestCase->clickLink()
Clicked link Results () from http://pifr-mysql/checkout/?q=content/poll/8Browserupgrade.poll.test50PollUpgradePathTestCase->testPollUpgrade()
Choice text is displayed correctly on result viewOtherupgrade.poll.test53PollUpgradePathTestCase->testPollUpgrade()
Choice text is displayed correctly on result viewOtherupgrade.poll.test53PollUpgradePathTestCase->testPollUpgrade()
Undefined offset: 0Noticeupgrade.poll.test61PollUpgradePathTestCase->testPollUpgrade()
Undefined offset: 0Noticeupgrade.poll.test61PollUpgradePathTestCase->testPollUpgrade()
The number of votes is displayed correctly: expected 3, got Otherupgrade.poll.test61PollUpgradePathTestCase->testPollUpgrade()
Undefined offset: 1Noticeupgrade.poll.test61PollUpgradePathTestCase->testPollUpgrade()
Undefined offset: 1Noticeupgrade.poll.test61PollUpgradePathTestCase->testPollUpgrade()
The number of votes is displayed correctly: expected 2, got Otherupgrade.poll.test61PollUpgradePathTestCase->testPollUpgrade()
SQLSTATE[42S02]: Base table or view not found: 1146 Table 'drupaltestbotmysql.simpletest95493blocked_ips' doesn't exist: SELECT 1 FROM {blocked_ips} WHERE ip = :ip; Array ( [:ip] => 127.0.0.1 ) PDOExceptionbootstrap.inc1804drupal_is_denied()
Choice text is displayed correctly on poll viewOtherupgrade.poll.test46PollUpgradePathTestCase->testPollUpgrade()
Choice text is displayed correctly on poll viewOtherupgrade.poll.test46PollUpgradePathTestCase->testPollUpgrade()
Choice text is displayed correctly on poll viewOtherupgrade.poll.test46PollUpgradePathTestCase->testPollUpgrade()
Undefined variable: url_targetNoticedrupal_web_test_case.php2220DrupalWebTestCase->clickLink()
Clicked link Results () from http://pifr-mysql/checkout/?q=content/poll/9Browserupgrade.poll.test50PollUpgradePathTestCase->testPollUpgrade()
Choice text is displayed correctly on result viewOtherupgrade.poll.test53PollUpgradePathTestCase->testPollUpgrade()
Choice text is displayed correctly on result viewOtherupgrade.poll.test53PollUpgradePathTestCase->testPollUpgrade()
Choice text is displayed correctly on result viewOtherupgrade.poll.test53PollUpgradePathTestCase->testPollUpgrade()
Undefined offset: 0Noticeupgrade.poll.test61PollUpgradePathTestCase->testPollUpgrade()
Undefined offset: 0Noticeupgrade.poll.test61PollUpgradePathTestCase->testPollUpgrade()
The number of votes is displayed correctly: expected 2, got Otherupgrade.poll.test61PollUpgradePathTestCase->testPollUpgrade()
Undefined offset: 1Noticeupgrade.poll.test61PollUpgradePathTestCase->testPollUpgrade()
Undefined offset: 1Noticeupgrade.poll.test61PollUpgradePathTestCase->testPollUpgrade()
The number of votes is displayed correctly: expected 2, got Otherupgrade.poll.test61PollUpgradePathTestCase->testPollUpgrade()
Undefined offset: 2Noticeupgrade.poll.test61PollUpgradePathTestCase->testPollUpgrade()
Undefined offset: 2Noticeupgrade.poll.test61PollUpgradePathTestCase->testPollUpgrade()
The number of votes is displayed correctly: expected 2, got Otherupgrade.poll.test61PollUpgradePathTestCase->testPollUpgrade()
SQLSTATE[42S02]: Base table or view not found: 1146 Table 'drupaltestbotmysql.simpletest95493blocked_ips' doesn't exist: SELECT 1 FROM {blocked_ips} WHERE ip = :ip; Array ( [:ip] => 127.0.0.1 ) PDOExceptionbootstrap.inc1804drupal_is_denied()
Choice text is displayed correctly on poll viewOtherupgrade.poll.test46PollUpgradePathTestCase->testPollUpgrade()
Choice text is displayed correctly on poll viewOtherupgrade.poll.test46PollUpgradePathTestCase->testPollUpgrade()
Choice text is displayed correctly on poll viewOtherupgrade.poll.test46PollUpgradePathTestCase->testPollUpgrade()
Choice text is displayed correctly on poll viewOtherupgrade.poll.test46PollUpgradePathTestCase->testPollUpgrade()
Undefined variable: url_targetNoticedrupal_web_test_case.php2220DrupalWebTestCase->clickLink()
Clicked link Results () from http://pifr-mysql/checkout/?q=content/poll/10Browserupgrade.poll.test50PollUpgradePathTestCase->testPollUpgrade()
Choice text is displayed correctly on result viewOtherupgrade.poll.test53PollUpgradePathTestCase->testPollUpgrade()
Choice text is displayed correctly on result viewOtherupgrade.poll.test53PollUpgradePathTestCase->testPollUpgrade()
Choice text is displayed correctly on result viewOtherupgrade.poll.test53PollUpgradePathTestCase->testPollUpgrade()
Choice text is displayed correctly on result viewOtherupgrade.poll.test53PollUpgradePathTestCase->testPollUpgrade()
Undefined offset: 0Noticeupgrade.poll.test61PollUpgradePathTestCase->testPollUpgrade()
Undefined offset: 0Noticeupgrade.poll.test61PollUpgradePathTestCase->testPollUpgrade()
The number of votes is displayed correctly: expected 2, got Otherupgrade.poll.test61PollUpgradePathTestCase->testPollUpgrade()
Undefined offset: 1Noticeupgrade.poll.test61PollUpgradePathTestCase->testPollUpgrade()
Undefined offset: 1Noticeupgrade.poll.test61PollUpgradePathTestCase->testPollUpgrade()
The number of votes is displayed correctly: expected 2, got Otherupgrade.poll.test61PollUpgradePathTestCase->testPollUpgrade()
Undefined offset: 2Noticeupgrade.poll.test61PollUpgradePathTestCase->testPollUpgrade()
Undefined offset: 2Noticeupgrade.poll.test61PollUpgradePathTestCase->testPollUpgrade()
The number of votes is displayed correctly: expected 2, got Otherupgrade.poll.test61PollUpgradePathTestCase->testPollUpgrade()
Undefined offset: 3Noticeupgrade.poll.test61PollUpgradePathTestCase->testPollUpgrade()
Undefined offset: 3Noticeupgrade.poll.test61PollUpgradePathTestCase->testPollUpgrade()
The number of votes is displayed correctly: expected 1, got Otherupgrade.poll.test61PollUpgradePathTestCase->testPollUpgrade()
SQLSTATE[42S02]: Base table or view not found: 1146 Table 'drupaltestbotmysql.simpletest95493blocked_ips' doesn't exist: SELECT 1 FROM {blocked_ips} WHERE ip = :ip; Array ( [:ip] => 127.0.0.1 ) PDOExceptionbootstrap.inc1804drupal_is_denied()
Choice text is displayed correctly on poll viewOtherupgrade.poll.test46PollUpgradePathTestCase->testPollUpgrade()
Choice text is displayed correctly on poll viewOtherupgrade.poll.test46PollUpgradePathTestCase->testPollUpgrade()
Choice text is displayed correctly on poll viewOtherupgrade.poll.test46PollUpgradePathTestCase->testPollUpgrade()
Choice text is displayed correctly on poll viewOtherupgrade.poll.test46PollUpgradePathTestCase->testPollUpgrade()
Choice text is displayed correctly on poll viewOtherupgrade.poll.test46PollUpgradePathTestCase->testPollUpgrade()
Undefined variable: url_targetNoticedrupal_web_test_case.php2220DrupalWebTestCase->clickLink()
Clicked link Results () from http://pifr-mysql/checkout/?q=content/poll/11Browserupgrade.poll.test50PollUpgradePathTestCase->testPollUpgrade()
Choice text is displayed correctly on result viewOtherupgrade.poll.test53PollUpgradePathTestCase->testPollUpgrade()
Choice text is displayed correctly on result viewOtherupgrade.poll.test53PollUpgradePathTestCase->testPollUpgrade()
Choice text is displayed correctly on result viewOtherupgrade.poll.test53PollUpgradePathTestCase->testPollUpgrade()
Choice text is displayed correctly on result viewOtherupgrade.poll.test53PollUpgradePathTestCase->testPollUpgrade()
Choice text is displayed correctly on result viewOtherupgrade.poll.test53PollUpgradePathTestCase->testPollUpgrade()
Undefined offset: 0Noticeupgrade.poll.test61PollUpgradePathTestCase->testPollUpgrade()
Undefined offset: 0Noticeupgrade.poll.test61PollUpgradePathTestCase->testPollUpgrade()
The number of votes is displayed correctly: expected 2, got Otherupgrade.poll.test61PollUpgradePathTestCase->testPollUpgrade()
Undefined offset: 1Noticeupgrade.poll.test61PollUpgradePathTestCase->testPollUpgrade()
Undefined offset: 1Noticeupgrade.poll.test61PollUpgradePathTestCase->testPollUpgrade()
The number of votes is displayed correctly: expected 2, got Otherupgrade.poll.test61PollUpgradePathTestCase->testPollUpgrade()
Undefined offset: 2Noticeupgrade.poll.test61PollUpgradePathTestCase->testPollUpgrade()
Undefined offset: 2Noticeupgrade.poll.test61PollUpgradePathTestCase->testPollUpgrade()
The number of votes is displayed correctly: expected 2, got Otherupgrade.poll.test61PollUpgradePathTestCase->testPollUpgrade()
Undefined offset: 3Noticeupgrade.poll.test61PollUpgradePathTestCase->testPollUpgrade()
Undefined offset: 3Noticeupgrade.poll.test61PollUpgradePathTestCase->testPollUpgrade()
The number of votes is displayed correctly: expected 1, got Otherupgrade.poll.test61PollUpgradePathTestCase->testPollUpgrade()
Undefined offset: 4Noticeupgrade.poll.test61PollUpgradePathTestCase->testPollUpgrade()
Undefined offset: 4Noticeupgrade.poll.test61PollUpgradePathTestCase->testPollUpgrade()
The number of votes is displayed correctly: expected 1, got Otherupgrade.poll.test61PollUpgradePathTestCase->testPollUpgrade()
LeafPoll vote (PollVoteTestCase) [Poll]8000
LeafProfile browsing (ProfileTestBrowsing) [Profile]3200
LeafProgrammatic form submissions (FormsProgrammaticTestCase) [Form API]1800
LeafQuery altering tests (DatabaseAlterTestCase) [Database]5500
LeafQuery logging (DatabaseLoggingTestCase) [Database]3800
LeafQuery tagging tests (DatabaseTaggingTestCase) [Database]2800
LeafQueue functionality (QueueTestCase) [System]700
LeafRange query test (DatabaseRangeQueryTestCase) [Database]200
LeafRDF comment mapping (RdfCommentAttributesTestCase) [RDF]20400
LeafRDF mapping CRUD functions (RdfCrudTestCase) [RDF]900
ExpandRDF mapping definition functionality (RdfMappingDefinitionTestCase) [RDF]4804
MessageGroupFilenameLineFunctionStatus
Undefined property: stdClass::$defining_moduleNoticenode.module511node_type_save()
PDOException: SQLSTATE[23000]: Integrity constraint violation: 1048 Column 'defining_module' cannot be null: INSERT INTO {node_type} (type, name, base, has_title, title_label, description, help, custom, modified, locked, disabled, defining_module, orig_type) VALUES (:db_insert_placeholder_0, :db_insert_placeholder_1, :db_insert_placeholder_2, :db_insert_placeholder_3, :db_insert_placeholder_4, :db_insert_placeholder_5, :db_insert_placeholder_6, :db_insert_placeholder_7, :db_insert_placeholder_8, :db_insert_placeholder_9, :db_insert_placeholder_10, :db_insert_placeholder_11, :db_insert_placeholder_12); Array ( [:db_insert_placeholder_0] => test_bundle_hook_install [:db_insert_placeholder_1] => qdlr0eyv [:db_insert_placeholder_2] => node_content [:db_insert_placeholder_3] => 1 [:db_insert_placeholder_4] => Title [:db_insert_placeholder_5] => [:db_insert_placeholder_6] => [:db_insert_placeholder_7] => 1 [:db_insert_placeholder_8] => 1 [:db_insert_placeholder_9] => 0 [:db_insert_placeholder_10] => 0 [:db_insert_placeholder_11] => [:db_insert_placeholder_12] => test_bundle_hook_install ) in node_type_save() (line 530 of /var/lib/drupaltestbot/sites/default/files/checkout/modules/node/node.module).Uncaught exceptiondatabase.inc1947PDOStatement->execute()
Undefined property: stdClass::$defining_moduleNoticenode.module511node_type_save()
PDOException: SQLSTATE[23000]: Integrity constraint violation: 1048 Column 'defining_module' cannot be null: INSERT INTO {node_type} (type, name, base, has_title, title_label, description, help, custom, modified, locked, disabled, defining_module, orig_type) VALUES (:db_insert_placeholder_0, :db_insert_placeholder_1, :db_insert_placeholder_2, :db_insert_placeholder_3, :db_insert_placeholder_4, :db_insert_placeholder_5, :db_insert_placeholder_6, :db_insert_placeholder_7, :db_insert_placeholder_8, :db_insert_placeholder_9, :db_insert_placeholder_10, :db_insert_placeholder_11, :db_insert_placeholder_12); Array ( [:db_insert_placeholder_0] => u7mum1b0 [:db_insert_placeholder_1] => u7mum1b0 [:db_insert_placeholder_2] => node_content [:db_insert_placeholder_3] => 1 [:db_insert_placeholder_4] => Title [:db_insert_placeholder_5] => [:db_insert_placeholder_6] => [:db_insert_placeholder_7] => 1 [:db_insert_placeholder_8] => 1 [:db_insert_placeholder_9] => 0 [:db_insert_placeholder_10] => 0 [:db_insert_placeholder_11] => [:db_insert_placeholder_12] => u7mum1b0 ) in node_type_save() (line 530 of /var/lib/drupaltestbot/sites/default/files/checkout/modules/node/node.module).Uncaught exceptiondatabase.inc1947PDOStatement->execute()
LeafRDF mapping hook (RdfMappingHookTestCase) [RDF]500
LeafRDF namespaces (RdfGetRdfNamespacesTestCase) [RDF]400
LeafRDF namespaces XML serialization tests (DrupalGetRdfNamespacesTestCase) [System]600
LeafRDF tracker page mapping (RdfTrackerAttributesTestCase) [RDF]3200
LeafRDFa markup (RdfRdfaMarkupTestCase) [RDF]2100
LeafRebuild arbitrary forms (FormsArbitraryRebuildTestCase) [Form API]1400
LeafRebuild content (NodeBuildContent) [Node]100
LeafRegistry parse file test (RegistryParseFileTestCase) [System]200
LeafRegistry parse files test (RegistryParseFilesTestCase) [System]600
LeafRegression tests (DatabaseRegressionTestCase) [Database]2700
LeafRemove feed functionality (RemoveFeedTestCase) [Aggregator]2300
LeafRemove feed item functionality (RemoveFeedItemTestCase) [Aggregator]19600
LeafRequired modules (ModuleRequiredTestCase) [Module]2100
LeafRequirements hook failure (HookRequirementsTestCase) [Module]1500
LeafResettable static variables test (BootstrapResettableStaticTestCase) [Bootstrap]500
LeafRole assignment (UserRolesAssignmentTestCase) [User]5300
LeafRole permissions (UserPermissionsTestCase) [User]5000
LeafSchema API (SchemaTestCase) [Database]2700
LeafSearch engine phrase queries (SearchExactTestCase) [Search]2200
LeafSearch engine queries (SearchMatchTestCase) [Search]14400
LeafSearch engine ranking (SearchRankingTestCase) [Search]6000
LeafSearch excerpt extraction (SearchExcerptTestCase) [Search]500
LeafSearch expression insert/extract (SearchExpressionInsertExtractTestCase) [Search]2400
LeafSearch page override (SearchPageOverride) [Search]1200
LeafSearch simplify (SearchSimplifyTestCase) [Search]33800
LeafSecurity (FilterSecurityTestCase) [Filter]2600
LeafSelect tests (DatabaseSelectTestCase) [Database]11700
LeafSelect tests, complex (DatabaseSelectComplexTestCase) [Database]11500
LeafSelect tests, ordered (DatabaseSelectOrderedTestCase) [Database]2600
LeafSelect tests, subqueries (DatabaseSelectSubqueryTestCase) [Database]2400
LeafSequences API (DatabaseNextIdCase) [Database]200
LeafSession https handling (SessionHttpsTestCase) [Session]6800
LeafSession tests (SessionTestCase) [Session]14600
LeafShortcut link functionality (ShortcutLinksTestCase) [Shortcut]9600
LeafShortcut set functionality (ShortcutSetsTestCase) [Shortcut]15300
LeafShutdown functions (ShutdownFunctionsTest) [System]400
LeafSimpleTest browser (SimpleTestBrowserTestCase) [SimpleTest]1600
LeafSimpleTest e-mail capturing (SimpleTestMailCaptureTestCase) [SimpleTest]1300
LeafSimpleTest error collector (DrupalErrorCollectionUnitTest) [SimpleTest]1500
LeafSimpleTest functionality (SimpleTestFunctionalTest) [SimpleTest]9100
LeafSite maintenance mode functionality (SiteMaintenanceTestCase) [System]8000
LeafSite-wide contact form (ContactSitewideTestCase) [Contact]23700
LeafSize parsing test (CommonSizeTestCase) [System]3500
LeafStatistics logging tests (StatisticsLoggingTestCase) [Statistics]1200
LeafStatistics reports tests (StatisticsReportsTestCase) [Statistics]8000
LeafStatistics token replacement (StatisticsTokenReplaceTestCase) [Statistics]2900
LeafStream wrappers (StreamWrapperTest) [File API]2000
LeafString filtering tests (CommonXssUnitTest) [System]700
LeafString translate, search and validate (LocaleTranslationFunctionalTest) [Locale]25000
LeafString translation using st() (LocaleInstallTest) [Locale]100
LeafSummary length (SummaryLengthTestCase) [Node]1500
LeafSyslog functionality (SyslogTestCase) [Syslog]1600
LeafTableselect form element type test (FormsElementsTableSelectFunctionalTest) [Form API]5700
LeafTablesort query tests (DatabaseSelectTableSortDefaultTestCase) [Database]3400
LeafTaxonomy term functions and forms. (TaxonomyTermTestCase) [Taxonomy]21700
LeafTaxonomy term hooks (TaxonomyHooksTestCase) [Taxonomy]1900
LeafTaxonomy term multiple loading (TaxonomyLoadMultipleUnitTest) [Taxonomy]1700
LeafTaxonomy term reference field (TaxonomyTermFieldTestCase) [Taxonomy]2500
LeafTaxonomy term unit tests (TaxonomyTermUnitTest) [Taxonomy]100
LeafTaxonomy term URL aliases (PathTaxonomyTermTestCase) [Path]3400
LeafTaxonomy token replacement (TaxonomyTokenReplaceTestCase) [Taxonomy]5300
LeafTaxonomy vocabularies (TaxonomyVocabularyUnitTest) [Taxonomy]6900
LeafTaxonomy vocabulary interface (TaxonomyVocabularyFunctionalTest) [Taxonomy]13300
LeafTemporary query test (DatabaseTemporaryQueryTestCase) [Database]500
LeafTest date field (ProfileTestDate) [Profile]4900
LeafTest field weights (ProfileTestWeights) [Profile]5300
LeafTest select field (ProfileTestSelect) [Profile]4500
LeafTest single fields (ProfileTestFields) [Profile]18000
LeafTest statistics admin. (StatisticsAdminTestCase) [Statistics]10400
LeafTest user actions (TriggerUserActionTestCase) [Trigger]6500
LeafTest user triggers (TriggerUserTokenTestCase) [Trigger]18500
LeafTesting SimpleTest setUp (SimpleTestFolderTestCase) [SimpleTest]100
LeafText field (TextFieldTestCase) [Field types]19700
LeafText summary (TextSummaryTestCase) [Field types]11600
LeafText translation (TextTranslationTestCase) [Field types]10400
LeafTheme API (ThemeUnitTest) [Theme]1500
LeafTheme fast initialization (ThemeFastTestCase) [Theme]1000
LeafTheme initialization in hook_init() (ThemeHookInitUnitTest) [Theme]400
LeafTheme interface functionality (SystemThemeFunctionalTest) [System]6600
LeafTheme item list (ThemeItemListUnitTest) [Theme]100
LeafTheme Table (ThemeTableUnitTest) [Theme]800
LeafTimer test (BootstrapTimerTestCase) [Bootstrap]500
LeafToken replacement (TokenReplaceTestCase) [System]2700
LeafTop visitor blocking (StatisticsBlockVisitorsTestCase) [Statistics]4500
LeafTracker (TrackerTest) [Tracker]26100
LeafTransaction tests (DatabaseTransactionTestCase) [Database]3100
LeafTranslation export (LocaleExportFunctionalTest) [Locale]2900
LeafTranslation functionality (TranslationTestCase) [Translation]13900
LeafTranslation import (LocaleImportFunctionalTest) [Locale]9100
LeafTrigger content (node) actions (TriggerContentTestCase) [Trigger]51100
LeafTrigger cron (system) actions (TriggerCronTestCase) [Trigger]3600
LeafTrigger orphaned actions (TriggerOrphanedActionsTestCase) [Trigger]3700
LeafTrigger other actions (TriggerOtherTestCase) [Trigger]11200
LeafUI language negotiation (LocaleUILanguageNegotiationTest) [Locale]4700
LeafUnassigned text format functionality (FilterNoFormatTestCase) [Filter]100
LeafUnicode handling (UnicodeUnitTest) [System]17600
LeafUnmanaged file copying (FileUnmanagedCopyTest) [File API]3100
LeafUnmanaged file delete (FileUnmanagedDeleteTest) [File API]800
LeafUnmanaged file moving (FileUnmanagedMoveTest) [File API]2200
LeafUnmanaged file save data (FileUnmanagedSaveDataTest) [File API]800
LeafUnmanaged recursive file delete (FileUnmanagedDeleteRecursiveTest) [File API]1700
LeafUpdate contrib functionality (UpdateTestContribCase) [Update]13700
LeafUpdate core functionality (UpdateCoreTestCase) [Update]14700
LeafUpdate dependency hook invocation (UpdateDependencyHookInvocationTestCase) [Update API]300
LeafUpdate dependency ordering (UpdateDependencyOrderingTestCase) [Update API]300
LeafUpdate feed functionality (UpdateFeedTestCase) [Aggregator]7400
LeafUpdate feed item functionality (UpdateFeedItemTestCase) [Aggregator]6100
LeafUpdate functionality (UpdateScriptFunctionalTest) [System]5600
LeafUpdate on cron functionality (AggregatorCronTestCase) [Aggregator]5300
LeafUpdate tests (DatabaseUpdateTestCase) [Database]3500
LeafUpdate tests, Complex (DatabaseUpdateComplexTestCase) [Database]5200
LeafUpdate tests, LOB (DatabaseUpdateLOBTestCase) [Database]1300
LeafUpload and extract module functionality (UpdateTestUploadCase) [Update]1800
LeafUpload user picture (UserPictureTestCase) [User]7600
LeafURL altering (UrlAlterFunctionalTest) [Path API]2800
LeafURL generation tests (CommonURLUnitTest) [System]5600
LeafUser administration (UserAdminTestCase) [User]6500
LeafUser autocompletion (UserAutocompleteTestCase) [User]2800
LeafUser blocks (UserBlocksUnitTests) [User]4300
LeafUser create (UserCreateTestCase) [User]2700
LeafUser creation (LocaleUserCreationTest) [Locale]6800
LeafUser edit (UserEditTestCase) [User]6800
LeafUser edited own account (UserEditedOwnAccountTestCase) [User]2300
LeafUser language settings (LocaleUserLanguageFunctionalTest) [Locale]5100
LeafUser login (UserLoginTestCase) [User]13200
LeafUser poll vote capability. (PollVoteCheckHostname) [Poll]12000
LeafUser registration (UserRegistrationTestCase) [User]8100
LeafUser role administration (UserRoleAdminTestCase) [User]3900
LeafUser save test (UserSaveTestCase) [User]300
LeafUser search (UserUserSearchTestCase) [User]3800
LeafUser signatures (UserSignatureTestCase) [User]4500
LeafUser time zones (UserTimeZoneFunctionalTest) [User]3100
LeafUser token replacement (UserTokenReplaceTestCase) [User]4300
LeafUsername/e-mail validation (UserValidationTestCase) [User]1900
LeafValid Url (ValidUrlTestCase) [System]7900
LeafVariable test (BootstrapVariableTestCase) [Bootstrap]700
LeafXML-RPC basic (XMLRPCBasicTestCase) [XML-RPC]500
LeafXML-RPC message (XMLRPCMessagesTestCase) [XML-RPC]300
LeafXML-RPC validator (XMLRPCValidator1IncTestCase) [XML-RPC]900