cache_ban_list.patch

Test status
StatusResult
Last receivedSun, 08/15/2010 - 05:20:10
Last requestedSun, 08/15/2010 - 05:22:01
Last testedSun, 08/15/2010 - 05:49:14
Test count1
Environment status
MySQLfail
File information
Filecache_ban_list.patch
BranchDrupal core - 7.x
LinkIssue Link
SummaryFAILED: [[SimpleTest]]: [MySQL] 22,489 pass(es), 97 fail(s), and 29 exception(s).
Details

MySQL

  1. Setup environment
  2. Detect an invalid patch URL
  3. Detect invalid repository information
  4. Detect invalid patch format
  5. Detect a non-applicable patch
  6. Detect invalid PHP syntax
  7. Detect a Drupal installation failure
  8. Detect a test run failure
  9. Detect a failing test
    Review the test failures below then if necessary run them locally until the problem has been fixed.
  10. Complete test suite with all tests passing
22,489 pass(es), 97 fail(s), and 29 exception(s)

Non-pass

Test namePassFailException
ExpandAJAX multi form (AJAXMultiFormTestCase) [AJAX]24198
MessageGroupFilenameLineFunctionStatus
array_merge_recursive(): Argument #2 is not an arrayWarningajax.test289AJAXMultiFormTestCase->testMultiForm()
Parsed page successfully.Browserajax.test290AJAXMultiFormTestCase->testMultiForm()
Found the correct number of field items after an AJAX submission.Otherajax.test290AJAXMultiFormTestCase->testMultiForm()
Parsed page successfully.Browserajax.test291AJAXMultiFormTestCase->testMultiForm()
Found the "add more" button after an AJAX submission.Otherajax.test291AJAXMultiFormTestCase->testMultiForm()
Parsed page successfully.Browserajax.test292AJAXMultiFormTestCase->testMultiForm()
Invalid argument supplied for foreach()Warningdrupal_web_test_case.php2924DrupalWebTestCase->assertNoDuplicateIds()
Parsed page successfully.Browserajax.test286AJAXMultiFormTestCase->testMultiForm()
Parsed page successfully.Browserajax.test288AJAXMultiFormTestCase->testMultiForm()
array_merge_recursive(): Argument #1 is not an arrayWarningajax.test289AJAXMultiFormTestCase->testMultiForm()
array_merge_recursive(): Argument #2 is not an arrayWarningajax.test289AJAXMultiFormTestCase->testMultiForm()
Parsed page successfully.Browserajax.test290AJAXMultiFormTestCase->testMultiForm()
Found the correct number of field items after an AJAX submission.Otherajax.test290AJAXMultiFormTestCase->testMultiForm()
Parsed page successfully.Browserajax.test291AJAXMultiFormTestCase->testMultiForm()
Found the "add more" button after an AJAX submission.Otherajax.test291AJAXMultiFormTestCase->testMultiForm()
Parsed page successfully.Browserajax.test292AJAXMultiFormTestCase->testMultiForm()
Invalid argument supplied for foreach()Warningdrupal_web_test_case.php2924DrupalWebTestCase->assertNoDuplicateIds()
Parsed page successfully.Browserajax.test286AJAXMultiFormTestCase->testMultiForm()
Parsed page successfully.Browserajax.test288AJAXMultiFormTestCase->testMultiForm()
array_merge_recursive(): Argument #1 is not an arrayWarningajax.test289AJAXMultiFormTestCase->testMultiForm()
array_merge_recursive(): Argument #2 is not an arrayWarningajax.test289AJAXMultiFormTestCase->testMultiForm()
Parsed page successfully.Browserajax.test290AJAXMultiFormTestCase->testMultiForm()
Found the correct number of field items after an AJAX submission.Otherajax.test290AJAXMultiFormTestCase->testMultiForm()
Parsed page successfully.Browserajax.test291AJAXMultiFormTestCase->testMultiForm()
Found the "add more" button after an AJAX submission.Otherajax.test291AJAXMultiFormTestCase->testMultiForm()
Parsed page successfully.Browserajax.test292AJAXMultiFormTestCase->testMultiForm()
Invalid argument supplied for foreach()Warningdrupal_web_test_case.php2924DrupalWebTestCase->assertNoDuplicateIds()
ExpandBasic upgrade path (BasicUpgradePath) [Upgrade path]404
MessageGroupFilenameLineFunctionStatus
SQLSTATE[42S02]: Base table or view not found: 1146 Table 'drupal_checkout.simpletest710199clear_cache' doesn't exist: INSERT INTO {clear_cache} (cid, bin, wildcard, created) VALUES (:db_insert_placeholder_0, :db_insert_placeholder_1, :db_insert_placeholder_2, :db_insert_placeholder_3); Array ( [:db_insert_placeholder_0] => variables [:db_insert_placeholder_1] => cache_bootstrap [:db_insert_placeholder_2] => 0 [:db_insert_placeholder_3] => 1281851147 ) PDOExceptioncache.inc170cache_clear_all()
PDOException: SQLSTATE[42S02]: Base table or view not found: 1146 Table 'drupal_checkout.simpletest710199clear_cache' doesn't exist: INSERT INTO {clear_cache} (cid, bin, wildcard, created) VALUES (:db_insert_placeholder_0, :db_insert_placeholder_1, :db_insert_placeholder_2, :db_insert_placeholder_3); Array ( [:db_insert_placeholder_0] => variables [:db_insert_placeholder_1] => cache_bootstrap [:db_insert_placeholder_2] => 0 [:db_insert_placeholder_3] => 1281849752 ) in cache_clear_all() (line 170 of /var/www/sites/default/files/checkout/includes/cache.inc).Uncaught exceptiondatabase.inc1947PDOStatement->execute()
SQLSTATE[42S02]: Base table or view not found: 1146 Table 'drupal_checkout.simpletest455042clear_cache' doesn't exist: INSERT INTO {clear_cache} (cid, bin, wildcard, created) VALUES (:db_insert_placeholder_0, :db_insert_placeholder_1, :db_insert_placeholder_2, :db_insert_placeholder_3); Array ( [:db_insert_placeholder_0] => variables [:db_insert_placeholder_1] => cache_bootstrap [:db_insert_placeholder_2] => 0 [:db_insert_placeholder_3] => 1281851149 ) PDOExceptioncache.inc170cache_clear_all()
PDOException: SQLSTATE[42S02]: Base table or view not found: 1146 Table 'drupal_checkout.simpletest455042clear_cache' doesn't exist: INSERT INTO {clear_cache} (cid, bin, wildcard, created) VALUES (:db_insert_placeholder_0, :db_insert_placeholder_1, :db_insert_placeholder_2, :db_insert_placeholder_3); Array ( [:db_insert_placeholder_0] => variables [:db_insert_placeholder_1] => cache_bootstrap [:db_insert_placeholder_2] => 0 [:db_insert_placeholder_3] => 1281849752 ) in cache_clear_all() (line 170 of /var/www/sites/default/files/checkout/includes/cache.inc).Uncaught exceptiondatabase.inc1947PDOStatement->execute()
ExpandBlock caching (BlockCacheTestCase) [Block]22170
MessageGroupFilenameLineFunctionStatus
Block is served from the cache.Otherblock.test443BlockCacheTestCase->testCachePerRole()
User with the same roles sees per-role cached content.Otherblock.test461BlockCacheTestCase->testCachePerRole()
Block is served from the per-role cache.Otherblock.test469BlockCacheTestCase->testCachePerRole()
Block content served from global cache.Otherblock.test489BlockCacheTestCase->testCacheGlobal()
Block is served from per-user cache.Otherblock.test528BlockCacheTestCase->testCachePerUser()
Per-user block cache is persistent.Otherblock.test536BlockCacheTestCase->testCachePerUser()
Block content cached for the node page.Otherblock.test557BlockCacheTestCase->testCachePerPage()
ExpandBoot and exit hook invocation (HookBootExitTestCase) [Bootstrap]1260
MessageGroupFilenameLineFunctionStatus
Page has been cached.Otherbootstrap.test310HookBootExitTestCase->testHookBootExit()
hook_boot not called with agressive cache and a cached page.Otherbootstrap.test312HookBootExitTestCase->testHookBootExit()
hook_exit not called with agressive cache and a cached page.Otherbootstrap.test313HookBootExitTestCase->testHookBootExit()
Page cache cleared.Otherbootstrap.test316HookBootExitTestCase->testHookBootExit()
hook_boot called with agressive cache and no cached page.Otherbootstrap.test319HookBootExitTestCase->testHookBootExit()
hook_exit called with agressive cache and no cached page.Otherbootstrap.test320HookBootExitTestCase->testHookBootExit()
ExpandCache clear test (CacheClearCase) [Cache]580
MessageGroupFilenameLineFunctionStatus
Cache was set for clearing cid.Othercache.test237CacheClearCase->testClearCid()
Two caches were created for checking cid "*" with wildcard false.Othercache.test246CacheClearCase->testClearCid()
Two caches still exists after clearing cid "*" with wildcard false.Othercache.test250CacheClearCase->testClearCid()
Two caches were created for checking cid "*" with wildcard true.Othercache.test261CacheClearCase->testClearWildcard()
Two caches were created for checking cid substring with wildcard true.Othercache.test271CacheClearCase->testClearWildcard()
Three cache entries were created.Othercache.test289CacheClearCase->testClearArray()
Entry was not cleared from the cacheOthercache.test298CacheClearCase->testClearArray()
Two cache entries were created.Othercache.test307CacheClearCase->testClearArray()
ExpandCache emptiness test (CacheIsEmptyCase) [Cache]320
MessageGroupFilenameLineFunctionStatus
Cache was set.Othercache.test344CacheIsEmptyCase->testIsEmpty()
The cache bin is not emptyOthercache.test345CacheIsEmptyCase->testIsEmpty()
ExpandCache saving test (CacheSavingCase) [Cache]050
MessageGroupFilenameLineFunctionStatus
String is saved and restored properly.Othercache.test161CacheSavingCase->checkVariable()
Integer is saved and restored properly.Othercache.test161CacheSavingCase->checkVariable()
Double is saved and restored properly.Othercache.test161CacheSavingCase->checkVariable()
Array is saved and restored properly.Othercache.test161CacheSavingCase->checkVariable()
Object is saved and restored properly.Othercache.test152CacheSavingCase->testObject()
ExpandFetching multiple cache items (CacheGetMultipleUnitTest) [Cache]166
MessageGroupFilenameLineFunctionStatus
Item 1 is cached.Othercache.test191CacheGetMultipleUnitTest->testCacheMultiple()
Item 2 is cached.Othercache.test192CacheGetMultipleUnitTest->testCacheMultiple()
Undefined index: item1Noticecache.test197CacheGetMultipleUnitTest->testCacheMultiple()
Trying to get property of non-objectNoticecache.test197CacheGetMultipleUnitTest->testCacheMultiple()
Item was returned from cache successfully.Othercache.test197CacheGetMultipleUnitTest->testCacheMultiple()
Undefined index: item2Noticecache.test198CacheGetMultipleUnitTest->testCacheMultiple()
Trying to get property of non-objectNoticecache.test198CacheGetMultipleUnitTest->testCacheMultiple()
Item was returned from cache successfully.Othercache.test198CacheGetMultipleUnitTest->testCacheMultiple()
Undefined index: item1Noticecache.test206CacheGetMultipleUnitTest->testCacheMultiple()
Trying to get property of non-objectNoticecache.test206CacheGetMultipleUnitTest->testCacheMultiple()
Item was returned from cache successfully.Othercache.test206CacheGetMultipleUnitTest->testCacheMultiple()
Only valid cache entries returned.Othercache.test208CacheGetMultipleUnitTest->testCacheMultiple()
ExpandField attach tests (other) (FieldAttachOtherTestCase) [Field API]4133
MessageGroupFilenameLineFunctionStatus
Trying to get property of non-objectNoticefield.test819FieldAttachOtherTestCase->testFieldAttachCache()
Cached: correct cache entry on loadOtherfield.test819FieldAttachOtherTestCase->testFieldAttachCache()
Trying to get property of non-objectNoticefield.test832FieldAttachOtherTestCase->testFieldAttachCache()
Cached: correct cache entry on loadOtherfield.test832FieldAttachOtherTestCase->testFieldAttachCache()
Trying to get property of non-objectNoticefield.test847FieldAttachOtherTestCase->testFieldAttachCache()
Cached: correct cache entry on loadOtherfield.test847FieldAttachOtherTestCase->testFieldAttachCache()
ExpandImage styles and effects UI configuration (ImageAdminStylesUnitTest) [Image]20020
MessageGroupFilenameLineFunctionStatus
The order of the effects is correctly set by default.Otherimage.test486ImageAdminStylesUnitTest->testStyle()
The order of the effects is correctly set by default.Otherimage.test486ImageAdminStylesUnitTest->testStyle()
ExpandImage styles path and URL functions (ImageStylesPathAndUrlUnitTest) [Image]47306
MessageGroupFilenameLineFunctionStatus
Service Unavailable response received.Browserimage.test196ImageStylesPathAndUrlUnitTest->_testImageStyleUrlAndPath()
Retry-After header received.Otherimage.test197ImageStylesPathAndUrlUnitTest->_testImageStyleUrlAndPath()
Generated file was created.Otherimage.test202ImageStylesPathAndUrlUnitTest->_testImageStyleUrlAndPath()
file_get_contents(public://styles/style_foo/image-test_0.png): failed to open stream: "DrupalPublicStreamWrapper::stream_open" call failedWarningimage.test203ImageStylesPathAndUrlUnitTest->_testImageStyleUrlAndPath()
URL returns expected file.Otherimage.test203ImageStylesPathAndUrlUnitTest->_testImageStyleUrlAndPath()
Expected Content-Type was reported.Otherimage.test205ImageStylesPathAndUrlUnitTest->_testImageStyleUrlAndPath()
Expected Content-Length was reported.Otherimage.test206ImageStylesPathAndUrlUnitTest->_testImageStyleUrlAndPath()
Got the download URL for an existing file.Otherimage.test213ImageStylesPathAndUrlUnitTest->_testImageStyleUrlAndPath()
file_get_contents(public://styles/style_foo/image-test_0.png): failed to open stream: "DrupalPublicStreamWrapper::stream_open" call failedWarningimage.test214ImageStylesPathAndUrlUnitTest->_testImageStyleUrlAndPath()
URL returns expected file.Otherimage.test214ImageStylesPathAndUrlUnitTest->_testImageStyleUrlAndPath()
Expected Content-Type was reported.Otherimage.test215ImageStylesPathAndUrlUnitTest->_testImageStyleUrlAndPath()
Expected Content-Length was reported.Otherimage.test216ImageStylesPathAndUrlUnitTest->_testImageStyleUrlAndPath()
Service Unavailable response received.Browserimage.test196ImageStylesPathAndUrlUnitTest->_testImageStyleUrlAndPath()
Retry-After header received.Otherimage.test197ImageStylesPathAndUrlUnitTest->_testImageStyleUrlAndPath()
Generated file was created.Otherimage.test202ImageStylesPathAndUrlUnitTest->_testImageStyleUrlAndPath()
file_get_contents(public://styles/style_foo/image-test_0.png): failed to open stream: "DrupalPublicStreamWrapper::stream_open" call failedWarningimage.test203ImageStylesPathAndUrlUnitTest->_testImageStyleUrlAndPath()
URL returns expected file.Otherimage.test203ImageStylesPathAndUrlUnitTest->_testImageStyleUrlAndPath()
Expected Content-Type was reported.Otherimage.test205ImageStylesPathAndUrlUnitTest->_testImageStyleUrlAndPath()
Expected Content-Length was reported.Otherimage.test206ImageStylesPathAndUrlUnitTest->_testImageStyleUrlAndPath()
Got the download URL for an existing file.Otherimage.test213ImageStylesPathAndUrlUnitTest->_testImageStyleUrlAndPath()
file_get_contents(public://styles/style_foo/image-test_0.png): failed to open stream: "DrupalPublicStreamWrapper::stream_open" call failedWarningimage.test214ImageStylesPathAndUrlUnitTest->_testImageStyleUrlAndPath()
URL returns expected file.Otherimage.test214ImageStylesPathAndUrlUnitTest->_testImageStyleUrlAndPath()
Expected Content-Type was reported.Otherimage.test215ImageStylesPathAndUrlUnitTest->_testImageStyleUrlAndPath()
Expected Content-Length was reported.Otherimage.test216ImageStylesPathAndUrlUnitTest->_testImageStyleUrlAndPath()
Service Unavailable response received.Browserimage.test196ImageStylesPathAndUrlUnitTest->_testImageStyleUrlAndPath()
Retry-After header received.Otherimage.test197ImageStylesPathAndUrlUnitTest->_testImageStyleUrlAndPath()
Generated file was created.Otherimage.test202ImageStylesPathAndUrlUnitTest->_testImageStyleUrlAndPath()
file_get_contents(private://styles/style_foo/image-test.png): failed to open stream: "DrupalPrivateStreamWrapper::stream_open" call failedWarningimage.test203ImageStylesPathAndUrlUnitTest->_testImageStyleUrlAndPath()
URL returns expected file.Otherimage.test203ImageStylesPathAndUrlUnitTest->_testImageStyleUrlAndPath()
Expected Content-Type was reported.Otherimage.test205ImageStylesPathAndUrlUnitTest->_testImageStyleUrlAndPath()
Expected Content-Length was reported.Otherimage.test206ImageStylesPathAndUrlUnitTest->_testImageStyleUrlAndPath()
Got the download URL for an existing file.Otherimage.test213ImageStylesPathAndUrlUnitTest->_testImageStyleUrlAndPath()
file_get_contents(private://styles/style_foo/image-test.png): failed to open stream: "DrupalPrivateStreamWrapper::stream_open" call failedWarningimage.test214ImageStylesPathAndUrlUnitTest->_testImageStyleUrlAndPath()
URL returns expected file.Otherimage.test214ImageStylesPathAndUrlUnitTest->_testImageStyleUrlAndPath()
Expected Content-Type was reported.Otherimage.test215ImageStylesPathAndUrlUnitTest->_testImageStyleUrlAndPath()
Expected Content-Length was reported.Otherimage.test216ImageStylesPathAndUrlUnitTest->_testImageStyleUrlAndPath()
ExpandPage cache test (BootstrapPageCacheTestCase) [Bootstrap]7290
MessageGroupFilenameLineFunctionStatus
Page was cached.Otherbootstrap.test126BootstrapPageCacheTestCase->testConditionalRequests()
Conditional request returned 304 Not Modified.Browserbootstrap.test131BootstrapPageCacheTestCase->testConditionalRequests()
Conditional request with obsolete If-Modified-Since date returned 304 Not Modified.Browserbootstrap.test134BootstrapPageCacheTestCase->testConditionalRequests()
Conditional request with obsolete If-Modified-Since date returned 304 Not Modified.Browserbootstrap.test137BootstrapPageCacheTestCase->testConditionalRequests()
Page was cached.Otherbootstrap.test141BootstrapPageCacheTestCase->testConditionalRequests()
Page was cached.Otherbootstrap.test145BootstrapPageCacheTestCase->testConditionalRequests()
Page was cached.Otherbootstrap.test170BootstrapPageCacheTestCase->testPageCache()
Page was cached.Otherbootstrap.test212BootstrapPageCacheTestCase->testPageCompression()
Page was cached.Otherbootstrap.test219BootstrapPageCacheTestCase->testPageCompression()
ExpandPoll upgrade path (PollUpgradePathTestCase) [Upgrade path]202
MessageGroupFilenameLineFunctionStatus
SQLSTATE[42S02]: Base table or view not found: 1146 Table 'drupal_checkout.simpletest575479clear_cache' doesn't exist: INSERT INTO {clear_cache} (cid, bin, wildcard, created) VALUES (:db_insert_placeholder_0, :db_insert_placeholder_1, :db_insert_placeholder_2, :db_insert_placeholder_3); Array ( [:db_insert_placeholder_0] => variables [:db_insert_placeholder_1] => cache_bootstrap [:db_insert_placeholder_2] => 0 [:db_insert_placeholder_3] => 1281851150 ) PDOExceptioncache.inc170cache_clear_all()
PDOException: SQLSTATE[42S02]: Base table or view not found: 1146 Table 'drupal_checkout.simpletest575479clear_cache' doesn't exist: INSERT INTO {clear_cache} (cid, bin, wildcard, created) VALUES (:db_insert_placeholder_0, :db_insert_placeholder_1, :db_insert_placeholder_2, :db_insert_placeholder_3); Array ( [:db_insert_placeholder_0] => variables [:db_insert_placeholder_1] => cache_bootstrap [:db_insert_placeholder_2] => 0 [:db_insert_placeholder_3] => 1281849752 ) in cache_clear_all() (line 170 of /var/www/sites/default/files/checkout/includes/cache.inc).Uncaught exceptiondatabase.inc1947PDOStatement->execute()

All

Test namePassFailException
Leaf403 functionality (AccessDeniedTestCase) [System]6900
Leaf404 functionality (PageNotFoundTestCase) [System]1800
LeafActions configuration (ActionsConfigurationTestCase) [Actions]3800
LeafActions executing in a potentially infinite loop (ActionLoopTestCase) [Actions]2400
LeafAdd feed functionality (AddFeedTestCase) [Aggregator]2800
LeafAdmin theme block admin accessibility (BlockAdminThemeTestCase) [Block]1800
LeafAdvanced search form (SearchAdvancedSearchForm) [Search]3100
LeafAJAX command form values (AJAXFormValuesTestCase) [AJAX]2800
LeafAJAX commands (AJAXCommandsTestCase) [AJAX]6300
LeafAJAX framework (AJAXFrameworkTestCase) [AJAX]800
ExpandAJAX multi form (AJAXMultiFormTestCase) [AJAX]24198
MessageGroupFilenameLineFunctionStatus
array_merge_recursive(): Argument #2 is not an arrayWarningajax.test289AJAXMultiFormTestCase->testMultiForm()
Parsed page successfully.Browserajax.test290AJAXMultiFormTestCase->testMultiForm()
Found the correct number of field items after an AJAX submission.Otherajax.test290AJAXMultiFormTestCase->testMultiForm()
Parsed page successfully.Browserajax.test291AJAXMultiFormTestCase->testMultiForm()
Found the "add more" button after an AJAX submission.Otherajax.test291AJAXMultiFormTestCase->testMultiForm()
Parsed page successfully.Browserajax.test292AJAXMultiFormTestCase->testMultiForm()
Invalid argument supplied for foreach()Warningdrupal_web_test_case.php2924DrupalWebTestCase->assertNoDuplicateIds()
Parsed page successfully.Browserajax.test286AJAXMultiFormTestCase->testMultiForm()
Parsed page successfully.Browserajax.test288AJAXMultiFormTestCase->testMultiForm()
array_merge_recursive(): Argument #1 is not an arrayWarningajax.test289AJAXMultiFormTestCase->testMultiForm()
array_merge_recursive(): Argument #2 is not an arrayWarningajax.test289AJAXMultiFormTestCase->testMultiForm()
Parsed page successfully.Browserajax.test290AJAXMultiFormTestCase->testMultiForm()
Found the correct number of field items after an AJAX submission.Otherajax.test290AJAXMultiFormTestCase->testMultiForm()
Parsed page successfully.Browserajax.test291AJAXMultiFormTestCase->testMultiForm()
Found the "add more" button after an AJAX submission.Otherajax.test291AJAXMultiFormTestCase->testMultiForm()
Parsed page successfully.Browserajax.test292AJAXMultiFormTestCase->testMultiForm()
Invalid argument supplied for foreach()Warningdrupal_web_test_case.php2924DrupalWebTestCase->assertNoDuplicateIds()
Parsed page successfully.Browserajax.test286AJAXMultiFormTestCase->testMultiForm()
Parsed page successfully.Browserajax.test288AJAXMultiFormTestCase->testMultiForm()
array_merge_recursive(): Argument #1 is not an arrayWarningajax.test289AJAXMultiFormTestCase->testMultiForm()
array_merge_recursive(): Argument #2 is not an arrayWarningajax.test289AJAXMultiFormTestCase->testMultiForm()
Parsed page successfully.Browserajax.test290AJAXMultiFormTestCase->testMultiForm()
Found the correct number of field items after an AJAX submission.Otherajax.test290AJAXMultiFormTestCase->testMultiForm()
Parsed page successfully.Browserajax.test291AJAXMultiFormTestCase->testMultiForm()
Found the "add more" button after an AJAX submission.Otherajax.test291AJAXMultiFormTestCase->testMultiForm()
Parsed page successfully.Browserajax.test292AJAXMultiFormTestCase->testMultiForm()
Invalid argument supplied for foreach()Warningdrupal_web_test_case.php2924DrupalWebTestCase->assertNoDuplicateIds()
LeafAnonymous comments (CommentAnonymous) [Comment]15100
LeafAutocompletion (ProfileTestAutocomplete) [Profile]5400
LeafBasic SQL syntax tests (DatabaseBasicSyntaxTestCase) [Database]2600
ExpandBasic upgrade path (BasicUpgradePath) [Upgrade path]404
MessageGroupFilenameLineFunctionStatus
SQLSTATE[42S02]: Base table or view not found: 1146 Table 'drupal_checkout.simpletest710199clear_cache' doesn't exist: INSERT INTO {clear_cache} (cid, bin, wildcard, created) VALUES (:db_insert_placeholder_0, :db_insert_placeholder_1, :db_insert_placeholder_2, :db_insert_placeholder_3); Array ( [:db_insert_placeholder_0] => variables [:db_insert_placeholder_1] => cache_bootstrap [:db_insert_placeholder_2] => 0 [:db_insert_placeholder_3] => 1281851147 ) PDOExceptioncache.inc170cache_clear_all()
PDOException: SQLSTATE[42S02]: Base table or view not found: 1146 Table 'drupal_checkout.simpletest710199clear_cache' doesn't exist: INSERT INTO {clear_cache} (cid, bin, wildcard, created) VALUES (:db_insert_placeholder_0, :db_insert_placeholder_1, :db_insert_placeholder_2, :db_insert_placeholder_3); Array ( [:db_insert_placeholder_0] => variables [:db_insert_placeholder_1] => cache_bootstrap [:db_insert_placeholder_2] => 0 [:db_insert_placeholder_3] => 1281849752 ) in cache_clear_all() (line 170 of /var/www/sites/default/files/checkout/includes/cache.inc).Uncaught exceptiondatabase.inc1947PDOStatement->execute()
SQLSTATE[42S02]: Base table or view not found: 1146 Table 'drupal_checkout.simpletest455042clear_cache' doesn't exist: INSERT INTO {clear_cache} (cid, bin, wildcard, created) VALUES (:db_insert_placeholder_0, :db_insert_placeholder_1, :db_insert_placeholder_2, :db_insert_placeholder_3); Array ( [:db_insert_placeholder_0] => variables [:db_insert_placeholder_1] => cache_bootstrap [:db_insert_placeholder_2] => 0 [:db_insert_placeholder_3] => 1281851149 ) PDOExceptioncache.inc170cache_clear_all()
PDOException: SQLSTATE[42S02]: Base table or view not found: 1146 Table 'drupal_checkout.simpletest455042clear_cache' doesn't exist: INSERT INTO {clear_cache} (cid, bin, wildcard, created) VALUES (:db_insert_placeholder_0, :db_insert_placeholder_1, :db_insert_placeholder_2, :db_insert_placeholder_3); Array ( [:db_insert_placeholder_0] => variables [:db_insert_placeholder_1] => cache_bootstrap [:db_insert_placeholder_2] => 0 [:db_insert_placeholder_3] => 1281849752 ) in cache_clear_all() (line 170 of /var/www/sites/default/files/checkout/includes/cache.inc).Uncaught exceptiondatabase.inc1947PDOStatement->execute()
LeafBatch percentages (BatchPercentagesUnitTestCase) [Batch API]1300
LeafBatch processing (BatchProcessingTestCase) [Batch API]14700
LeafBatch progress page (BatchPageTestCase) [Batch API]700
LeafBike shed (SearchBikeShed) [Search]1600
LeafBlock availability (BookBlockTestCase) [Book]1800
LeafBlock availability (NodeBlockTestCase) [Node]1800
LeafBlock availability (PollBlockTestCase) [Poll]10000
LeafBlock availability (ProfileBlockTestCase) [Profile]9000
LeafBlock availability (SearchBlockTestCase) [Search]5100
ExpandBlock caching (BlockCacheTestCase) [Block]22170
MessageGroupFilenameLineFunctionStatus
Block is served from the cache.Otherblock.test443BlockCacheTestCase->testCachePerRole()
User with the same roles sees per-role cached content.Otherblock.test461BlockCacheTestCase->testCachePerRole()
Block is served from the per-role cache.Otherblock.test469BlockCacheTestCase->testCachePerRole()
Block content served from global cache.Otherblock.test489BlockCacheTestCase->testCacheGlobal()
Block is served from per-user cache.Otherblock.test528BlockCacheTestCase->testCachePerUser()
Per-user block cache is persistent.Otherblock.test536BlockCacheTestCase->testCachePerUser()
Block content cached for the node page.Otherblock.test557BlockCacheTestCase->testCachePerPage()
LeafBlock functionality (BlockTestCase) [Block]26800
LeafBlock functionality (SystemBlockTestCase) [System]3400
LeafBlock HTML id (BlockHTMLIdTestCase) [Block]1500
LeafBlog functionality (BlogTestCase) [Blog]24100
LeafBook functionality (BookTestCase) [Book]26000
ExpandBoot and exit hook invocation (HookBootExitTestCase) [Bootstrap]1260
MessageGroupFilenameLineFunctionStatus
Page has been cached.Otherbootstrap.test310HookBootExitTestCase->testHookBootExit()
hook_boot not called with agressive cache and a cached page.Otherbootstrap.test312HookBootExitTestCase->testHookBootExit()
hook_exit not called with agressive cache and a cached page.Otherbootstrap.test313HookBootExitTestCase->testHookBootExit()
Page cache cleared.Otherbootstrap.test316HookBootExitTestCase->testHookBootExit()
hook_boot called with agressive cache and no cached page.Otherbootstrap.test319HookBootExitTestCase->testHookBootExit()
hook_exit called with agressive cache and no cached page.Otherbootstrap.test320HookBootExitTestCase->testHookBootExit()
ExpandCache clear test (CacheClearCase) [Cache]580
MessageGroupFilenameLineFunctionStatus
Cache was set for clearing cid.Othercache.test237CacheClearCase->testClearCid()
Two caches were created for checking cid "*" with wildcard false.Othercache.test246CacheClearCase->testClearCid()
Two caches still exists after clearing cid "*" with wildcard false.Othercache.test250CacheClearCase->testClearCid()
Two caches were created for checking cid "*" with wildcard true.Othercache.test261CacheClearCase->testClearWildcard()
Two caches were created for checking cid substring with wildcard true.Othercache.test271CacheClearCase->testClearWildcard()
Three cache entries were created.Othercache.test289CacheClearCase->testClearArray()
Entry was not cleared from the cacheOthercache.test298CacheClearCase->testClearArray()
Two cache entries were created.Othercache.test307CacheClearCase->testClearArray()
ExpandCache emptiness test (CacheIsEmptyCase) [Cache]320
MessageGroupFilenameLineFunctionStatus
Cache was set.Othercache.test344CacheIsEmptyCase->testIsEmpty()
The cache bin is not emptyOthercache.test345CacheIsEmptyCase->testIsEmpty()
ExpandCache saving test (CacheSavingCase) [Cache]050
MessageGroupFilenameLineFunctionStatus
String is saved and restored properly.Othercache.test161CacheSavingCase->checkVariable()
Integer is saved and restored properly.Othercache.test161CacheSavingCase->checkVariable()
Double is saved and restored properly.Othercache.test161CacheSavingCase->checkVariable()
Array is saved and restored properly.Othercache.test161CacheSavingCase->checkVariable()
Object is saved and restored properly.Othercache.test152CacheSavingCase->testObject()
LeafCancel account (UserCancelTestCase) [User]23700
LeafCascading stylesheets (CascadingStylesheetsTestCase) [System]2100
LeafCategorize feed functionality (CategorizeFeedTestCase) [Aggregator]1900
LeafCategorize feed item functionality (CategorizeFeedItemTestCase) [Aggregator]5300
LeafChecks display of aggregator items (AggregatorRenderingTestCase) [Aggregator]6800
LeafCJK tokenizer (SearchTokenizerTestCase) [Search]200
LeafColor functionality (ColorTestCase) [Color]6100
LeafComment approval (CommentApprovalTest) [Comment]15400
LeafComment blocks (CommentBlockFunctionalTest) [Comment]11500
LeafComment count toggle (SearchCommentCountToggleTestCase) [Search]3000
LeafComment interface (CommentInterfaceTest) [Comment]22300
LeafComment paging settings (CommentPagerTest) [Comment]20800
LeafComment preview (CommentPreviewTest) [Comment]7200
LeafComment Rebuild (CommentContentRebuild) [Comment]3200
LeafComment RSS (CommentRSSUnitTest) [Comment]2400
LeafComment Search tests (SearchCommentTestCase) [Search]13900
LeafComment token replacement (CommentTokenReplaceTestCase) [Comment]6400
LeafCompact mode (CompactModeTest) [System]2600
LeafConfig settings form (SearchConfigSettingsForm) [Search]11600
LeafConnection tests (DatabaseConnectionTestCase) [Database]3400
LeafContent language settings (LocaleContentFunctionalTest) [Locale]8500
LeafCore filters (FilterUnitTestCase) [Filter]13300
LeafCron run (CronRunTestCase) [System]4500
LeafCSS Unit Tests (CascadingStylesheetsUnitTest) [System]600
LeafCustom query syntax tests (DatabaseQueryTestCase) [Database]600
LeafDashboard access (DashboardAccessTestCase) [Dashboard]3400
LeafData API functions (DrupalDataApiTest) [System]3200
LeafDate and time (DateTimeFunctionalTest) [System]9600
LeafDBLog functionality (DBLogTestCase) [DBLog]44000
LeafDefault text format functionality (FilterDefaultFormatTestCase) [Filter]3300
LeafDelete/Truncate tests (DatabaseDeleteTruncateTestCase) [Database]2000
LeafDrupal error handlers (DrupalErrorHandlerUnitTest) [System]2800
LeafDrupal goto (DrupalGotoTest) [System]1800
LeafDrupal HTTP request (DrupalHTTPRequestTestCase) [System]2700
LeafDrupal match path (DrupalMatchPathTestCase) [Path API]4100
LeafDrupal render (DrupalRenderUnitTestCase) [System]700
LeafDrupal set/get regions (DrupalSetContentTestCase) [System]3800
LeafDrupal tags handling (DrupalTagsHandlingTestCase) [System]800
Leafdrupal_alter() tests (DrupalAlterTestCase) [System]500
LeafEmbedded forms (SearchEmbedForm) [Search]2900
LeafEmpty statement (DatabaseEmptyStatementTestCase) [Database]400
LeafEnable/disable modules (EnableDisableTestCase) [Module]5500
LeafEntity query (EntityFieldQueryTestCase) [Entity API]7300
LeafFeed parser functionality (FeedParserTestCase) [Aggregator]4000
LeafFetch tests (DatabaseFetchTestCase) [Database]3300
LeafFetch tests, part 2 (DatabaseFetch2TestCase) [Database]2600
ExpandFetching multiple cache items (CacheGetMultipleUnitTest) [Cache]166
MessageGroupFilenameLineFunctionStatus
Item 1 is cached.Othercache.test191CacheGetMultipleUnitTest->testCacheMultiple()
Item 2 is cached.Othercache.test192CacheGetMultipleUnitTest->testCacheMultiple()
Undefined index: item1Noticecache.test197CacheGetMultipleUnitTest->testCacheMultiple()
Trying to get property of non-objectNoticecache.test197CacheGetMultipleUnitTest->testCacheMultiple()
Item was returned from cache successfully.Othercache.test197CacheGetMultipleUnitTest->testCacheMultiple()
Undefined index: item2Noticecache.test198CacheGetMultipleUnitTest->testCacheMultiple()
Trying to get property of non-objectNoticecache.test198CacheGetMultipleUnitTest->testCacheMultiple()
Item was returned from cache successfully.Othercache.test198CacheGetMultipleUnitTest->testCacheMultiple()
Undefined index: item1Noticecache.test206CacheGetMultipleUnitTest->testCacheMultiple()
Trying to get property of non-objectNoticecache.test206CacheGetMultipleUnitTest->testCacheMultiple()
Item was returned from cache successfully.Othercache.test206CacheGetMultipleUnitTest->testCacheMultiple()
Only valid cache entries returned.Othercache.test208CacheGetMultipleUnitTest->testCacheMultiple()
ExpandField attach tests (other) (FieldAttachOtherTestCase) [Field API]4133
MessageGroupFilenameLineFunctionStatus
Trying to get property of non-objectNoticefield.test819FieldAttachOtherTestCase->testFieldAttachCache()
Cached: correct cache entry on loadOtherfield.test819FieldAttachOtherTestCase->testFieldAttachCache()
Trying to get property of non-objectNoticefield.test832FieldAttachOtherTestCase->testFieldAttachCache()
Cached: correct cache entry on loadOtherfield.test832FieldAttachOtherTestCase->testFieldAttachCache()
Trying to get property of non-objectNoticefield.test847FieldAttachOtherTestCase->testFieldAttachCache()
Cached: correct cache entry on loadOtherfield.test847FieldAttachOtherTestCase->testFieldAttachCache()
LeafField attach tests (storage-related) (FieldAttachStorageTestCase) [Field API]8300
LeafField bulk delete tests (FieldBulkDeleteTestCase) [Field API]4000
LeafField CRUD tests (FieldCrudTestCase) [Field API]5900
LeafField Display API tests (FieldDisplayAPITestCase) [Field API]4200
LeafField form tests (FieldFormTestCase) [Field API]16600
LeafField info tests (FieldInfoTestCase) [Field API]7900
LeafField instance CRUD tests (FieldInstanceCrudTestCase) [Field API]3200
LeafField SQL storage tests (FieldSqlStorageTestCase) [Field API]8300
LeafField translations tests (FieldTranslationsTestCase) [Field API]4400
LeafField UI tests (FieldUITestCase) [Field UI]15600
LeafFile copying (FileCopyTest) [File API]10600
LeafFile delete (FileDeleteTest) [File API]800
LeafFile download (FileDownloadTest) [File API]3500
LeafFile field display tests (FileFieldDisplayTestCase) [File]2000
LeafFile field file path tests (FileFieldPathTestCase) [File]2300
LeafFile field revision test (FileFieldRevisionTestCase) [File]6700
LeafFile field validation tests (FileFieldValidateTestCase) [File]10200
LeafFile field widget test (FileFieldWidgetTestCase) [File]6100
LeafFile loading (FileLoadTest) [File API]2900
LeafFile mimetypes (FileMimeTypeTest) [File API]3800
LeafFile moving (FileMoveTest) [File API]10500
LeafFile naming (FileNameMungingTest) [File API]400
LeafFile paths and directories (FileDirectoryTest) [File API]2000
LeafFile save data (FileSaveDataTest) [File API]8800
LeafFile saving (FileSaveTest) [File API]1400
LeafFile scan directory (FileScanDirectoryTest) [File API]2300
LeafFile space used tests (FileSpaceUsedTest) [File API]1100
LeafFile token replacement (FileTokenReplaceTestCase) [File]3500
LeafFile uploading (FileSaveUploadTest) [File API]26900
LeafFile URL rewriting (FileURLRewritingTest) [File]1500
LeafFile validate (FileValidateTest) [File API]1100
LeafFile validator tests (FileValidatorTest) [File API]2700
LeafFileTransfer unit tests (FileTranferTest) [System]200
LeafFilter administration functionality (FilterAdminTestCase) [Filter]14500
LeafFilter CRUD operations (FilterCRUDTestCase) [Filter]19100
LeafFilter format access (FilterFormatAccessTestCase) [Filter]13400
LeafFilter format hooks (FilterHooksTestCase) [Filter]3300
LeafFingerprinting meta tag (AdminMetaTagTestCase) [System]300
LeafFlood control mechanism (FloodFunctionalTest) [System]600
LeafForm alter hooks (FormAlterTestCase) [Form API]300
LeafForm API file inclusion (FormsFileInclusionTestCase) [Form API]900
LeafForm element and label output test (FormsElementsLabelsTestCase) [Form API]1500
LeafForm element validation (FormsTestCase) [Form API]27700
LeafForm rebuilding (FormsRebuildTestCase) [Form API]4900
LeafForm state values clearance (FormStateValuesCleanTestCase) [Form API]1300
LeafForm triggering element determination (FormsTriggeringElementTestCase) [Form API]4800
LeafForm validation handlers (FormValidationTestCase) [Form API]3000
LeafForm wrapper callback (FormsFormWrapperTestCase) [Form API]400
LeafFormat date (FormatDateUnitTest) [System]4300
LeafForum functionality (ForumTestCase) [Forum]71100
LeafFront page (FrontPageTestCase) [System]3600
LeafGet filename test (BootstrapGetFilenameTestCase) [Bootstrap]400
LeafGraph (GraphUnitTest) [System]2800
LeafHelp functionality (HelpTestCase) [Help]37500
LeafHTML Attributes (DrupalAttributesUnitTest) [System]600
LeafHTML identifiers (DrupalHTMLIdentifierTestCase) [System]1000
LeafHTML in page titles (PageTitleFiltering) [System]4000
LeafHTTP file retrieval (RetrieveFileTestCase) [System]700
LeafImage effects (ImageEffectsUnitTest) [Image]3800
LeafImage field display tests (ImageFieldDisplayTestCase) [Image]10500
LeafImage field validation tests (ImageFieldValidateTestCase) [Image]1800
LeafImage GD manipulation tests (ImageToolkitGdTestCase) [Image]100
ExpandImage styles and effects UI configuration (ImageAdminStylesUnitTest) [Image]20020
MessageGroupFilenameLineFunctionStatus
The order of the effects is correctly set by default.Otherimage.test486ImageAdminStylesUnitTest->testStyle()
The order of the effects is correctly set by default.Otherimage.test486ImageAdminStylesUnitTest->testStyle()
ExpandImage styles path and URL functions (ImageStylesPathAndUrlUnitTest) [Image]47306
MessageGroupFilenameLineFunctionStatus
Service Unavailable response received.Browserimage.test196ImageStylesPathAndUrlUnitTest->_testImageStyleUrlAndPath()
Retry-After header received.Otherimage.test197ImageStylesPathAndUrlUnitTest->_testImageStyleUrlAndPath()
Generated file was created.Otherimage.test202ImageStylesPathAndUrlUnitTest->_testImageStyleUrlAndPath()
file_get_contents(public://styles/style_foo/image-test_0.png): failed to open stream: "DrupalPublicStreamWrapper::stream_open" call failedWarningimage.test203ImageStylesPathAndUrlUnitTest->_testImageStyleUrlAndPath()
URL returns expected file.Otherimage.test203ImageStylesPathAndUrlUnitTest->_testImageStyleUrlAndPath()
Expected Content-Type was reported.Otherimage.test205ImageStylesPathAndUrlUnitTest->_testImageStyleUrlAndPath()
Expected Content-Length was reported.Otherimage.test206ImageStylesPathAndUrlUnitTest->_testImageStyleUrlAndPath()
Got the download URL for an existing file.Otherimage.test213ImageStylesPathAndUrlUnitTest->_testImageStyleUrlAndPath()
file_get_contents(public://styles/style_foo/image-test_0.png): failed to open stream: "DrupalPublicStreamWrapper::stream_open" call failedWarningimage.test214ImageStylesPathAndUrlUnitTest->_testImageStyleUrlAndPath()
URL returns expected file.Otherimage.test214ImageStylesPathAndUrlUnitTest->_testImageStyleUrlAndPath()
Expected Content-Type was reported.Otherimage.test215ImageStylesPathAndUrlUnitTest->_testImageStyleUrlAndPath()
Expected Content-Length was reported.Otherimage.test216ImageStylesPathAndUrlUnitTest->_testImageStyleUrlAndPath()
Service Unavailable response received.Browserimage.test196ImageStylesPathAndUrlUnitTest->_testImageStyleUrlAndPath()
Retry-After header received.Otherimage.test197ImageStylesPathAndUrlUnitTest->_testImageStyleUrlAndPath()
Generated file was created.Otherimage.test202ImageStylesPathAndUrlUnitTest->_testImageStyleUrlAndPath()
file_get_contents(public://styles/style_foo/image-test_0.png): failed to open stream: "DrupalPublicStreamWrapper::stream_open" call failedWarningimage.test203ImageStylesPathAndUrlUnitTest->_testImageStyleUrlAndPath()
URL returns expected file.Otherimage.test203ImageStylesPathAndUrlUnitTest->_testImageStyleUrlAndPath()
Expected Content-Type was reported.Otherimage.test205ImageStylesPathAndUrlUnitTest->_testImageStyleUrlAndPath()
Expected Content-Length was reported.Otherimage.test206ImageStylesPathAndUrlUnitTest->_testImageStyleUrlAndPath()
Got the download URL for an existing file.Otherimage.test213ImageStylesPathAndUrlUnitTest->_testImageStyleUrlAndPath()
file_get_contents(public://styles/style_foo/image-test_0.png): failed to open stream: "DrupalPublicStreamWrapper::stream_open" call failedWarningimage.test214ImageStylesPathAndUrlUnitTest->_testImageStyleUrlAndPath()
URL returns expected file.Otherimage.test214ImageStylesPathAndUrlUnitTest->_testImageStyleUrlAndPath()
Expected Content-Type was reported.Otherimage.test215ImageStylesPathAndUrlUnitTest->_testImageStyleUrlAndPath()
Expected Content-Length was reported.Otherimage.test216ImageStylesPathAndUrlUnitTest->_testImageStyleUrlAndPath()
Service Unavailable response received.Browserimage.test196ImageStylesPathAndUrlUnitTest->_testImageStyleUrlAndPath()
Retry-After header received.Otherimage.test197ImageStylesPathAndUrlUnitTest->_testImageStyleUrlAndPath()
Generated file was created.Otherimage.test202ImageStylesPathAndUrlUnitTest->_testImageStyleUrlAndPath()
file_get_contents(private://styles/style_foo/image-test.png): failed to open stream: "DrupalPrivateStreamWrapper::stream_open" call failedWarningimage.test203ImageStylesPathAndUrlUnitTest->_testImageStyleUrlAndPath()
URL returns expected file.Otherimage.test203ImageStylesPathAndUrlUnitTest->_testImageStyleUrlAndPath()
Expected Content-Type was reported.Otherimage.test205ImageStylesPathAndUrlUnitTest->_testImageStyleUrlAndPath()
Expected Content-Length was reported.Otherimage.test206ImageStylesPathAndUrlUnitTest->_testImageStyleUrlAndPath()
Got the download URL for an existing file.Otherimage.test213ImageStylesPathAndUrlUnitTest->_testImageStyleUrlAndPath()
file_get_contents(private://styles/style_foo/image-test.png): failed to open stream: "DrupalPrivateStreamWrapper::stream_open" call failedWarningimage.test214ImageStylesPathAndUrlUnitTest->_testImageStyleUrlAndPath()
URL returns expected file.Otherimage.test214ImageStylesPathAndUrlUnitTest->_testImageStyleUrlAndPath()
Expected Content-Type was reported.Otherimage.test215ImageStylesPathAndUrlUnitTest->_testImageStyleUrlAndPath()
Expected Content-Length was reported.Otherimage.test216ImageStylesPathAndUrlUnitTest->_testImageStyleUrlAndPath()
LeafImage toolkit tests (ImageToolkitUnitTest) [Image]4800
LeafImport feeds from OPML functionality (ImportOPMLTestCase) [Aggregator]5300
LeafInfo file format parser (InfoFileParserTestCase) [System]900
LeafInsert tests (DatabaseInsertTestCase) [Database]4500
LeafInsert tests, default fields (DatabaseInsertDefaultsTestCase) [Database]1900
LeafInsert tests, LOB fields (DatabaseInsertLOBTestCase) [Database]1300
LeafInvalid data (DatabaseInvalidDataTestCase) [Database]700
LeafIP address and HTTP_HOST test (BootstrapIPAddressTestCase) [Bootstrap]1100
LeafIP address blocking (IPAddressBlockingTestCase) [System]4200
LeafJavaScript (JavaScriptTestCase) [System]3500
LeafJSON (DrupalJSONTest) [System]1400
LeafKeywords and conditions (SearchKeywordsConditions) [Search]2500
LeafLanguage configuration (LocaleConfigurationTest) [Locale]11400
LeafLanguage switching (LocaleLanguageSwitchingFunctionalTest) [Locale]2100
LeafList field (ListFieldTestCase) [Field types]1400
LeafList field UI (ListFieldUITestCase) [Field types]2400
LeafLoad multiple nodes (NodeLoadMultipleUnitTest) [Node]3600
LeafLocale uninstall (EN) (LocaleUninstallFunctionalTest) [Locale]3100
LeafLocale uninstall (FR) (LocaleUninstallFrenchFunctionalTest) [Locale]3100
LeafLocalize date formats (LocaleDateFormatsFunctionalTest) [Locale]5600
LeafLocking framework tests (LockFunctionalTest) [System]1700
LeafMail system (MailTestCase) [System]100
LeafMain content rendering fallback (SystemMainContentFallback) [System]6600
LeafMenu link creation/deletion (MenuTestCase) [Menu]43600
LeafMenu rebuild test (MenuRebuildTestCase) [Menu]500
LeafMenu router (MenuRouterTestCase) [Menu]15900
LeafMenu settings for nodes (MenuNodeTestCase) [Menu]4700
LeafMenu tree generation (MenuTreeDataTestCase) [Menu]400
LeafMerge tests (DatabaseMergeTestCase) [Database]7500
LeafMiscellaneous AJAX tests (AJAXElementValidation) [AJAX]800
LeafMissing update dependencies (UpdateDependencyMissingTestCase) [Update API]300
LeafModule API (ModuleUnitTest) [Module]3300
LeafModule dependencies (ModuleDependencyTestCase) [Module]6200
LeafModule installation (ModuleInstallTestCase) [Module]200
LeafModule uninstallation (ModuleUninstallTestCase) [Module]100
LeafModule versions (ModuleVersionTestCase) [Module]5000
LeafMultilingual fields (LocaleMultilingualFieldsFunctionalTest) [Locale]5200
LeafMultistep form using form storage (FormsFormStorageTestCase) [Form API]12900
LeafMultistep node form basic options (MultiStepNodeFormBasicOptionsTest) [Node]1500
LeafNew default theme blocks (NewDefaultThemeBlocks) [Block]2500
LeafNo help (NoHelpTestCase) [Help]1100
LeafNode access (NodeAccessUnitTest) [Node]3100
LeafNode access rebuild (NodeAccessRebuildTestCase) [Node]1600
LeafNode access records (NodeAccessRecordsUnitTest) [Node]2200
LeafNode administration (NodeAdminTestCase) [Node]11900
LeafNode blocks (NodeBlockFunctionalTest) [Node]8300
LeafNode creation (NodeCreationTestCase) [Node]2500
LeafNode edit (PageEditTestCase) [Node]9300
LeafNode edit permissions (PageViewTestCase) [Node]3200
LeafNode feed (NodeFeedTestCase) [Node]100
LeafNode post information display (NodePostSettingsTestCase) [Node]3400
LeafNode preview (PagePreviewTestCase) [Node]3500
LeafNode query alter (NodeQueryAlter) [Node]5100
LeafNode revisions (NodeRevisionsTestCase) [Node]4400
LeafNode RSS Content (NodeRSSContentTestCase) [Node]1600
LeafNode save (NodeSaveTestCase) [Node]2800
LeafNode title (NodeTitleTestCase) [Node]2000
LeafNode title XSS filtering (NodeTitleXSSTestCase) [Node]2000
LeafNode token replacement (NodeTokenReplaceTestCase) [Node]3400
LeafNode types (NodeTypeTestCase) [Node]8400
LeafNon default theme admin (NonDefaultBlockAdmin) [Block]1000
LeafOpenID account registration (OpenIDRegistrationTestCase) [OpenID]13100
LeafOpenID discovery and login (OpenIDFunctionalTestCase) [OpenID]22900
LeafOpenID helper functions (OpenIDUnitTest) [OpenID]3200
LeafOptions widgets (OptionsWidgetsTestCase) [Field types]22300
ExpandPage cache test (BootstrapPageCacheTestCase) [Bootstrap]7290
MessageGroupFilenameLineFunctionStatus
Page was cached.Otherbootstrap.test126BootstrapPageCacheTestCase->testConditionalRequests()
Conditional request returned 304 Not Modified.Browserbootstrap.test131BootstrapPageCacheTestCase->testConditionalRequests()
Conditional request with obsolete If-Modified-Since date returned 304 Not Modified.Browserbootstrap.test134BootstrapPageCacheTestCase->testConditionalRequests()
Conditional request with obsolete If-Modified-Since date returned 304 Not Modified.Browserbootstrap.test137BootstrapPageCacheTestCase->testConditionalRequests()
Page was cached.Otherbootstrap.test141BootstrapPageCacheTestCase->testConditionalRequests()
Page was cached.Otherbootstrap.test145BootstrapPageCacheTestCase->testConditionalRequests()
Page was cached.Otherbootstrap.test170BootstrapPageCacheTestCase->testPageCache()
Page was cached.Otherbootstrap.test212BootstrapPageCacheTestCase->testPageCompression()
Page was cached.Otherbootstrap.test219BootstrapPageCacheTestCase->testPageCompression()
LeafPager query tests (DatabaseSelectPagerDefaultTestCase) [Database]3400
LeafParsing .info files (ParseInfoFilesTestCase) [System]300
LeafPath alias functionality (PathTestCase) [Path]10200
LeafPath aliases with languages (PathLanguageUITestCase) [Path]6900
LeafPath aliases with translated nodes (PathLanguageTestCase) [Path]6300
LeafPath language settings (LocalePathFunctionalTest) [Locale]3600
LeafPaths on non-English monolingual sites (PathMonolingualTestCase) [Path]3400
LeafPersonal contact form (ContactPersonalTestCase) [Contact]14200
LeafPHP filter access check (PHPAccessTestCase) [PHP]3700
LeafPHP filter functionality (PHPFilterTestCase) [PHP]4100
LeafPoll add choice (PollJSAddChoice) [Poll]1500
LeafPoll create (PollCreateTestCase) [Poll]12100
LeafPoll expiration (PollExpirationTestCase) [Poll]3200
LeafPoll token replacement (PollTokenReplaceTestCase) [Poll]10600
ExpandPoll upgrade path (PollUpgradePathTestCase) [Upgrade path]202
MessageGroupFilenameLineFunctionStatus
SQLSTATE[42S02]: Base table or view not found: 1146 Table 'drupal_checkout.simpletest575479clear_cache' doesn't exist: INSERT INTO {clear_cache} (cid, bin, wildcard, created) VALUES (:db_insert_placeholder_0, :db_insert_placeholder_1, :db_insert_placeholder_2, :db_insert_placeholder_3); Array ( [:db_insert_placeholder_0] => variables [:db_insert_placeholder_1] => cache_bootstrap [:db_insert_placeholder_2] => 0 [:db_insert_placeholder_3] => 1281851150 ) PDOExceptioncache.inc170cache_clear_all()
PDOException: SQLSTATE[42S02]: Base table or view not found: 1146 Table 'drupal_checkout.simpletest575479clear_cache' doesn't exist: INSERT INTO {clear_cache} (cid, bin, wildcard, created) VALUES (:db_insert_placeholder_0, :db_insert_placeholder_1, :db_insert_placeholder_2, :db_insert_placeholder_3); Array ( [:db_insert_placeholder_0] => variables [:db_insert_placeholder_1] => cache_bootstrap [:db_insert_placeholder_2] => 0 [:db_insert_placeholder_3] => 1281849752 ) in cache_clear_all() (line 170 of /var/www/sites/default/files/checkout/includes/cache.inc).Uncaught exceptiondatabase.inc1947PDOStatement->execute()
LeafPoll vote (PollVoteTestCase) [Poll]8000
LeafProfile browsing (ProfileTestBrowsing) [Profile]3200
LeafProgrammatic form submissions (FormsProgrammaticTestCase) [Form API]1800
LeafQuery altering tests (DatabaseAlterTestCase) [Database]5500
LeafQuery logging (DatabaseLoggingTestCase) [Database]3800
LeafQuery tagging tests (DatabaseTaggingTestCase) [Database]2800
LeafQueue functionality (QueueTestCase) [System]700
LeafRange query test (DatabaseRangeQueryTestCase) [Database]200
LeafRDF comment mapping (RdfCommentAttributesTestCase) [RDF]20400
LeafRDF mapping CRUD functions (RdfCrudTestCase) [RDF]900
LeafRDF mapping definition functionality (RdfMappingDefinitionTestCase) [RDF]5800
LeafRDF mapping hook (RdfMappingHookTestCase) [RDF]500
LeafRDF namespaces (RdfGetRdfNamespacesTestCase) [RDF]400
LeafRDF namespaces XML serialization tests (DrupalGetRdfNamespacesTestCase) [System]600
LeafRDF tracker page mapping (RdfTrackerAttributesTestCase) [RDF]3200
LeafRDFa markup (RdfRdfaMarkupTestCase) [RDF]2100
LeafRebuild arbitrary forms (FormsArbitraryRebuildTestCase) [Form API]1400
LeafRebuild content (NodeBuildContent) [Node]100
LeafRegistry parse file test (RegistryParseFileTestCase) [System]200
LeafRegistry parse files test (RegistryParseFilesTestCase) [System]600
LeafRegression tests (DatabaseRegressionTestCase) [Database]2700
LeafRemove feed functionality (RemoveFeedTestCase) [Aggregator]2300
LeafRemove feed item functionality (RemoveFeedItemTestCase) [Aggregator]19600
LeafRender cache race (RenderCacheTest) [System]200
LeafRequired modules (ModuleRequiredTestCase) [Module]2100
LeafRequirements hook failure (HookRequirementsTestCase) [Module]1500
LeafResettable static variables test (BootstrapResettableStaticTestCase) [Bootstrap]500
LeafRole assignment (UserRolesAssignmentTestCase) [User]5300
LeafRole permissions (UserPermissionsTestCase) [User]5000
LeafSchema API (SchemaTestCase) [Database]2700
LeafSearch engine phrase queries (SearchExactTestCase) [Search]2200
LeafSearch engine queries (SearchMatchTestCase) [Search]14400
LeafSearch engine ranking (SearchRankingTestCase) [Search]6000
LeafSearch excerpt extraction (SearchExcerptTestCase) [Search]500
LeafSearch expression insert/extract (SearchExpressionInsertExtractTestCase) [Search]2400
LeafSearch simplify (SearchSimplifyTestCase) [Search]33800
LeafSelect tests (DatabaseSelectTestCase) [Database]11700
LeafSelect tests, complex (DatabaseSelectComplexTestCase) [Database]11500
LeafSelect tests, ordered (DatabaseSelectOrderedTestCase) [Database]2600
LeafSelect tests, subqueries (DatabaseSelectSubqueryTestCase) [Database]2400
LeafSequences API (DatabaseNextIdCase) [Database]200
LeafSession https handling (SessionHttpsTestCase) [Session]6800
LeafSession tests (SessionTestCase) [Session]14600
LeafShortcut link functionality (ShortcutLinksTestCase) [Shortcut]9600
LeafShortcut set functionality (ShortcutSetsTestCase) [Shortcut]15300
LeafShutdown functions (ShutdownFunctionsTest) [System]400
LeafSimpleTest browser (SimpleTestBrowserTestCase) [SimpleTest]1600
LeafSimpleTest e-mail capturing (SimpleTestMailCaptureTestCase) [SimpleTest]1300
LeafSimpleTest error collector (DrupalErrorCollectionUnitTest) [SimpleTest]1500
LeafSimpleTest functionality (SimpleTestFunctionalTest) [SimpleTest]9100
LeafSite maintenance mode functionality (SiteMaintenanceTestCase) [System]8000
LeafSite-wide contact form (ContactSitewideTestCase) [Contact]23700
LeafSize parsing test (CommonSizeTestCase) [System]3500
LeafStatistics logging tests (StatisticsLoggingTestCase) [Statistics]1200
LeafStatistics reports tests (StatisticsReportsTestCase) [Statistics]8000
LeafStatistics token replacement (StatisticsTokenReplaceTestCase) [Statistics]2900
LeafStream wrappers (StreamWrapperTest) [File API]2000
LeafString filtering tests (CommonXssUnitTest) [System]700
LeafString translate, search and validate (LocaleTranslationFunctionalTest) [Locale]25000
LeafString translation using st() (LocaleInstallTest) [Locale]100
LeafSummary length (SummaryLengthTestCase) [Node]1500
LeafSyslog functionality (SyslogTestCase) [Syslog]1600
LeafTableselect form element type test (FormsElementsTableSelectFunctionalTest) [Form API]6600
LeafTablesort query tests (DatabaseSelectTableSortDefaultTestCase) [Database]3400
LeafTaxonomy term functions and forms. (TaxonomyTermTestCase) [Taxonomy]17000
LeafTaxonomy term hooks (TaxonomyHooksTestCase) [Taxonomy]1900
LeafTaxonomy term multiple loading (TaxonomyLoadMultipleUnitTest) [Taxonomy]1700
LeafTaxonomy term reference field (TaxonomyTermFieldTestCase) [Taxonomy]2500
LeafTaxonomy term URL aliases (PathTaxonomyTermTestCase) [Path]3400
LeafTaxonomy token replacement (TaxonomyTokenReplaceTestCase) [Taxonomy]5300
LeafTaxonomy vocabularies (TaxonomyVocabularyUnitTest) [Taxonomy]6500
LeafTaxonomy vocabulary interface (TaxonomyVocabularyFunctionalTest) [Taxonomy]9700
LeafTemporary query test (DatabaseTemporaryQueryTestCase) [Database]500
LeafTest date field (ProfileTestDate) [Profile]4900
LeafTest field weights (ProfileTestWeights) [Profile]5300
LeafTest select field (ProfileTestSelect) [Profile]4500
LeafTest single fields (ProfileTestFields) [Profile]18000
LeafTest statistics admin. (StatisticsAdminTestCase) [Statistics]10400
LeafTest user actions (TriggerUserActionTestCase) [Trigger]12500
LeafTest user triggers (TriggerUserTokenTestCase) [Trigger]23100
LeafTesting SimpleTest setUp (SimpleTestFolderTestCase) [SimpleTest]100
LeafText field (TextFieldTestCase) [Field types]19700
LeafText summary (TextSummaryTestCase) [Field types]11600
LeafText translation (TextTranslationTestCase) [Field types]5900
LeafTheme API (ThemeUnitTest) [Theme]1100
LeafTheme initialization in hook_init() (ThemeHookInitUnitTest) [Theme]400
LeafTheme interface functionality (SystemThemeFunctionalTest) [System]6600
LeafTheme item list (ThemeItemListUnitTest) [Theme]100
LeafTheme Table (ThemeTableUnitTest) [Theme]600
LeafTimer test (BootstrapTimerTestCase) [Bootstrap]500
LeafToken replacement (TokenReplaceTestCase) [System]2700
LeafTop visitor blocking (StatisticsBlockVisitorsTestCase) [Statistics]4500
LeafTracker (TrackerTest) [Tracker]23200
LeafTransaction tests (DatabaseTransactionTestCase) [Database]3100
LeafTranslation export (LocaleExportFunctionalTest) [Locale]3700
LeafTranslation functionality (TranslationTestCase) [Translation]12400
LeafTranslation import (LocaleImportFunctionalTest) [Locale]9300
LeafTrigger content (node) actions (TriggerContentTestCase) [Trigger]42200
LeafTrigger cron (system) actions (TriggerCronTestCase) [Trigger]4900
LeafTrigger orphaned actions (TriggerOrphanedActionsTestCase) [Trigger]6600
LeafTrigger other actions (TriggerOtherTestCase) [Trigger]17200
LeafUI language negotiation (LocaleUILanguageNegotiationTest) [Locale]4700
LeafUnassigned text format functionality (FilterNoFormatTestCase) [Filter]100
LeafUnicode handling (UnicodeUnitTest) [System]17600
LeafUnmanaged file copying (FileUnmanagedCopyTest) [File API]3100
LeafUnmanaged file delete (FileUnmanagedDeleteTest) [File API]800
LeafUnmanaged file moving (FileUnmanagedMoveTest) [File API]2200
LeafUnmanaged file save data (FileUnmanagedSaveDataTest) [File API]800
LeafUnmanaged recursive file delete (FileUnmanagedDeleteRecursiveTest) [File API]1700
LeafUpdate contrib functionality (UpdateTestContribCase) [Update]13700
LeafUpdate core functionality (UpdateCoreTestCase) [Update]14700
LeafUpdate dependency hook invocation (UpdateDependencyHookInvocationTestCase) [Update API]300
LeafUpdate dependency ordering (UpdateDependencyOrderingTestCase) [Update API]300
LeafUpdate feed functionality (UpdateFeedTestCase) [Aggregator]7400
LeafUpdate feed item functionality (UpdateFeedItemTestCase) [Aggregator]6100
LeafUpdate functionality (UpdateScriptFunctionalTest) [System]7700
LeafUpdate on cron functionality (AggregatorCronTestCase) [Aggregator]5300
LeafUpdate tests (DatabaseUpdateTestCase) [Database]3500
LeafUpdate tests, Complex (DatabaseUpdateComplexTestCase) [Database]5200
LeafUpdate tests, LOB (DatabaseUpdateLOBTestCase) [Database]1300
LeafUpload and extract module functionality (UpdateTestUploadCase) [Update]1800
LeafUpload user picture (UserPictureTestCase) [User]7600
LeafURL altering (UrlAlterFunctionalTest) [Path API]2800
LeafURL generation tests (CommonURLUnitTest) [System]5600
LeafUser administration (UserAdminTestCase) [User]4400
LeafUser autocompletion (UserAutocompleteTestCase) [User]2800
LeafUser blocks (UserBlocksUnitTests) [User]4300
LeafUser create (UserCreateTestCase) [User]2700
LeafUser creation (LocaleUserCreationTest) [Locale]6800
LeafUser edit (UserEditTestCase) [User]6800
LeafUser edited own account (UserEditedOwnAccountTestCase) [User]2300
LeafUser language settings (LocaleUserLanguageFunctionalTest) [Locale]5100
LeafUser login (UserLoginTestCase) [User]13200
LeafUser poll vote capability. (PollVoteCheckHostname) [Poll]12000
LeafUser registration (UserRegistrationTestCase) [User]8100
LeafUser role administration (UserRoleAdminTestCase) [User]3900
LeafUser save test (UserSaveTestCase) [User]300
LeafUser search (UserUserSearchTestCase) [User]3800
LeafUser signatures (UserSignatureTestCase) [User]4500
LeafUser time zones (UserTimeZoneFunctionalTest) [User]3100
LeafUser token replacement (UserTokenReplaceTestCase) [User]4300
LeafUsername/e-mail validation (UserValidationTestCase) [User]1900
LeafValid Url (ValidUrlTestCase) [System]7900
LeafVariable test (BootstrapVariableTestCase) [Bootstrap]700
LeafXML-RPC basic (XMLRPCBasicTestCase) [XML-RPC]500
LeafXML-RPC message (XMLRPCMessagesTestCase) [XML-RPC]300
LeafXML-RPC validator (XMLRPCValidator1IncTestCase) [XML-RPC]900