comment_notify_configure.patch

Test status
StatusResult
Last receivedWed, 06/01/2011 - 04:32:14
Last requestedWed, 06/01/2011 - 04:33:03
Last testedWed, 06/01/2011 - 04:33:28
Test count1
Environment status
MySQLfail
File information
Filecomment_notify_configure.patch
BranchComment Notify - 7.x-1.0-alpha1
LinkIssue Link
SummaryFAILED: [[SimpleTest]]: [MySQL] 3 pass(es), 5 fail(s), and 6 exception(s).
Details

MySQL

  1. Setup environment
  2. Detect an invalid patch URL
  3. Detect invalid repository information
  4. Detect invalid patch format
  5. Detect a non-applicable patch
  6. Detect invalid PHP syntax
  7. Detect a Drupal installation failure
  8. Detect a test run failure
  9. Detect a failing test
    Review the test failures below then if necessary run them locally until the problem has been fixed.
  10. Complete test suite with all tests passing
3 pass(es), 5 fail(s), and 6 exception(s)

Non-pass

Test namePassFailException
ExpandCommentNotifyTestCase356
MessageGroupFilenameLineFunctionStatus
Invalid permission administer comment notify.Rolecomment_notify.test34CommentNotifyTestCase->testCommentNotifyAnonymousUserFunctionalTest()
Argument 1 passed to DrupalWebTestCase::drupalLogin() must be an instance of stdClass, boolean given, called in /var/lib/drupaltestbot/sites/default/files/checkout/sites/default/modules/comment_notify/comment_notify.test on line 35 and definedRecoverable errordrupal_web_test_case.php1175DrupalWebTestCase->drupalLogin()
Trying to get property of non-objectNoticedrupal_web_test_case.php1181DrupalWebTestCase->drupalLogin()
Trying to get property of non-objectNoticedrupal_web_test_case.php1182DrupalWebTestCase->drupalLogin()
Failed to set field name to Othercomment_notify.test35CommentNotifyTestCase->testCommentNotifyAnonymousUserFunctionalTest()
Failed to set field pass to Othercomment_notify.test35CommentNotifyTestCase->testCommentNotifyAnonymousUserFunctionalTest()
Found the requested form fields at userOthercomment_notify.test35CommentNotifyTestCase->testCommentNotifyAnonymousUserFunctionalTest()
Trying to get property of non-objectNoticedrupal_web_test_case.php1188DrupalWebTestCase->drupalLogin()
User successfully logged in.User logincomment_notify.test35CommentNotifyTestCase->testCommentNotifyAnonymousUserFunctionalTest()
Undefined index: subscribe to commentsNoticeuser.module2965user_role_grant_permissions()
PDOException: SQLSTATE[23000]: Integrity constraint violation: 1048 Column 'module' cannot be null: INSERT INTO {role_permission} (rid, permission, module) VALUES (:db_insert_placeholder_0, :db_insert_placeholder_1, :db_insert_placeholder_2); Array ( [:db_insert_placeholder_0] => 1 [:db_insert_placeholder_1] => subscribe to comments [:db_insert_placeholder_2] => ) in user_role_grant_permissions() (line 2967 of /var/lib/drupaltestbot/sites/default/files/checkout/modules/user/user.module).Uncaught exceptiondatabase.inc2095PDOStatement->execute()

All

Test namePassFailException
ExpandCommentNotifyTestCase356
MessageGroupFilenameLineFunctionStatus
Invalid permission administer comment notify.Rolecomment_notify.test34CommentNotifyTestCase->testCommentNotifyAnonymousUserFunctionalTest()
Argument 1 passed to DrupalWebTestCase::drupalLogin() must be an instance of stdClass, boolean given, called in /var/lib/drupaltestbot/sites/default/files/checkout/sites/default/modules/comment_notify/comment_notify.test on line 35 and definedRecoverable errordrupal_web_test_case.php1175DrupalWebTestCase->drupalLogin()
Trying to get property of non-objectNoticedrupal_web_test_case.php1181DrupalWebTestCase->drupalLogin()
Trying to get property of non-objectNoticedrupal_web_test_case.php1182DrupalWebTestCase->drupalLogin()
Failed to set field name to Othercomment_notify.test35CommentNotifyTestCase->testCommentNotifyAnonymousUserFunctionalTest()
Failed to set field pass to Othercomment_notify.test35CommentNotifyTestCase->testCommentNotifyAnonymousUserFunctionalTest()
Found the requested form fields at userOthercomment_notify.test35CommentNotifyTestCase->testCommentNotifyAnonymousUserFunctionalTest()
Trying to get property of non-objectNoticedrupal_web_test_case.php1188DrupalWebTestCase->drupalLogin()
User successfully logged in.User logincomment_notify.test35CommentNotifyTestCase->testCommentNotifyAnonymousUserFunctionalTest()
Undefined index: subscribe to commentsNoticeuser.module2965user_role_grant_permissions()
PDOException: SQLSTATE[23000]: Integrity constraint violation: 1048 Column 'module' cannot be null: INSERT INTO {role_permission} (rid, permission, module) VALUES (:db_insert_placeholder_0, :db_insert_placeholder_1, :db_insert_placeholder_2); Array ( [:db_insert_placeholder_0] => 1 [:db_insert_placeholder_1] => subscribe to comments [:db_insert_placeholder_2] => ) in user_role_grant_permissions() (line 2967 of /var/lib/drupaltestbot/sites/default/files/checkout/modules/user/user.module).Uncaught exceptiondatabase.inc2095PDOStatement->execute()