filter-context-226963-42.patch

Test status
StatusResult
Last receivedWed, 05/25/2011 - 18:02:54
Last requestedWed, 05/25/2011 - 18:03:05
Last testedWed, 05/25/2011 - 18:36:43
Test count1
Environment status
MySQLfail
File information
Filefilter-context-226963-42.patch
BranchDrupal core - 8.x
LinkIssue Link
SummaryFAILED: [[SimpleTest]]: [MySQL] 29,730 pass(es), 64 fail(s), and 51 exception(s).
Details

MySQL

  1. Setup environment
  2. Detect an invalid patch URL
  3. Detect invalid repository information
  4. Detect invalid patch format
  5. Detect a non-applicable patch
  6. Detect invalid PHP syntax
  7. Detect a Drupal installation failure
  8. Detect a test run failure
  9. Detect a failing test
    Review the test failures below then if necessary run them locally until the problem has been fixed.
  10. Complete test suite with all tests passing
29,730 pass(es), 64 fail(s), and 51 exception(s)

Non-pass

Test namePassFailException
ExpandBlockTestCase2242920
MessageGroupFilenameLineFunctionStatus
PDOException: SQLSTATE[42S02]: Base table or view not found: 1146 Table 'drupaltestbotmysql.simpletest351086' doesn't exist: DELETE FROM {} WHERE (cid = :db_condition_placeholder_0) ; Array ( [:db_condition_placeholder_0] => filtered_html:ce55f20a0c5da805e3b602f1a1b1d927aba2d85c994bcdaf5e94bd1b3efe6a8c: ) in cache_clear_all() (line 169 of /var/lib/drupaltestbot/sites/default/files/checkout/includes/cache.inc).Uncaught exceptiondatabase.inc2095PDOStatement->execute()
SQLSTATE[42S02]: Base table or view not found: 1146 Table 'drupaltestbotmysql.simpletest152435' doesn't exist: DELETE FROM {} WHERE (cid = :db_condition_placeholder_0) ; Array ( [:db_condition_placeholder_0] => full_html:8657963bdff66ae39e1a6150d2ab8c9b3a9d362560e48b37ddab11f09c4b06ae: ) PDOExceptioncache.inc169cache_clear_all()
SQLSTATE[42S02]: Base table or view not found: 1146 Table 'drupaltestbotmysql.simpletest152435' doesn't exist: DELETE FROM {} WHERE (cid = :db_condition_placeholder_0) ; Array ( [:db_condition_placeholder_0] => full_html:8657963bdff66ae39e1a6150d2ab8c9b3a9d362560e48b37ddab11f09c4b06ae: ) PDOExceptioncache.inc169cache_clear_all()
Custom block successfully being displayed using Full HTML.Otherblock.test133BlockTestCase->testCustomBlockFormat()
SQLSTATE[42S02]: Base table or view not found: 1146 Table 'drupaltestbotmysql.simpletest152435' doesn't exist: DELETE FROM {} WHERE (cid = :db_condition_placeholder_0) ; Array ( [:db_condition_placeholder_0] => full_html:8657963bdff66ae39e1a6150d2ab8c9b3a9d362560e48b37ddab11f09c4b06ae: ) PDOExceptioncache.inc169cache_clear_all()
SQLSTATE[42S02]: Base table or view not found: 1146 Table 'drupaltestbotmysql.simpletest152435' doesn't exist: DELETE FROM {} WHERE (cid = :db_condition_placeholder_0) ; Array ( [:db_condition_placeholder_0] => full_html:8657963bdff66ae39e1a6150d2ab8c9b3a9d362560e48b37ddab11f09c4b06ae: ) PDOExceptioncache.inc169cache_clear_all()
Username field found.Logoutblock.test138BlockTestCase->testCustomBlockFormat()
SQLSTATE[42S02]: Base table or view not found: 1146 Table 'drupaltestbotmysql.simpletest152435' doesn't exist: DELETE FROM {} WHERE (cid = :db_condition_placeholder_0) ; Array ( [:db_condition_placeholder_0] => full_html:8657963bdff66ae39e1a6150d2ab8c9b3a9d362560e48b37ddab11f09c4b06ae: ) PDOExceptioncache.inc169cache_clear_all()
Failed to set field name to kBrzWaYnOtherblock.test138BlockTestCase->testCustomBlockFormat()
Failed to set field pass to tZR2gzTMEtOtherblock.test138BlockTestCase->testCustomBlockFormat()
Found the Log in buttonOtherblock.test138BlockTestCase->testCustomBlockFormat()
Found the requested form fields at userOtherblock.test138BlockTestCase->testCustomBlockFormat()
User kBrzWaYn successfully logged in.User loginblock.test138BlockTestCase->testCustomBlockFormat()
SQLSTATE[42S02]: Base table or view not found: 1146 Table 'drupaltestbotmysql.simpletest152435' doesn't exist: DELETE FROM {} WHERE (cid = :db_condition_placeholder_0) ; Array ( [:db_condition_placeholder_0] => full_html:8657963bdff66ae39e1a6150d2ab8c9b3a9d362560e48b37ddab11f09c4b06ae: ) PDOExceptioncache.inc169cache_clear_all()
Body field contains denied messageOtherblock.test140BlockTestCase->testCustomBlockFormat()
SQLSTATE[42S02]: Base table or view not found: 1146 Table 'drupaltestbotmysql.simpletest152435' doesn't exist: DELETE FROM {} WHERE (cid = :db_condition_placeholder_0) ; Array ( [:db_condition_placeholder_0] => full_html:8657963bdff66ae39e1a6150d2ab8c9b3a9d362560e48b37ddab11f09c4b06ae: ) PDOExceptioncache.inc169cache_clear_all()
Found the Save block buttonOtherblock.test141BlockTestCase->testCustomBlockFormat()
Found the requested form fields at admin/structure/block/manage/block/1/configureOtherblock.test141BlockTestCase->testCustomBlockFormat()
SQLSTATE[42S02]: Base table or view not found: 1146 Table 'drupaltestbotmysql.simpletest152435' doesn't exist: DELETE FROM {} WHERE (cid = :db_condition_placeholder_0) ; Array ( [:db_condition_placeholder_0] => full_html:8657963bdff66ae39e1a6150d2ab8c9b3a9d362560e48b37ddab11f09c4b06ae: ) PDOExceptioncache.inc169cache_clear_all()
Custom block successfully being displayed using Full HTML.Otherblock.test146BlockTestCase->testCustomBlockFormat()
SQLSTATE[42S02]: Base table or view not found: 1146 Table 'drupaltestbotmysql.simpletest889090' doesn't exist: DELETE FROM {} WHERE (cid = :db_condition_placeholder_0) ; Array ( [:db_condition_placeholder_0] => filtered_html:20898354c9b452ad46db716766bf7e529ca86ad446d13414307358341be88844: ) PDOExceptioncache.inc169cache_clear_all()
SQLSTATE[42S02]: Base table or view not found: 1146 Table 'drupaltestbotmysql.simpletest889090' doesn't exist: DELETE FROM {} WHERE (cid = :db_condition_placeholder_0) ; Array ( [:db_condition_placeholder_0] => filtered_html:20898354c9b452ad46db716766bf7e529ca86ad446d13414307358341be88844: ) PDOExceptioncache.inc169cache_clear_all()
Block successfully being displayed on the page.Otherblock.test306BlockTestCase->moveBlockToRegion()
Custom block found in sidebar_first region.Otherblock.test313BlockTestCase->moveBlockToRegion()
SQLSTATE[42S02]: Base table or view not found: 1146 Table 'drupaltestbotmysql.simpletest889090' doesn't exist: DELETE FROM {} WHERE (cid = :db_condition_placeholder_0) ; Array ( [:db_condition_placeholder_0] => filtered_html:20898354c9b452ad46db716766bf7e529ca86ad446d13414307358341be88844: ) PDOExceptioncache.inc169cache_clear_all()
Block was displayed on the front page.Otherblock.test181BlockTestCase->testBlockVisibility()
SQLSTATE[42S02]: Base table or view not found: 1146 Table 'drupaltestbotmysql.simpletest704022' doesn't exist: DELETE FROM {} WHERE (cid = :db_condition_placeholder_0) ; Array ( [:db_condition_placeholder_0] => filtered_html:5aafb762e72c9fd247e713cc3f76361a1930c94f5835293bb14234c4ccec7337: ) PDOExceptioncache.inc169cache_clear_all()
SQLSTATE[42S02]: Base table or view not found: 1146 Table 'drupaltestbotmysql.simpletest704022' doesn't exist: DELETE FROM {} WHERE (cid = :db_condition_placeholder_0) ; Array ( [:db_condition_placeholder_0] => filtered_html:5aafb762e72c9fd247e713cc3f76361a1930c94f5835293bb14234c4ccec7337: ) PDOExceptioncache.inc169cache_clear_all()
Block successfully being displayed on the page.Otherblock.test306BlockTestCase->moveBlockToRegion()
Custom block found in sidebar_first region.Otherblock.test313BlockTestCase->moveBlockToRegion()
SQLSTATE[42S02]: Base table or view not found: 1146 Table 'drupaltestbotmysql.simpletest704022' doesn't exist: DELETE FROM {} WHERE (cid = :db_condition_placeholder_0) ; Array ( [:db_condition_placeholder_0] => filtered_html:5aafb762e72c9fd247e713cc3f76361a1930c94f5835293bb14234c4ccec7337: ) PDOExceptioncache.inc169cache_clear_all()
Failed to set field custom to 1Otherblock.test222BlockTestCase->testBlockVisibilityPerUser()
Found the Save block buttonOtherblock.test222BlockTestCase->testBlockVisibilityPerUser()
Found the requested form fields at admin/structure/block/manage/block/1/configureOtherblock.test222BlockTestCase->testBlockVisibilityPerUser()
SQLSTATE[42S02]: Base table or view not found: 1146 Table 'drupaltestbotmysql.simpletest704022' doesn't exist: DELETE FROM {} WHERE (cid = :db_condition_placeholder_0) ; Array ( [:db_condition_placeholder_0] => filtered_html:5aafb762e72c9fd247e713cc3f76361a1930c94f5835293bb14234c4ccec7337: ) PDOExceptioncache.inc169cache_clear_all()
Failed to set field block[block][1] to Otherblock.test227BlockTestCase->testBlockVisibilityPerUser()
Found the Save buttonOtherblock.test227BlockTestCase->testBlockVisibilityPerUser()
Found the requested form fields at user/2/editOtherblock.test227BlockTestCase->testBlockVisibilityPerUser()
SQLSTATE[42S02]: Base table or view not found: 1146 Table 'drupaltestbotmysql.simpletest704022' doesn't exist: DELETE FROM {} WHERE (cid = :db_condition_placeholder_0) ; Array ( [:db_condition_placeholder_0] => filtered_html:5aafb762e72c9fd247e713cc3f76361a1930c94f5835293bb14234c4ccec7337: ) PDOExceptioncache.inc169cache_clear_all()
SQLSTATE[42S02]: Base table or view not found: 1146 Table 'drupaltestbotmysql.simpletest704022' doesn't exist: DELETE FROM {} WHERE (cid = :db_condition_placeholder_0) ; Array ( [:db_condition_placeholder_0] => filtered_html:5aafb762e72c9fd247e713cc3f76361a1930c94f5835293bb14234c4ccec7337: ) PDOExceptioncache.inc169cache_clear_all()
Failed to set field custom to 2Otherblock.test235BlockTestCase->testBlockVisibilityPerUser()
Found the Save block buttonOtherblock.test235BlockTestCase->testBlockVisibilityPerUser()
Found the requested form fields at admin/structure/block/manage/block/1/configureOtherblock.test235BlockTestCase->testBlockVisibilityPerUser()
SQLSTATE[42S02]: Base table or view not found: 1146 Table 'drupaltestbotmysql.simpletest704022' doesn't exist: DELETE FROM {} WHERE (cid = :db_condition_placeholder_0) ; Array ( [:db_condition_placeholder_0] => filtered_html:5aafb762e72c9fd247e713cc3f76361a1930c94f5835293bb14234c4ccec7337: ) PDOExceptioncache.inc169cache_clear_all()
Failed to set field block[block][1] to 1Otherblock.test240BlockTestCase->testBlockVisibilityPerUser()
Found the Save buttonOtherblock.test240BlockTestCase->testBlockVisibilityPerUser()
Found the requested form fields at user/2/editOtherblock.test240BlockTestCase->testBlockVisibilityPerUser()
SQLSTATE[42S02]: Base table or view not found: 1146 Table 'drupaltestbotmysql.simpletest704022' doesn't exist: DELETE FROM {} WHERE (cid = :db_condition_placeholder_0) ; Array ( [:db_condition_placeholder_0] => filtered_html:5aafb762e72c9fd247e713cc3f76361a1930c94f5835293bb14234c4ccec7337: ) PDOExceptioncache.inc169cache_clear_all()
Block was displayed according to per user block visibility setting.Otherblock.test243BlockTestCase->testBlockVisibilityPerUser()
ExpandDashboardBlocksTestCase10543
MessageGroupFilenameLineFunctionStatus
SQLSTATE[42S02]: Base table or view not found: 1146 Table 'drupaltestbotmysql.simpletest573210' doesn't exist: DELETE FROM {} WHERE (cid = :db_condition_placeholder_0) ; Array ( [:db_condition_placeholder_0] => filtered_html:54996c92973f3cb5ac3b56728543308f2ada54d9c1af8b3139a45d35fd21a707: ) PDOExceptioncache.inc169cache_clear_all()
Admin has access to the dashboard.Browserdashboard.test49DashboardBlocksTestCase->testDashboardAccess()
Admin has access to a dashboard block.Otherdashboard.test50DashboardBlocksTestCase->testDashboardAccess()
SQLSTATE[42S02]: Base table or view not found: 1146 Table 'drupaltestbotmysql.simpletest738562' doesn't exist: DELETE FROM {} WHERE (cid = :db_condition_placeholder_0) ; Array ( [:db_condition_placeholder_0] => filtered_html:dadf7e3dbfa74769930f5820e2592d25a3f6522a17f7e3993b72557b37625d7a: ) PDOExceptioncache.inc169cache_clear_all()
Block appears on the dashboard.Otherdashboard.test95DashboardBlocksTestCase->testDisableEnable()
SQLSTATE[42S02]: Base table or view not found: 1146 Table 'drupaltestbotmysql.simpletest738562' doesn't exist: DELETE FROM {} WHERE (cid = :db_condition_placeholder_0) ; Array ( [:db_condition_placeholder_0] => filtered_html:dadf7e3dbfa74769930f5820e2592d25a3f6522a17f7e3993b72557b37625d7a: ) PDOExceptioncache.inc169cache_clear_all()
Block still appears on the dashboard.Otherdashboard.test112DashboardBlocksTestCase->testDisableEnable()
ExpandFilterContextTestCase192015
MessageGroupFilenameLineFunctionStatus
Failed to set field filters[filter_test_2_context][status] to 1Otherfilter.test1772FilterContextTestCase->setUp()
Found the requested form fields at admin/config/content/formats/addOtherfilter.test1772FilterContextTestCase->setUp()
Undefined offset: 3Noticefilter.test1790FilterContextTestCase->testFilterContext()
Undefined offset: 2Noticefilter.test1790FilterContextTestCase->testFilterContext()
Undefined offset: 1Noticefilter.test1790FilterContextTestCase->testFilterContext()
Context successfully passed.Otherfilter.test1791FilterContextTestCase->testFilterContext()
Text matched.Otherfilter.test1792FilterContextTestCase->testFilterContext()
Contextual variable matched.Otherfilter.test1793FilterContextTestCase->testFilterContext()
Undefined offset: 3Noticefilter.test1798FilterContextTestCase->testFilterContext()
Undefined offset: 2Noticefilter.test1798FilterContextTestCase->testFilterContext()
Undefined offset: 1Noticefilter.test1798FilterContextTestCase->testFilterContext()
Context successfully passed.Otherfilter.test1799FilterContextTestCase->testFilterContext()
Text matched.Otherfilter.test1800FilterContextTestCase->testFilterContext()
Contextual variable matched.Otherfilter.test1801FilterContextTestCase->testFilterContext()
Undefined offset: 3Noticefilter.test1806FilterContextTestCase->testFilterContext()
Undefined offset: 2Noticefilter.test1806FilterContextTestCase->testFilterContext()
Undefined offset: 1Noticefilter.test1806FilterContextTestCase->testFilterContext()
Context successfully passed.Otherfilter.test1807FilterContextTestCase->testFilterContext()
Text matched.Otherfilter.test1808FilterContextTestCase->testFilterContext()
Contextual variable matched.Otherfilter.test1809FilterContextTestCase->testFilterContext()
Filter with contextual data successfully invalidated cache.Otherfilter.test1810FilterContextTestCase->testFilterContext()
Undefined offset: 3Noticefilter.test1814FilterContextTestCase->testFilterContext()
Undefined offset: 2Noticefilter.test1814FilterContextTestCase->testFilterContext()
Undefined offset: 1Noticefilter.test1814FilterContextTestCase->testFilterContext()
Context successfully passed.Otherfilter.test1815FilterContextTestCase->testFilterContext()
Text matched.Otherfilter.test1816FilterContextTestCase->testFilterContext()
Contextual variable matched.Otherfilter.test1817FilterContextTestCase->testFilterContext()
Undefined offset: 3Noticefilter.test1822FilterContextTestCase->testFilterContext()
Undefined offset: 2Noticefilter.test1822FilterContextTestCase->testFilterContext()
Undefined offset: 1Noticefilter.test1822FilterContextTestCase->testFilterContext()
Context successfully passed.Otherfilter.test1823FilterContextTestCase->testFilterContext()
Text matched.Otherfilter.test1824FilterContextTestCase->testFilterContext()
Contextual variable matched.Otherfilter.test1825FilterContextTestCase->testFilterContext()
No cache mix-up.Otherfilter.test1826FilterContextTestCase->testFilterContext()
No cache mix-up.Otherfilter.test1827FilterContextTestCase->testFilterContext()
ExpandNodeBlockFunctionalTest8122
MessageGroupFilenameLineFunctionStatus
SQLSTATE[42S02]: Base table or view not found: 1146 Table 'drupaltestbotmysql.simpletest861388' doesn't exist: DELETE FROM {} WHERE (cid = :db_condition_placeholder_0) ; Array ( [:db_condition_placeholder_0] => filtered_html:23f92285efb524a1ae5e96ccf4317fe018fad611ff708bf210500cc6eb14520e: ) PDOExceptioncache.inc169cache_clear_all()
Block was displayed on the node/add/article page.Othernode.test1744NodeBlockFunctionalTest->testRecentNodeBlock()
SQLSTATE[42S02]: Base table or view not found: 1146 Table 'drupaltestbotmysql.simpletest861388' doesn't exist: DELETE FROM {} WHERE (cid = :db_condition_placeholder_0) ; Array ( [:db_condition_placeholder_0] => filtered_html:23f92285efb524a1ae5e96ccf4317fe018fad611ff708bf210500cc6eb14520e: ) PDOExceptioncache.inc169cache_clear_all()
Block was displayed on the node/N.Othernode.test1746NodeBlockFunctionalTest->testRecentNodeBlock()
ExpandPathTaxonomyTermTestCase3222
MessageGroupFilenameLineFunctionStatus
SQLSTATE[42S02]: Base table or view not found: 1146 Table 'drupaltestbotmysql.simpletest511226' doesn't exist: DELETE FROM {} WHERE (cid = :db_condition_placeholder_0) ; Array ( [:db_condition_placeholder_0] => filtered_html:784738f038a351b141ca62c4984fa5383175dadd0d06c10d583a0e13549834c1: ) PDOExceptioncache.inc169cache_clear_all()
Term can be accessed on URL alias.Otherpath.test202PathTaxonomyTermTestCase->testTermAlias()
SQLSTATE[42S02]: Base table or view not found: 1146 Table 'drupaltestbotmysql.simpletest511226' doesn't exist: DELETE FROM {} WHERE (cid = :db_condition_placeholder_0) ; Array ( [:db_condition_placeholder_0] => filtered_html:784738f038a351b141ca62c4984fa5383175dadd0d06c10d583a0e13549834c1: ) PDOExceptioncache.inc169cache_clear_all()
Term can be accessed on changed URL alias.Otherpath.test212PathTaxonomyTermTestCase->testTermAlias()
ExpandProfileTestFields17821
MessageGroupFilenameLineFunctionStatus
SQLSTATE[42S02]: Base table or view not found: 1146 Table 'drupaltestbotmysql.simpletest489993' doesn't exist: DELETE FROM {} WHERE (cid = :db_condition_placeholder_0) ; Array ( [:db_condition_placeholder_0] => filtered_html:543d2067f6fdefc440519e137e83120ea34a95ac50605eb6c74b84ce335b79d5: ) PDOExceptioncache.inc169cache_clear_all()
Found profile field with title nwVLZHqGOtherprofile.test144ProfileTestCase->setProfileField()
Found profile field with value mMDULf2XOtherprofile.test148ProfileTestCase->setProfileField()
ExpandRdfMappingDefinitionTestCase5711
MessageGroupFilenameLineFunctionStatus
SQLSTATE[42S02]: Base table or view not found: 1146 Table 'drupaltestbotmysql.simpletest14400' doesn't exist: DELETE FROM {} WHERE (cid = :db_condition_placeholder_0) ; Array ( [:db_condition_placeholder_0] => filtered_html:c8ac8eff8d19b8b10fd4be7d2edfb4acc5d72ed7bff72c83c49c55c54b02bafa: ) PDOExceptioncache.inc169cache_clear_all()
RDFa markup found on term page.Otherrdf.test408RdfMappingDefinitionTestCase->testTaxonomyTermRdfaAttributes()
ExpandTaxonomyTermTestCase16632
MessageGroupFilenameLineFunctionStatus
SQLSTATE[42S02]: Base table or view not found: 1146 Table 'drupaltestbotmysql.simpletest853705' doesn't exist: DELETE FROM {} WHERE (cid = :db_condition_placeholder_0) ; Array ( [:db_condition_placeholder_0] => filtered_html:278307fc3522f52bc5fb1a8e0aa8555d6129906751f9fffb9791f14b2bb9d96d: ) PDOExceptioncache.inc169cache_clear_all()
The randomly generated term name is present.Othertaxonomy.test647TaxonomyTermTestCase->testTermInterface()
The randomly generated term description is present.Othertaxonomy.test648TaxonomyTermTestCase->testTermInterface()
Term page displayed the term description element.Othertaxonomy.test651TaxonomyTermTestCase->testTermInterface()
SQLSTATE[42S02]: Base table or view not found: 1146 Table 'drupaltestbotmysql.simpletest853705' doesn't exist: DELETE FROM {} WHERE (cid = :db_condition_placeholder_0) ; Array ( [:db_condition_placeholder_0] => filtered_html:e3b0c44298fc1c149afbf4c8996fb92427ae41e4649b934ca495991b7852b855: ) PDOExceptioncache.inc169cache_clear_all()
ExpandTaxonomyThemeTestCase1701
MessageGroupFilenameLineFunctionStatus
SQLSTATE[42S02]: Base table or view not found: 1146 Table 'drupaltestbotmysql.simpletest680867' doesn't exist: DELETE FROM {} WHERE (cid = :db_condition_placeholder_0) ; Array ( [:db_condition_placeholder_0] => filtered_html:2f443fba53e761a01e1bb8a014240c9f43352945672ba211734529fed1985e4a: ) PDOExceptioncache.inc169cache_clear_all()
ExpandTaxonomyTokenReplaceTestCase1801
MessageGroupFilenameLineFunctionStatus
PDOException: SQLSTATE[42S02]: Base table or view not found: 1146 Table 'drupaltestbotmysql.simpletest13028' doesn't exist: DELETE FROM {} WHERE (cid = :db_condition_placeholder_0) ; Array ( [:db_condition_placeholder_0] => filtered_html:4169ba7f14e02b2b47923bdbb966b6649ca0009fc0313a663b6c91bb720c9669: ) in cache_clear_all() (line 169 of /var/lib/drupaltestbot/sites/default/files/checkout/includes/cache.inc).Uncaught exceptiondatabase.inc2095PDOStatement->execute()
ExpandUserSignatureTestCase4413
MessageGroupFilenameLineFunctionStatus
SQLSTATE[42S02]: Base table or view not found: 1146 Table 'drupaltestbotmysql.simpletest831315' doesn't exist: DELETE FROM {} WHERE (cid = :db_condition_placeholder_0) ; Array ( [:db_condition_placeholder_0] => plain_text:5f0d35617a64ca1ae6fca27fc2407d2b4821a4c03d432aaad817206a1add0114: ) PDOExceptioncache.inc169cache_clear_all()
SQLSTATE[42S02]: Base table or view not found: 1146 Table 'drupaltestbotmysql.simpletest831315' doesn't exist: DELETE FROM {} WHERE (cid = :db_condition_placeholder_0) ; Array ( [:db_condition_placeholder_0] => plain_text:5f0d35617a64ca1ae6fca27fc2407d2b4821a4c03d432aaad817206a1add0114: ) PDOExceptioncache.inc169cache_clear_all()
SQLSTATE[42S02]: Base table or view not found: 1146 Table 'drupaltestbotmysql.simpletest831315' doesn't exist: DELETE FROM {} WHERE (cid = :db_condition_placeholder_0) ; Array ( [:db_condition_placeholder_0] => plain_text:5f0d35617a64ca1ae6fca27fc2407d2b4821a4c03d432aaad817206a1add0114: ) PDOExceptioncache.inc169cache_clear_all()
Filtered signature text found.Otheruser.test1757UserSignatureTestCase->testUserSignature()

All

Test namePassFailException
LeafAccessDeniedTestCase7500
LeafActionLoopTestCase2800
LeafActionsConfigurationTestCase3800
LeafAddFeedTestCase2800
LeafAdminMetaTagTestCase300
LeafAggregatorCronTestCase5300
LeafAggregatorRenderingTestCase6800
LeafAJAXCommandsTestCase6800
LeafAJAXElementValidation800
LeafAJAXFormValuesTestCase2800
LeafAJAXFrameworkTestCase1000
LeafAJAXMultiFormTestCase3500
LeafBatchPageTestCase1500
LeafBatchPercentagesUnitTestCase1300
LeafBatchProcessingTestCase15400
LeafBlockAdminThemeTestCase1800
LeafBlockCacheTestCase22800
LeafBlockHTMLIdTestCase1500
LeafBlockTemplateSuggestionsUnitTest200
ExpandBlockTestCase2242920
MessageGroupFilenameLineFunctionStatus
PDOException: SQLSTATE[42S02]: Base table or view not found: 1146 Table 'drupaltestbotmysql.simpletest351086' doesn't exist: DELETE FROM {} WHERE (cid = :db_condition_placeholder_0) ; Array ( [:db_condition_placeholder_0] => filtered_html:ce55f20a0c5da805e3b602f1a1b1d927aba2d85c994bcdaf5e94bd1b3efe6a8c: ) in cache_clear_all() (line 169 of /var/lib/drupaltestbot/sites/default/files/checkout/includes/cache.inc).Uncaught exceptiondatabase.inc2095PDOStatement->execute()
SQLSTATE[42S02]: Base table or view not found: 1146 Table 'drupaltestbotmysql.simpletest152435' doesn't exist: DELETE FROM {} WHERE (cid = :db_condition_placeholder_0) ; Array ( [:db_condition_placeholder_0] => full_html:8657963bdff66ae39e1a6150d2ab8c9b3a9d362560e48b37ddab11f09c4b06ae: ) PDOExceptioncache.inc169cache_clear_all()
SQLSTATE[42S02]: Base table or view not found: 1146 Table 'drupaltestbotmysql.simpletest152435' doesn't exist: DELETE FROM {} WHERE (cid = :db_condition_placeholder_0) ; Array ( [:db_condition_placeholder_0] => full_html:8657963bdff66ae39e1a6150d2ab8c9b3a9d362560e48b37ddab11f09c4b06ae: ) PDOExceptioncache.inc169cache_clear_all()
Custom block successfully being displayed using Full HTML.Otherblock.test133BlockTestCase->testCustomBlockFormat()
SQLSTATE[42S02]: Base table or view not found: 1146 Table 'drupaltestbotmysql.simpletest152435' doesn't exist: DELETE FROM {} WHERE (cid = :db_condition_placeholder_0) ; Array ( [:db_condition_placeholder_0] => full_html:8657963bdff66ae39e1a6150d2ab8c9b3a9d362560e48b37ddab11f09c4b06ae: ) PDOExceptioncache.inc169cache_clear_all()
SQLSTATE[42S02]: Base table or view not found: 1146 Table 'drupaltestbotmysql.simpletest152435' doesn't exist: DELETE FROM {} WHERE (cid = :db_condition_placeholder_0) ; Array ( [:db_condition_placeholder_0] => full_html:8657963bdff66ae39e1a6150d2ab8c9b3a9d362560e48b37ddab11f09c4b06ae: ) PDOExceptioncache.inc169cache_clear_all()
Username field found.Logoutblock.test138BlockTestCase->testCustomBlockFormat()
SQLSTATE[42S02]: Base table or view not found: 1146 Table 'drupaltestbotmysql.simpletest152435' doesn't exist: DELETE FROM {} WHERE (cid = :db_condition_placeholder_0) ; Array ( [:db_condition_placeholder_0] => full_html:8657963bdff66ae39e1a6150d2ab8c9b3a9d362560e48b37ddab11f09c4b06ae: ) PDOExceptioncache.inc169cache_clear_all()
Failed to set field name to kBrzWaYnOtherblock.test138BlockTestCase->testCustomBlockFormat()
Failed to set field pass to tZR2gzTMEtOtherblock.test138BlockTestCase->testCustomBlockFormat()
Found the Log in buttonOtherblock.test138BlockTestCase->testCustomBlockFormat()
Found the requested form fields at userOtherblock.test138BlockTestCase->testCustomBlockFormat()
User kBrzWaYn successfully logged in.User loginblock.test138BlockTestCase->testCustomBlockFormat()
SQLSTATE[42S02]: Base table or view not found: 1146 Table 'drupaltestbotmysql.simpletest152435' doesn't exist: DELETE FROM {} WHERE (cid = :db_condition_placeholder_0) ; Array ( [:db_condition_placeholder_0] => full_html:8657963bdff66ae39e1a6150d2ab8c9b3a9d362560e48b37ddab11f09c4b06ae: ) PDOExceptioncache.inc169cache_clear_all()
Body field contains denied messageOtherblock.test140BlockTestCase->testCustomBlockFormat()
SQLSTATE[42S02]: Base table or view not found: 1146 Table 'drupaltestbotmysql.simpletest152435' doesn't exist: DELETE FROM {} WHERE (cid = :db_condition_placeholder_0) ; Array ( [:db_condition_placeholder_0] => full_html:8657963bdff66ae39e1a6150d2ab8c9b3a9d362560e48b37ddab11f09c4b06ae: ) PDOExceptioncache.inc169cache_clear_all()
Found the Save block buttonOtherblock.test141BlockTestCase->testCustomBlockFormat()
Found the requested form fields at admin/structure/block/manage/block/1/configureOtherblock.test141BlockTestCase->testCustomBlockFormat()
SQLSTATE[42S02]: Base table or view not found: 1146 Table 'drupaltestbotmysql.simpletest152435' doesn't exist: DELETE FROM {} WHERE (cid = :db_condition_placeholder_0) ; Array ( [:db_condition_placeholder_0] => full_html:8657963bdff66ae39e1a6150d2ab8c9b3a9d362560e48b37ddab11f09c4b06ae: ) PDOExceptioncache.inc169cache_clear_all()
Custom block successfully being displayed using Full HTML.Otherblock.test146BlockTestCase->testCustomBlockFormat()
SQLSTATE[42S02]: Base table or view not found: 1146 Table 'drupaltestbotmysql.simpletest889090' doesn't exist: DELETE FROM {} WHERE (cid = :db_condition_placeholder_0) ; Array ( [:db_condition_placeholder_0] => filtered_html:20898354c9b452ad46db716766bf7e529ca86ad446d13414307358341be88844: ) PDOExceptioncache.inc169cache_clear_all()
SQLSTATE[42S02]: Base table or view not found: 1146 Table 'drupaltestbotmysql.simpletest889090' doesn't exist: DELETE FROM {} WHERE (cid = :db_condition_placeholder_0) ; Array ( [:db_condition_placeholder_0] => filtered_html:20898354c9b452ad46db716766bf7e529ca86ad446d13414307358341be88844: ) PDOExceptioncache.inc169cache_clear_all()
Block successfully being displayed on the page.Otherblock.test306BlockTestCase->moveBlockToRegion()
Custom block found in sidebar_first region.Otherblock.test313BlockTestCase->moveBlockToRegion()
SQLSTATE[42S02]: Base table or view not found: 1146 Table 'drupaltestbotmysql.simpletest889090' doesn't exist: DELETE FROM {} WHERE (cid = :db_condition_placeholder_0) ; Array ( [:db_condition_placeholder_0] => filtered_html:20898354c9b452ad46db716766bf7e529ca86ad446d13414307358341be88844: ) PDOExceptioncache.inc169cache_clear_all()
Block was displayed on the front page.Otherblock.test181BlockTestCase->testBlockVisibility()
SQLSTATE[42S02]: Base table or view not found: 1146 Table 'drupaltestbotmysql.simpletest704022' doesn't exist: DELETE FROM {} WHERE (cid = :db_condition_placeholder_0) ; Array ( [:db_condition_placeholder_0] => filtered_html:5aafb762e72c9fd247e713cc3f76361a1930c94f5835293bb14234c4ccec7337: ) PDOExceptioncache.inc169cache_clear_all()
SQLSTATE[42S02]: Base table or view not found: 1146 Table 'drupaltestbotmysql.simpletest704022' doesn't exist: DELETE FROM {} WHERE (cid = :db_condition_placeholder_0) ; Array ( [:db_condition_placeholder_0] => filtered_html:5aafb762e72c9fd247e713cc3f76361a1930c94f5835293bb14234c4ccec7337: ) PDOExceptioncache.inc169cache_clear_all()
Block successfully being displayed on the page.Otherblock.test306BlockTestCase->moveBlockToRegion()
Custom block found in sidebar_first region.Otherblock.test313BlockTestCase->moveBlockToRegion()
SQLSTATE[42S02]: Base table or view not found: 1146 Table 'drupaltestbotmysql.simpletest704022' doesn't exist: DELETE FROM {} WHERE (cid = :db_condition_placeholder_0) ; Array ( [:db_condition_placeholder_0] => filtered_html:5aafb762e72c9fd247e713cc3f76361a1930c94f5835293bb14234c4ccec7337: ) PDOExceptioncache.inc169cache_clear_all()
Failed to set field custom to 1Otherblock.test222BlockTestCase->testBlockVisibilityPerUser()
Found the Save block buttonOtherblock.test222BlockTestCase->testBlockVisibilityPerUser()
Found the requested form fields at admin/structure/block/manage/block/1/configureOtherblock.test222BlockTestCase->testBlockVisibilityPerUser()
SQLSTATE[42S02]: Base table or view not found: 1146 Table 'drupaltestbotmysql.simpletest704022' doesn't exist: DELETE FROM {} WHERE (cid = :db_condition_placeholder_0) ; Array ( [:db_condition_placeholder_0] => filtered_html:5aafb762e72c9fd247e713cc3f76361a1930c94f5835293bb14234c4ccec7337: ) PDOExceptioncache.inc169cache_clear_all()
Failed to set field block[block][1] to Otherblock.test227BlockTestCase->testBlockVisibilityPerUser()
Found the Save buttonOtherblock.test227BlockTestCase->testBlockVisibilityPerUser()
Found the requested form fields at user/2/editOtherblock.test227BlockTestCase->testBlockVisibilityPerUser()
SQLSTATE[42S02]: Base table or view not found: 1146 Table 'drupaltestbotmysql.simpletest704022' doesn't exist: DELETE FROM {} WHERE (cid = :db_condition_placeholder_0) ; Array ( [:db_condition_placeholder_0] => filtered_html:5aafb762e72c9fd247e713cc3f76361a1930c94f5835293bb14234c4ccec7337: ) PDOExceptioncache.inc169cache_clear_all()
SQLSTATE[42S02]: Base table or view not found: 1146 Table 'drupaltestbotmysql.simpletest704022' doesn't exist: DELETE FROM {} WHERE (cid = :db_condition_placeholder_0) ; Array ( [:db_condition_placeholder_0] => filtered_html:5aafb762e72c9fd247e713cc3f76361a1930c94f5835293bb14234c4ccec7337: ) PDOExceptioncache.inc169cache_clear_all()
Failed to set field custom to 2Otherblock.test235BlockTestCase->testBlockVisibilityPerUser()
Found the Save block buttonOtherblock.test235BlockTestCase->testBlockVisibilityPerUser()
Found the requested form fields at admin/structure/block/manage/block/1/configureOtherblock.test235BlockTestCase->testBlockVisibilityPerUser()
SQLSTATE[42S02]: Base table or view not found: 1146 Table 'drupaltestbotmysql.simpletest704022' doesn't exist: DELETE FROM {} WHERE (cid = :db_condition_placeholder_0) ; Array ( [:db_condition_placeholder_0] => filtered_html:5aafb762e72c9fd247e713cc3f76361a1930c94f5835293bb14234c4ccec7337: ) PDOExceptioncache.inc169cache_clear_all()
Failed to set field block[block][1] to 1Otherblock.test240BlockTestCase->testBlockVisibilityPerUser()
Found the Save buttonOtherblock.test240BlockTestCase->testBlockVisibilityPerUser()
Found the requested form fields at user/2/editOtherblock.test240BlockTestCase->testBlockVisibilityPerUser()
SQLSTATE[42S02]: Base table or view not found: 1146 Table 'drupaltestbotmysql.simpletest704022' doesn't exist: DELETE FROM {} WHERE (cid = :db_condition_placeholder_0) ; Array ( [:db_condition_placeholder_0] => filtered_html:5aafb762e72c9fd247e713cc3f76361a1930c94f5835293bb14234c4ccec7337: ) PDOExceptioncache.inc169cache_clear_all()
Block was displayed according to per user block visibility setting.Otherblock.test243BlockTestCase->testBlockVisibilityPerUser()
LeafBlogTestCase24100
LeafBookTestCase34900
LeafBootstrapGetFilenameTestCase400
LeafBootstrapIPAddressTestCase1100
LeafBootstrapMiscTestCase100
LeafBootstrapOverrideServerVariablesTestCase600
LeafBootstrapPageCacheTestCase7800
LeafBootstrapResettableStaticTestCase500
LeafBootstrapTimerTestCase500
LeafBootstrapVariableTestCase700
LeafCacheClearCase1300
LeafCacheGetMultipleUnitTest700
LeafCacheIsEmptyCase500
LeafCacheSavingCase500
LeafCascadingStylesheetsTestCase2500
LeafCascadingStylesheetsUnitTest1200
LeafCategorizeFeedItemTestCase5300
LeafCategorizeFeedTestCase1900
LeafColorTestCase6700
LeafCommentActionsTestCase2800
LeafCommentAnonymous16500
LeafCommentApprovalTest15400
LeafCommentBlockFunctionalTest11500
LeafCommentContentRebuild3200
LeafCommentFieldsTest8300
ExpandCommentInterfaceTest139500
MessageGroupFilenameLineFunctionStatus
Changed environment:array ( 'authenticated' => false, 'comment count' => false, 'form' => 'below', 'user_register' => 1, 'contact' => 'optional', 'comments' => 'open', 'access comments' => 0, 'post comments' => 0, 'skip comment approval' => 1, 'edit own comments' => 0, )Debugcomment.test672CommentInterfaceTest->setEnvironment()
Changed environment:array ( 'authenticated' => true, 'comment count' => false, 'form' => 'below', 'user_register' => 1, 'contact' => 'optional', 'comments' => 'open', 'access comments' => 0, 'post comments' => 0, 'skip comment approval' => 1, 'edit own comments' => 0, )Debugcomment.test672CommentInterfaceTest->setEnvironment()
Changed environment:array ( 'authenticated' => false, 'comment count' => true, 'form' => 'below', 'user_register' => 1, 'contact' => 'optional', 'comments' => 'open', 'access comments' => 0, 'post comments' => 0, 'skip comment approval' => 1, 'edit own comments' => 0, )Debugcomment.test672CommentInterfaceTest->setEnvironment()
Changed environment:array ( 'authenticated' => true, 'comment count' => true, 'form' => 'below', 'user_register' => 1, 'contact' => 'optional', 'comments' => 'open', 'access comments' => 0, 'post comments' => 0, 'skip comment approval' => 1, 'edit own comments' => 0, )Debugcomment.test672CommentInterfaceTest->setEnvironment()
Changed environment:array ( 'authenticated' => false, 'comment count' => false, 'form' => 'below', 'user_register' => 1, 'contact' => 'optional', 'comments' => 'open', 'access comments' => 1, 'post comments' => 0, 'skip comment approval' => 1, 'edit own comments' => 0, )Debugcomment.test672CommentInterfaceTest->setEnvironment()
Changed environment:array ( 'authenticated' => true, 'comment count' => false, 'form' => 'below', 'user_register' => 1, 'contact' => 'optional', 'comments' => 'open', 'access comments' => 1, 'post comments' => 0, 'skip comment approval' => 1, 'edit own comments' => 0, )Debugcomment.test672CommentInterfaceTest->setEnvironment()
Changed environment:array ( 'authenticated' => false, 'comment count' => true, 'form' => 'below', 'user_register' => 1, 'contact' => 'optional', 'comments' => 'open', 'access comments' => 1, 'post comments' => 0, 'skip comment approval' => 1, 'edit own comments' => 0, )Debugcomment.test672CommentInterfaceTest->setEnvironment()
Changed environment:array ( 'authenticated' => true, 'comment count' => true, 'form' => 'below', 'user_register' => 1, 'contact' => 'optional', 'comments' => 'open', 'access comments' => 1, 'post comments' => 0, 'skip comment approval' => 1, 'edit own comments' => 0, )Debugcomment.test672CommentInterfaceTest->setEnvironment()
Changed environment:array ( 'authenticated' => false, 'comment count' => false, 'form' => 'below', 'user_register' => 1, 'contact' => 'optional', 'comments' => 'open', 'access comments' => 0, 'post comments' => 1, 'skip comment approval' => 1, 'edit own comments' => 0, )Debugcomment.test672CommentInterfaceTest->setEnvironment()
Changed environment:array ( 'authenticated' => true, 'comment count' => false, 'form' => 'below', 'user_register' => 1, 'contact' => 'optional', 'comments' => 'open', 'access comments' => 0, 'post comments' => 1, 'skip comment approval' => 1, 'edit own comments' => 0, )Debugcomment.test672CommentInterfaceTest->setEnvironment()
Changed environment:array ( 'authenticated' => false, 'comment count' => true, 'form' => 'below', 'user_register' => 1, 'contact' => 'optional', 'comments' => 'open', 'access comments' => 0, 'post comments' => 1, 'skip comment approval' => 1, 'edit own comments' => 0, )Debugcomment.test672CommentInterfaceTest->setEnvironment()
Changed environment:array ( 'authenticated' => true, 'comment count' => true, 'form' => 'below', 'user_register' => 1, 'contact' => 'optional', 'comments' => 'open', 'access comments' => 0, 'post comments' => 1, 'skip comment approval' => 1, 'edit own comments' => 0, )Debugcomment.test672CommentInterfaceTest->setEnvironment()
Changed environment:array ( 'authenticated' => false, 'comment count' => false, 'form' => 'below', 'user_register' => 1, 'contact' => 'optional', 'comments' => 'open', 'access comments' => 1, 'post comments' => 1, 'skip comment approval' => 1, 'edit own comments' => 0, )Debugcomment.test672CommentInterfaceTest->setEnvironment()
Changed environment:array ( 'authenticated' => true, 'comment count' => false, 'form' => 'below', 'user_register' => 1, 'contact' => 'optional', 'comments' => 'open', 'access comments' => 1, 'post comments' => 1, 'skip comment approval' => 1, 'edit own comments' => 0, )Debugcomment.test672CommentInterfaceTest->setEnvironment()
Changed environment:array ( 'authenticated' => false, 'comment count' => true, 'form' => 'below', 'user_register' => 1, 'contact' => 'optional', 'comments' => 'open', 'access comments' => 1, 'post comments' => 1, 'skip comment approval' => 1, 'edit own comments' => 0, )Debugcomment.test672CommentInterfaceTest->setEnvironment()
Changed environment:array ( 'authenticated' => true, 'comment count' => true, 'form' => 'below', 'user_register' => 1, 'contact' => 'optional', 'comments' => 'open', 'access comments' => 1, 'post comments' => 1, 'skip comment approval' => 1, 'edit own comments' => 0, )Debugcomment.test672CommentInterfaceTest->setEnvironment()
Changed environment:array ( 'authenticated' => false, 'comment count' => false, 'form' => 'separate page', 'user_register' => 1, 'contact' => 'optional', 'comments' => 'open', 'access comments' => 0, 'post comments' => 0, 'skip comment approval' => 1, 'edit own comments' => 0, )Debugcomment.test672CommentInterfaceTest->setEnvironment()
Changed environment:array ( 'authenticated' => true, 'comment count' => false, 'form' => 'separate page', 'user_register' => 1, 'contact' => 'optional', 'comments' => 'open', 'access comments' => 0, 'post comments' => 0, 'skip comment approval' => 1, 'edit own comments' => 0, )Debugcomment.test672CommentInterfaceTest->setEnvironment()
Changed environment:array ( 'authenticated' => false, 'comment count' => true, 'form' => 'separate page', 'user_register' => 1, 'contact' => 'optional', 'comments' => 'open', 'access comments' => 0, 'post comments' => 0, 'skip comment approval' => 1, 'edit own comments' => 0, )Debugcomment.test672CommentInterfaceTest->setEnvironment()
Changed environment:array ( 'authenticated' => true, 'comment count' => true, 'form' => 'separate page', 'user_register' => 1, 'contact' => 'optional', 'comments' => 'open', 'access comments' => 0, 'post comments' => 0, 'skip comment approval' => 1, 'edit own comments' => 0, )Debugcomment.test672CommentInterfaceTest->setEnvironment()
Changed environment:array ( 'authenticated' => false, 'comment count' => false, 'form' => 'separate page', 'user_register' => 1, 'contact' => 'optional', 'comments' => 'open', 'access comments' => 1, 'post comments' => 0, 'skip comment approval' => 1, 'edit own comments' => 0, )Debugcomment.test672CommentInterfaceTest->setEnvironment()
Changed environment:array ( 'authenticated' => true, 'comment count' => false, 'form' => 'separate page', 'user_register' => 1, 'contact' => 'optional', 'comments' => 'open', 'access comments' => 1, 'post comments' => 0, 'skip comment approval' => 1, 'edit own comments' => 0, )Debugcomment.test672CommentInterfaceTest->setEnvironment()
Changed environment:array ( 'authenticated' => false, 'comment count' => true, 'form' => 'separate page', 'user_register' => 1, 'contact' => 'optional', 'comments' => 'open', 'access comments' => 1, 'post comments' => 0, 'skip comment approval' => 1, 'edit own comments' => 0, )Debugcomment.test672CommentInterfaceTest->setEnvironment()
Changed environment:array ( 'authenticated' => true, 'comment count' => true, 'form' => 'separate page', 'user_register' => 1, 'contact' => 'optional', 'comments' => 'open', 'access comments' => 1, 'post comments' => 0, 'skip comment approval' => 1, 'edit own comments' => 0, )Debugcomment.test672CommentInterfaceTest->setEnvironment()
Changed environment:array ( 'authenticated' => false, 'comment count' => false, 'form' => 'separate page', 'user_register' => 1, 'contact' => 'optional', 'comments' => 'open', 'access comments' => 0, 'post comments' => 1, 'skip comment approval' => 1, 'edit own comments' => 0, )Debugcomment.test672CommentInterfaceTest->setEnvironment()
Changed environment:array ( 'authenticated' => true, 'comment count' => false, 'form' => 'separate page', 'user_register' => 1, 'contact' => 'optional', 'comments' => 'open', 'access comments' => 0, 'post comments' => 1, 'skip comment approval' => 1, 'edit own comments' => 0, )Debugcomment.test672CommentInterfaceTest->setEnvironment()
Changed environment:array ( 'authenticated' => false, 'comment count' => true, 'form' => 'separate page', 'user_register' => 1, 'contact' => 'optional', 'comments' => 'open', 'access comments' => 0, 'post comments' => 1, 'skip comment approval' => 1, 'edit own comments' => 0, )Debugcomment.test672CommentInterfaceTest->setEnvironment()
Changed environment:array ( 'authenticated' => true, 'comment count' => true, 'form' => 'separate page', 'user_register' => 1, 'contact' => 'optional', 'comments' => 'open', 'access comments' => 0, 'post comments' => 1, 'skip comment approval' => 1, 'edit own comments' => 0, )Debugcomment.test672CommentInterfaceTest->setEnvironment()
Changed environment:array ( 'authenticated' => false, 'comment count' => false, 'form' => 'separate page', 'user_register' => 1, 'contact' => 'optional', 'comments' => 'open', 'access comments' => 1, 'post comments' => 1, 'skip comment approval' => 1, 'edit own comments' => 0, )Debugcomment.test672CommentInterfaceTest->setEnvironment()
Changed environment:array ( 'authenticated' => true, 'comment count' => false, 'form' => 'separate page', 'user_register' => 1, 'contact' => 'optional', 'comments' => 'open', 'access comments' => 1, 'post comments' => 1, 'skip comment approval' => 1, 'edit own comments' => 0, )Debugcomment.test672CommentInterfaceTest->setEnvironment()
Changed environment:array ( 'authenticated' => false, 'comment count' => true, 'form' => 'separate page', 'user_register' => 1, 'contact' => 'optional', 'comments' => 'open', 'access comments' => 1, 'post comments' => 1, 'skip comment approval' => 1, 'edit own comments' => 0, )Debugcomment.test672CommentInterfaceTest->setEnvironment()
Changed environment:array ( 'authenticated' => true, 'comment count' => true, 'form' => 'separate page', 'user_register' => 1, 'contact' => 'optional', 'comments' => 'open', 'access comments' => 1, 'post comments' => 1, 'skip comment approval' => 1, 'edit own comments' => 0, )Debugcomment.test672CommentInterfaceTest->setEnvironment()
Changed environment:array ( 'authenticated' => false, 'comment count' => false, 'form' => 'below', 'user_register' => 0, 'contact' => 'optional', 'comments' => 'open', 'access comments' => 0, 'post comments' => 0, 'skip comment approval' => 1, 'edit own comments' => 0, )Debugcomment.test672CommentInterfaceTest->setEnvironment()
Changed environment:array ( 'authenticated' => true, 'comment count' => false, 'form' => 'below', 'user_register' => 0, 'contact' => 'optional', 'comments' => 'open', 'access comments' => 0, 'post comments' => 0, 'skip comment approval' => 1, 'edit own comments' => 0, )Debugcomment.test672CommentInterfaceTest->setEnvironment()
Changed environment:array ( 'authenticated' => false, 'comment count' => true, 'form' => 'below', 'user_register' => 0, 'contact' => 'optional', 'comments' => 'open', 'access comments' => 0, 'post comments' => 0, 'skip comment approval' => 1, 'edit own comments' => 0, )Debugcomment.test672CommentInterfaceTest->setEnvironment()
Changed environment:array ( 'authenticated' => true, 'comment count' => true, 'form' => 'below', 'user_register' => 0, 'contact' => 'optional', 'comments' => 'open', 'access comments' => 0, 'post comments' => 0, 'skip comment approval' => 1, 'edit own comments' => 0, )Debugcomment.test672CommentInterfaceTest->setEnvironment()
Changed environment:array ( 'authenticated' => false, 'comment count' => false, 'form' => 'below', 'user_register' => 0, 'contact' => 'optional', 'comments' => 'open', 'access comments' => 1, 'post comments' => 0, 'skip comment approval' => 1, 'edit own comments' => 0, )Debugcomment.test672CommentInterfaceTest->setEnvironment()
Changed environment:array ( 'authenticated' => true, 'comment count' => false, 'form' => 'below', 'user_register' => 0, 'contact' => 'optional', 'comments' => 'open', 'access comments' => 1, 'post comments' => 0, 'skip comment approval' => 1, 'edit own comments' => 0, )Debugcomment.test672CommentInterfaceTest->setEnvironment()
Changed environment:array ( 'authenticated' => false, 'comment count' => true, 'form' => 'below', 'user_register' => 0, 'contact' => 'optional', 'comments' => 'open', 'access comments' => 1, 'post comments' => 0, 'skip comment approval' => 1, 'edit own comments' => 0, )Debugcomment.test672CommentInterfaceTest->setEnvironment()
Changed environment:array ( 'authenticated' => true, 'comment count' => true, 'form' => 'below', 'user_register' => 0, 'contact' => 'optional', 'comments' => 'open', 'access comments' => 1, 'post comments' => 0, 'skip comment approval' => 1, 'edit own comments' => 0, )Debugcomment.test672CommentInterfaceTest->setEnvironment()
Changed environment:array ( 'authenticated' => false, 'comment count' => false, 'form' => 'below', 'user_register' => 0, 'contact' => 'optional', 'comments' => 'open', 'access comments' => 0, 'post comments' => 1, 'skip comment approval' => 1, 'edit own comments' => 0, )Debugcomment.test672CommentInterfaceTest->setEnvironment()
Changed environment:array ( 'authenticated' => true, 'comment count' => false, 'form' => 'below', 'user_register' => 0, 'contact' => 'optional', 'comments' => 'open', 'access comments' => 0, 'post comments' => 1, 'skip comment approval' => 1, 'edit own comments' => 0, )Debugcomment.test672CommentInterfaceTest->setEnvironment()
Changed environment:array ( 'authenticated' => false, 'comment count' => true, 'form' => 'below', 'user_register' => 0, 'contact' => 'optional', 'comments' => 'open', 'access comments' => 0, 'post comments' => 1, 'skip comment approval' => 1, 'edit own comments' => 0, )Debugcomment.test672CommentInterfaceTest->setEnvironment()
Changed environment:array ( 'authenticated' => true, 'comment count' => true, 'form' => 'below', 'user_register' => 0, 'contact' => 'optional', 'comments' => 'open', 'access comments' => 0, 'post comments' => 1, 'skip comment approval' => 1, 'edit own comments' => 0, )Debugcomment.test672CommentInterfaceTest->setEnvironment()
Changed environment:array ( 'authenticated' => false, 'comment count' => false, 'form' => 'below', 'user_register' => 0, 'contact' => 'optional', 'comments' => 'open', 'access comments' => 1, 'post comments' => 1, 'skip comment approval' => 1, 'edit own comments' => 0, )Debugcomment.test672CommentInterfaceTest->setEnvironment()
Changed environment:array ( 'authenticated' => true, 'comment count' => false, 'form' => 'below', 'user_register' => 0, 'contact' => 'optional', 'comments' => 'open', 'access comments' => 1, 'post comments' => 1, 'skip comment approval' => 1, 'edit own comments' => 0, )Debugcomment.test672CommentInterfaceTest->setEnvironment()
Changed environment:array ( 'authenticated' => false, 'comment count' => true, 'form' => 'below', 'user_register' => 0, 'contact' => 'optional', 'comments' => 'open', 'access comments' => 1, 'post comments' => 1, 'skip comment approval' => 1, 'edit own comments' => 0, )Debugcomment.test672CommentInterfaceTest->setEnvironment()
Changed environment:array ( 'authenticated' => true, 'comment count' => true, 'form' => 'below', 'user_register' => 0, 'contact' => 'optional', 'comments' => 'open', 'access comments' => 1, 'post comments' => 1, 'skip comment approval' => 1, 'edit own comments' => 0, )Debugcomment.test672CommentInterfaceTest->setEnvironment()
Changed environment:array ( 'authenticated' => false, 'comment count' => false, 'form' => 'separate page', 'user_register' => 0, 'contact' => 'optional', 'comments' => 'open', 'access comments' => 0, 'post comments' => 0, 'skip comment approval' => 1, 'edit own comments' => 0, )Debugcomment.test672CommentInterfaceTest->setEnvironment()
Changed environment:array ( 'authenticated' => true, 'comment count' => false, 'form' => 'separate page', 'user_register' => 0, 'contact' => 'optional', 'comments' => 'open', 'access comments' => 0, 'post comments' => 0, 'skip comment approval' => 1, 'edit own comments' => 0, )Debugcomment.test672CommentInterfaceTest->setEnvironment()
Changed environment:array ( 'authenticated' => false, 'comment count' => true, 'form' => 'separate page', 'user_register' => 0, 'contact' => 'optional', 'comments' => 'open', 'access comments' => 0, 'post comments' => 0, 'skip comment approval' => 1, 'edit own comments' => 0, )Debugcomment.test672CommentInterfaceTest->setEnvironment()
Changed environment:array ( 'authenticated' => true, 'comment count' => true, 'form' => 'separate page', 'user_register' => 0, 'contact' => 'optional', 'comments' => 'open', 'access comments' => 0, 'post comments' => 0, 'skip comment approval' => 1, 'edit own comments' => 0, )Debugcomment.test672CommentInterfaceTest->setEnvironment()
Changed environment:array ( 'authenticated' => false, 'comment count' => false, 'form' => 'separate page', 'user_register' => 0, 'contact' => 'optional', 'comments' => 'open', 'access comments' => 1, 'post comments' => 0, 'skip comment approval' => 1, 'edit own comments' => 0, )Debugcomment.test672CommentInterfaceTest->setEnvironment()
Changed environment:array ( 'authenticated' => true, 'comment count' => false, 'form' => 'separate page', 'user_register' => 0, 'contact' => 'optional', 'comments' => 'open', 'access comments' => 1, 'post comments' => 0, 'skip comment approval' => 1, 'edit own comments' => 0, )Debugcomment.test672CommentInterfaceTest->setEnvironment()
Changed environment:array ( 'authenticated' => false, 'comment count' => true, 'form' => 'separate page', 'user_register' => 0, 'contact' => 'optional', 'comments' => 'open', 'access comments' => 1, 'post comments' => 0, 'skip comment approval' => 1, 'edit own comments' => 0, )Debugcomment.test672CommentInterfaceTest->setEnvironment()
Changed environment:array ( 'authenticated' => true, 'comment count' => true, 'form' => 'separate page', 'user_register' => 0, 'contact' => 'optional', 'comments' => 'open', 'access comments' => 1, 'post comments' => 0, 'skip comment approval' => 1, 'edit own comments' => 0, )Debugcomment.test672CommentInterfaceTest->setEnvironment()
Changed environment:array ( 'authenticated' => false, 'comment count' => false, 'form' => 'separate page', 'user_register' => 0, 'contact' => 'optional', 'comments' => 'open', 'access comments' => 0, 'post comments' => 1, 'skip comment approval' => 1, 'edit own comments' => 0, )Debugcomment.test672CommentInterfaceTest->setEnvironment()
Changed environment:array ( 'authenticated' => true, 'comment count' => false, 'form' => 'separate page', 'user_register' => 0, 'contact' => 'optional', 'comments' => 'open', 'access comments' => 0, 'post comments' => 1, 'skip comment approval' => 1, 'edit own comments' => 0, )Debugcomment.test672CommentInterfaceTest->setEnvironment()
Changed environment:array ( 'authenticated' => false, 'comment count' => true, 'form' => 'separate page', 'user_register' => 0, 'contact' => 'optional', 'comments' => 'open', 'access comments' => 0, 'post comments' => 1, 'skip comment approval' => 1, 'edit own comments' => 0, )Debugcomment.test672CommentInterfaceTest->setEnvironment()
Changed environment:array ( 'authenticated' => true, 'comment count' => true, 'form' => 'separate page', 'user_register' => 0, 'contact' => 'optional', 'comments' => 'open', 'access comments' => 0, 'post comments' => 1, 'skip comment approval' => 1, 'edit own comments' => 0, )Debugcomment.test672CommentInterfaceTest->setEnvironment()
Changed environment:array ( 'authenticated' => false, 'comment count' => false, 'form' => 'separate page', 'user_register' => 0, 'contact' => 'optional', 'comments' => 'open', 'access comments' => 1, 'post comments' => 1, 'skip comment approval' => 1, 'edit own comments' => 0, )Debugcomment.test672CommentInterfaceTest->setEnvironment()
Changed environment:array ( 'authenticated' => true, 'comment count' => false, 'form' => 'separate page', 'user_register' => 0, 'contact' => 'optional', 'comments' => 'open', 'access comments' => 1, 'post comments' => 1, 'skip comment approval' => 1, 'edit own comments' => 0, )Debugcomment.test672CommentInterfaceTest->setEnvironment()
Changed environment:array ( 'authenticated' => false, 'comment count' => true, 'form' => 'separate page', 'user_register' => 0, 'contact' => 'optional', 'comments' => 'open', 'access comments' => 1, 'post comments' => 1, 'skip comment approval' => 1, 'edit own comments' => 0, )Debugcomment.test672CommentInterfaceTest->setEnvironment()
Changed environment:array ( 'authenticated' => true, 'comment count' => true, 'form' => 'separate page', 'user_register' => 0, 'contact' => 'optional', 'comments' => 'open', 'access comments' => 1, 'post comments' => 1, 'skip comment approval' => 1, 'edit own comments' => 0, )Debugcomment.test672CommentInterfaceTest->setEnvironment()
LeafCommentNodeAccessTest5300
LeafCommentPagerTest20800
LeafCommentPreviewTest9100
LeafCommentRSSUnitTest2400
LeafCommentTokenReplaceTestCase6400
LeafCommonSizeTestCase3500
LeafCommonURLUnitTest5600
LeafCommonXssUnitTest900
LeafContactPersonalTestCase14200
LeafContactSitewideTestCase23700
LeafCronRunTestCase4500
ExpandDashboardBlocksTestCase10543
MessageGroupFilenameLineFunctionStatus
SQLSTATE[42S02]: Base table or view not found: 1146 Table 'drupaltestbotmysql.simpletest573210' doesn't exist: DELETE FROM {} WHERE (cid = :db_condition_placeholder_0) ; Array ( [:db_condition_placeholder_0] => filtered_html:54996c92973f3cb5ac3b56728543308f2ada54d9c1af8b3139a45d35fd21a707: ) PDOExceptioncache.inc169cache_clear_all()
Admin has access to the dashboard.Browserdashboard.test49DashboardBlocksTestCase->testDashboardAccess()
Admin has access to a dashboard block.Otherdashboard.test50DashboardBlocksTestCase->testDashboardAccess()
SQLSTATE[42S02]: Base table or view not found: 1146 Table 'drupaltestbotmysql.simpletest738562' doesn't exist: DELETE FROM {} WHERE (cid = :db_condition_placeholder_0) ; Array ( [:db_condition_placeholder_0] => filtered_html:dadf7e3dbfa74769930f5820e2592d25a3f6522a17f7e3993b72557b37625d7a: ) PDOExceptioncache.inc169cache_clear_all()
Block appears on the dashboard.Otherdashboard.test95DashboardBlocksTestCase->testDisableEnable()
SQLSTATE[42S02]: Base table or view not found: 1146 Table 'drupaltestbotmysql.simpletest738562' doesn't exist: DELETE FROM {} WHERE (cid = :db_condition_placeholder_0) ; Array ( [:db_condition_placeholder_0] => filtered_html:dadf7e3dbfa74769930f5820e2592d25a3f6522a17f7e3993b72557b37625d7a: ) PDOExceptioncache.inc169cache_clear_all()
Block still appears on the dashboard.Otherdashboard.test112DashboardBlocksTestCase->testDisableEnable()
LeafDatabaseAlterTestCase5500
LeafDatabaseBasicSyntaxTestCase2600
LeafDatabaseConnectionTestCase3400
LeafDatabaseDeleteTruncateTestCase2000
LeafDatabaseEmptyStatementTestCase400
LeafDatabaseFetch2TestCase2600
LeafDatabaseFetchTestCase3300
LeafDatabaseInsertDefaultsTestCase1900
LeafDatabaseInsertLOBTestCase1300
LeafDatabaseInsertTestCase4500
LeafDatabaseInvalidDataTestCase700
LeafDatabaseLoggingTestCase3800
LeafDatabaseMergeTestCase7500
LeafDatabaseNextIdCase200
LeafDatabaseQueryTestCase600
LeafDatabaseRangeQueryTestCase200
LeafDatabaseRegressionTestCase2700
LeafDatabaseSelectComplexTestCase12300
LeafDatabaseSelectComplexTestCase21400
LeafDatabaseSelectOrderedTestCase2600
LeafDatabaseSelectPagerDefaultTestCase4200
LeafDatabaseSelectSubqueryTestCase3600
LeafDatabaseSelectTableSortDefaultTestCase4100
LeafDatabaseSelectTestCase12400
LeafDatabaseSerializeQueryTestCase600
LeafDatabaseTaggingTestCase2800
LeafDatabaseTemporaryQueryTestCase500
LeafDatabaseTransactionTestCase3100
LeafDatabaseUpdateComplexTestCase5200
LeafDatabaseUpdateLOBTestCase1300
LeafDatabaseUpdateTestCase4900
LeafDateTimeFunctionalTest9600
LeafDBLogTestCase44500
LeafDrupalAddFeedTestCase600
LeafDrupalAlterTestCase500
LeafDrupalAttributesUnitTest600
LeafDrupalDataApiTest3200
LeafDrupalErrorCollectionUnitTest1500
LeafDrupalErrorHandlerUnitTest2800
LeafDrupalGetRdfNamespacesTestCase600
LeafDrupalGotoTest1800
LeafDrupalHTMLIdentifierTestCase1000
LeafDrupalHTTPRequestTestCase2700
LeafDrupalJSONTest1400
LeafDrupalMatchPathTestCase4100
LeafDrupalRenderTestCase4000
LeafDrupalSetContentTestCase4000
LeafDrupalSystemListingTestCase600
LeafDrupalTagsHandlingTestCase800
LeafEnableDisableTestCase5600
LeafEntityCrudHookTestCase7200
LeafEntityFieldQueryTestCase10000
LeafEntityPropertiesTestCase300
LeafFeedParserTestCase4100
LeafFieldAttachOtherTestCase4800
LeafFieldAttachStorageTestCase8300
LeafFieldBulkDeleteTestCase3900
LeafFieldCrudTestCase5900
LeafFieldDisplayAPITestCase4400
LeafFieldFormTestCase23700
LeafFieldInfoTestCase7900
LeafFieldInstanceCrudTestCase3300
LeafFieldSqlStorageTestCase8100
LeafFieldTranslationsTestCase6000
LeafFieldUIManageDisplayTestCase8100
LeafFieldUIManageFieldsTestCase19800
LeafFileCopyTest12400
LeafFileDeleteTest1800
LeafFileDirectoryTest2000
LeafFileDownloadTest3500
LeafFileFieldDisplayTestCase2100
LeafFileFieldPathTestCase2600
LeafFileFieldRevisionTestCase6800
LeafFileFieldValidateTestCase11900
LeafFileFieldWidgetTestCase24100
LeafFileLoadTest2900
LeafFileManagedFileElementTestCase44200
LeafFileMimeTypeTest3800
LeafFileMoveTest10500
LeafFileNameMungingTest500
LeafFileSaveDataTest8800
LeafFileSaveTest1400
LeafFileSaveUploadTest26300
LeafFileScanDirectoryTest2300
LeafFileSpaceUsedTest1100
LeafFileTokenReplaceTestCase7200
LeafFileTranferTest200
LeafFileUnmanagedCopyTest3100
LeafFileUnmanagedDeleteRecursiveTest1700
LeafFileUnmanagedDeleteTest800
LeafFileUnmanagedMoveTest2200
LeafFileUnmanagedSaveDataTest700
LeafFileURLRewritingTest2100
LeafFileUsageTest2800
LeafFileValidateTest1100
LeafFileValidatorTest2700
LeafFilterAdminTestCase16400
ExpandFilterContextTestCase192015
MessageGroupFilenameLineFunctionStatus
Failed to set field filters[filter_test_2_context][status] to 1Otherfilter.test1772FilterContextTestCase->setUp()
Found the requested form fields at admin/config/content/formats/addOtherfilter.test1772FilterContextTestCase->setUp()
Undefined offset: 3Noticefilter.test1790FilterContextTestCase->testFilterContext()
Undefined offset: 2Noticefilter.test1790FilterContextTestCase->testFilterContext()
Undefined offset: 1Noticefilter.test1790FilterContextTestCase->testFilterContext()
Context successfully passed.Otherfilter.test1791FilterContextTestCase->testFilterContext()
Text matched.Otherfilter.test1792FilterContextTestCase->testFilterContext()
Contextual variable matched.Otherfilter.test1793FilterContextTestCase->testFilterContext()
Undefined offset: 3Noticefilter.test1798FilterContextTestCase->testFilterContext()
Undefined offset: 2Noticefilter.test1798FilterContextTestCase->testFilterContext()
Undefined offset: 1Noticefilter.test1798FilterContextTestCase->testFilterContext()
Context successfully passed.Otherfilter.test1799FilterContextTestCase->testFilterContext()
Text matched.Otherfilter.test1800FilterContextTestCase->testFilterContext()
Contextual variable matched.Otherfilter.test1801FilterContextTestCase->testFilterContext()
Undefined offset: 3Noticefilter.test1806FilterContextTestCase->testFilterContext()
Undefined offset: 2Noticefilter.test1806FilterContextTestCase->testFilterContext()
Undefined offset: 1Noticefilter.test1806FilterContextTestCase->testFilterContext()
Context successfully passed.Otherfilter.test1807FilterContextTestCase->testFilterContext()
Text matched.Otherfilter.test1808FilterContextTestCase->testFilterContext()
Contextual variable matched.Otherfilter.test1809FilterContextTestCase->testFilterContext()
Filter with contextual data successfully invalidated cache.Otherfilter.test1810FilterContextTestCase->testFilterContext()
Undefined offset: 3Noticefilter.test1814FilterContextTestCase->testFilterContext()
Undefined offset: 2Noticefilter.test1814FilterContextTestCase->testFilterContext()
Undefined offset: 1Noticefilter.test1814FilterContextTestCase->testFilterContext()
Context successfully passed.Otherfilter.test1815FilterContextTestCase->testFilterContext()
Text matched.Otherfilter.test1816FilterContextTestCase->testFilterContext()
Contextual variable matched.Otherfilter.test1817FilterContextTestCase->testFilterContext()
Undefined offset: 3Noticefilter.test1822FilterContextTestCase->testFilterContext()
Undefined offset: 2Noticefilter.test1822FilterContextTestCase->testFilterContext()
Undefined offset: 1Noticefilter.test1822FilterContextTestCase->testFilterContext()
Context successfully passed.Otherfilter.test1823FilterContextTestCase->testFilterContext()
Text matched.Otherfilter.test1824FilterContextTestCase->testFilterContext()
Contextual variable matched.Otherfilter.test1825FilterContextTestCase->testFilterContext()
No cache mix-up.Otherfilter.test1826FilterContextTestCase->testFilterContext()
No cache mix-up.Otherfilter.test1827FilterContextTestCase->testFilterContext()
LeafFilterCRUDTestCase21400
LeafFilterDefaultFormatTestCase3300
LeafFilterFormatAccessTestCase24400
LeafFilterHooksTestCase3200
LeafFilterNoFormatTestCase100
LeafFilterSecurityTestCase2600
LeafFilterUnitTestCase20900
LeafFloodFunctionalTest600
LeafFormAlterTestCase300
LeafFormatDateUnitTest6100
LeafFormCheckboxTestCase9600
LeafFormElementTestCase2600
LeafFormsArbitraryRebuildTestCase1400
LeafFormsElementsLabelsTestCase1500
LeafFormsElementsTableSelectFunctionalTest5200
LeafFormsElementsVerticalTabsFunctionalTest300
LeafFormsFileInclusionTestCase900
LeafFormsFormStorageTestCase11500
LeafFormsFormWrapperTestCase400
LeafFormsProgrammaticTestCase2300
LeafFormsRebuildTestCase5000
LeafFormStateValuesCleanTestCase1300
LeafFormsTestCase27000
LeafFormsTriggeringElementTestCase4800
LeafFormValidationTestCase4700
LeafForumTestCase60800
LeafFrontPageTestCase3600
LeafGraphUnitTest2800
LeafHelpTestCase30800
LeafHookBootExitTestCase1800
LeafHookRequirementsTestCase1500
LeafImageAdminStylesUnitTest16700
LeafImageEffectsUnitTest3300
LeafImageFieldDisplayTestCase13400
LeafImageFieldValidateTestCase1800
LeafImageStylesPathAndUrlUnitTest4200
LeafImageToolkitGdTestCase100
LeafImageToolkitUnitTest4400
LeafImportOPMLTestCase5300
LeafInfoFileParserTestCase900
LeafIPAddressBlockingTestCase4200
LeafJavaScriptTestCase4400
LeafListFieldTestCase1400
LeafListFieldUITestCase20300
LeafLocaleCommentLanguageFunctionalTest5200
LeafLocaleConfigurationTest9700
LeafLocaleContentFunctionalTest6400
LeafLocaleDateFormatsFunctionalTest3500
LeafLocaleExportFunctionalTest2900
LeafLocaleImportFunctionalTest11600
LeafLocaleInstallTest100
LeafLocaleLanguageNegotiationInfoFunctionalTest4800
LeafLocaleLanguageSwitchingFunctionalTest2500
LeafLocaleMultilingualFieldsFunctionalTest6000
LeafLocalePathFunctionalTest4900
LeafLocaleTranslationFunctionalTest25000
LeafLocaleUILanguageNegotiationTest7300
LeafLocaleUninstallFrenchFunctionalTest3100
LeafLocaleUninstallFunctionalTest3100
LeafLocaleUrlRewritingTest3200
LeafLocaleUserCreationTest6800
LeafLocaleUserLanguageFunctionalTest5100
LeafLockFunctionalTest1700
LeafMailTestCase100
LeafMenuBreadcrumbTestCase41000
LeafMenuLinksUnitTestCase5000
LeafMenuNodeTestCase5500
LeafMenuRebuildTestCase500
LeafMenuRouterTestCase20200
LeafMenuTestCase64400
LeafMenuTreeDataTestCase400
LeafMenuTreeOutputTestCase700
LeafModuleDependencyTestCase15800
LeafModuleInstallTestCase200
LeafModuleRequiredTestCase1800
LeafModuleUninstallTestCase100
LeafModuleUnitTest6800
LeafModuleVersionTestCase5000
LeafMultiStepNodeFormBasicOptionsTest1500
LeafNewDefaultThemeBlocks2400
LeafNodeAccessRebuildTestCase1600
LeafNodeAccessRecordsUnitTest2300
LeafNodeAccessUnitTest3100
LeafNodeAdminTestCase14200
ExpandNodeBlockFunctionalTest8122
MessageGroupFilenameLineFunctionStatus
SQLSTATE[42S02]: Base table or view not found: 1146 Table 'drupaltestbotmysql.simpletest861388' doesn't exist: DELETE FROM {} WHERE (cid = :db_condition_placeholder_0) ; Array ( [:db_condition_placeholder_0] => filtered_html:23f92285efb524a1ae5e96ccf4317fe018fad611ff708bf210500cc6eb14520e: ) PDOExceptioncache.inc169cache_clear_all()
Block was displayed on the node/add/article page.Othernode.test1744NodeBlockFunctionalTest->testRecentNodeBlock()
SQLSTATE[42S02]: Base table or view not found: 1146 Table 'drupaltestbotmysql.simpletest861388' doesn't exist: DELETE FROM {} WHERE (cid = :db_condition_placeholder_0) ; Array ( [:db_condition_placeholder_0] => filtered_html:23f92285efb524a1ae5e96ccf4317fe018fad611ff708bf210500cc6eb14520e: ) PDOExceptioncache.inc169cache_clear_all()
Block was displayed on the node/N.Othernode.test1746NodeBlockFunctionalTest->testRecentNodeBlock()
LeafNodeBlockTestCase1800
LeafNodeBuildContent100
LeafNodeCreationTestCase2500
LeafNodeEntityFieldQueryAlter3000
LeafNodeFeedTestCase100
LeafNodeLoadHooksTestCase400
LeafNodeLoadMultipleUnitTest3600
LeafNodePostSettingsTestCase3400
LeafNodeQueryAlter7900
LeafNodeRevisionsTestCase4400
LeafNodeRSSContentTestCase1600
LeafNodeSaveTestCase3900
LeafNodeTitleTestCase2000
LeafNodeTitleXSSTestCase2000
LeafNodeTokenReplaceTestCase3400
LeafNodeTypePersistenceTestCase6200
LeafNodeTypeTestCase11300
LeafNoHelpTestCase1100
LeafNonDefaultBlockAdmin1000
LeafNumberFieldTestCase1500
LeafOpenIDFunctionalTestCase24800
LeafOpenIDRegistrationTestCase13100
LeafOpenIDUnitTest3200
LeafOptionsWidgetsTestCase25600
LeafPageEditTestCase9300
LeafPageNotFoundTestCase1800
LeafPagePreviewTestCase3500
LeafPageTitleFiltering4000
LeafPageViewTestCase3200
LeafParseInfoFilesTestCase300
LeafPasswordHashingTest1000
LeafPathLanguageTestCase6300
LeafPathLanguageUITestCase6900
LeafPathLookupTest1700
LeafPathMonolingualTestCase3400
ExpandPathTaxonomyTermTestCase3222
MessageGroupFilenameLineFunctionStatus
SQLSTATE[42S02]: Base table or view not found: 1146 Table 'drupaltestbotmysql.simpletest511226' doesn't exist: DELETE FROM {} WHERE (cid = :db_condition_placeholder_0) ; Array ( [:db_condition_placeholder_0] => filtered_html:784738f038a351b141ca62c4984fa5383175dadd0d06c10d583a0e13549834c1: ) PDOExceptioncache.inc169cache_clear_all()
Term can be accessed on URL alias.Otherpath.test202PathTaxonomyTermTestCase->testTermAlias()
SQLSTATE[42S02]: Base table or view not found: 1146 Table 'drupaltestbotmysql.simpletest511226' doesn't exist: DELETE FROM {} WHERE (cid = :db_condition_placeholder_0) ; Array ( [:db_condition_placeholder_0] => filtered_html:784738f038a351b141ca62c4984fa5383175dadd0d06c10d583a0e13549834c1: ) PDOExceptioncache.inc169cache_clear_all()
Term can be accessed on changed URL alias.Otherpath.test212PathTaxonomyTermTestCase->testTermAlias()
LeafPathTestCase10200
LeafPHPAccessTestCase3700
LeafPHPFilterTestCase4100
LeafPollBlockTestCase11800
LeafPollCreateTestCase17700
LeafPollExpirationTestCase3200
LeafPollJSAddChoice1500
LeafPollTokenReplaceTestCase15900
LeafPollVoteCheckHostname24800
LeafPollVoteTestCase16800
LeafProfileBlockTestCase12000
LeafProfileTestAutocomplete5400
LeafProfileTestBrowsing3200
LeafProfileTestDate4900
ExpandProfileTestFields17821
MessageGroupFilenameLineFunctionStatus
SQLSTATE[42S02]: Base table or view not found: 1146 Table 'drupaltestbotmysql.simpletest489993' doesn't exist: DELETE FROM {} WHERE (cid = :db_condition_placeholder_0) ; Array ( [:db_condition_placeholder_0] => filtered_html:543d2067f6fdefc440519e137e83120ea34a95ac50605eb6c74b84ce335b79d5: ) PDOExceptioncache.inc169cache_clear_all()
Found profile field with title nwVLZHqGOtherprofile.test144ProfileTestCase->setProfileField()
Found profile field with value mMDULf2XOtherprofile.test148ProfileTestCase->setProfileField()
LeafProfileTestSelect4500
LeafProfileTestWeights5300
LeafQueueTestCase700
LeafRdfCommentAttributesTestCase20400
LeafRdfCrudTestCase900
LeafRdfGetRdfNamespacesTestCase400
ExpandRdfMappingDefinitionTestCase5711
MessageGroupFilenameLineFunctionStatus
SQLSTATE[42S02]: Base table or view not found: 1146 Table 'drupaltestbotmysql.simpletest14400' doesn't exist: DELETE FROM {} WHERE (cid = :db_condition_placeholder_0) ; Array ( [:db_condition_placeholder_0] => filtered_html:c8ac8eff8d19b8b10fd4be7d2edfb4acc5d72ed7bff72c83c49c55c54b02bafa: ) PDOExceptioncache.inc169cache_clear_all()
RDFa markup found on term page.Otherrdf.test408RdfMappingDefinitionTestCase->testTaxonomyTermRdfaAttributes()
LeafRdfMappingHookTestCase500
LeafRdfRdfaMarkupTestCase2700
LeafRdfTrackerAttributesTestCase3200
LeafRegistryParseFilesTestCase600
LeafRegistryParseFileTestCase200
LeafRemoveFeedItemTestCase19600
LeafRemoveFeedTestCase2300
LeafRetrieveFileTestCase700
LeafSchemaTestCase58800
LeafSearchAdvancedSearchForm3100
LeafSearchBlockTestCase5800
LeafSearchCommentCountToggleTestCase3000
LeafSearchCommentTestCase18700
LeafSearchConfigSettingsForm11600
LeafSearchEmbedForm2900
LeafSearchExactTestCase2200
LeafSearchExcerptTestCase1100
LeafSearchExpressionInsertExtractTestCase2400
LeafSearchKeywordsConditions2500
LeafSearchLanguageTestCase4500
LeafSearchMatchTestCase14400
LeafSearchNumberMatchingTestCase29200
LeafSearchNumbersTestCase17200
LeafSearchPageOverride1200
LeafSearchPageText2900
LeafSearchRankingTestCase6000
LeafSearchSimplifyTestCase65100
LeafSearchTokenizerTestCase200
LeafSessionHttpsTestCase8200
LeafSessionTestCase18700
LeafShortcutLinksTestCase10300
LeafShortcutSetsTestCase15300
LeafShutdownFunctionsTest400
LeafSimpleTestBrowserTestCase1600
LeafSimpleTestFolderTestCase100
LeafSimpleTestFunctionalTest11400
LeafSimpleTestMailCaptureTestCase1300
LeafSiteMaintenanceTestCase8000
LeafStatisticsAdminTestCase10400
LeafStatisticsBlockVisitorsTestCase4500
LeafStatisticsLoggingTestCase2500
LeafStatisticsReportsTestCase8000
LeafStatisticsTokenReplaceTestCase2900
LeafStreamWrapperTest1500
LeafSummaryLengthTestCase1500
LeafSyslogTestCase1600
LeafSystemAdminTestCase19100
LeafSystemAuthorizeCase1500
LeafSystemBlockTestCase3400
LeafSystemIndexPhpTest900
LeafSystemInfoAlterTestCase1000
LeafSystemMainContentFallback6600
LeafSystemThemeFunctionalTest9100
LeafTableSortTest600
LeafTaxonomyHooksTestCase1900
LeafTaxonomyLegacyTestCase1300
LeafTaxonomyLoadMultipleUnitTest1700
LeafTaxonomyTermFieldTestCase3600
ExpandTaxonomyTermTestCase16632
MessageGroupFilenameLineFunctionStatus
SQLSTATE[42S02]: Base table or view not found: 1146 Table 'drupaltestbotmysql.simpletest853705' doesn't exist: DELETE FROM {} WHERE (cid = :db_condition_placeholder_0) ; Array ( [:db_condition_placeholder_0] => filtered_html:278307fc3522f52bc5fb1a8e0aa8555d6129906751f9fffb9791f14b2bb9d96d: ) PDOExceptioncache.inc169cache_clear_all()
The randomly generated term name is present.Othertaxonomy.test647TaxonomyTermTestCase->testTermInterface()
The randomly generated term description is present.Othertaxonomy.test648TaxonomyTermTestCase->testTermInterface()
Term page displayed the term description element.Othertaxonomy.test651TaxonomyTermTestCase->testTermInterface()
SQLSTATE[42S02]: Base table or view not found: 1146 Table 'drupaltestbotmysql.simpletest853705' doesn't exist: DELETE FROM {} WHERE (cid = :db_condition_placeholder_0) ; Array ( [:db_condition_placeholder_0] => filtered_html:e3b0c44298fc1c149afbf4c8996fb92427ae41e4649b934ca495991b7852b855: ) PDOExceptioncache.inc169cache_clear_all()
LeafTaxonomyTermUnitTest100
ExpandTaxonomyThemeTestCase1701
MessageGroupFilenameLineFunctionStatus
SQLSTATE[42S02]: Base table or view not found: 1146 Table 'drupaltestbotmysql.simpletest680867' doesn't exist: DELETE FROM {} WHERE (cid = :db_condition_placeholder_0) ; Array ( [:db_condition_placeholder_0] => filtered_html:2f443fba53e761a01e1bb8a014240c9f43352945672ba211734529fed1985e4a: ) PDOExceptioncache.inc169cache_clear_all()
ExpandTaxonomyTokenReplaceTestCase1801
MessageGroupFilenameLineFunctionStatus
PDOException: SQLSTATE[42S02]: Base table or view not found: 1146 Table 'drupaltestbotmysql.simpletest13028' doesn't exist: DELETE FROM {} WHERE (cid = :db_condition_placeholder_0) ; Array ( [:db_condition_placeholder_0] => filtered_html:4169ba7f14e02b2b47923bdbb966b6649ca0009fc0313a663b6c91bb720c9669: ) in cache_clear_all() (line 169 of /var/lib/drupaltestbot/sites/default/files/checkout/includes/cache.inc).Uncaught exceptiondatabase.inc2095PDOStatement->execute()
LeafTaxonomyVocabularyFunctionalTest9700
LeafTaxonomyVocabularyUnitTest6100
LeafTextFieldTestCase19700
LeafTextSummaryTestCase13800
LeafTextTranslationTestCase10400
LeafThemeFastTestCase1000
LeafThemeHookInitUnitTest400
LeafThemeItemListUnitTest100
LeafThemeLinksUnitTest1700
LeafThemeTableUnitTest600
LeafThemeUnitTest1600
LeafTokenReplaceTestCase3700
LeafTrackerTest22200
LeafTranslationTestCase55700
LeafTriggerContentTestCase35300
LeafTriggerCronTestCase3300
LeafTriggerOrphanedActionsTestCase3700
LeafTriggerOtherTestCase11200
LeafTriggerUserActionTestCase6500
LeafTriggerUserTokenTestCase18500
LeafUnicodeUnitTest17600
LeafUpdateCoreTestCase16000
LeafUpdateDependencyHookInvocationTestCase300
LeafUpdateDependencyMissingTestCase300
LeafUpdateDependencyOrderingTestCase300
LeafUpdateFeedItemTestCase6100
LeafUpdateFeedTestCase7400
LeafUpdateScriptFunctionalTest5600
LeafUpdateTestContribCase18100
LeafUpdateTestUploadCase6100
LeafUrlAlterFunctionalTest2800
LeafUserAccountLinksUnitTests2100
LeafUserAdminTestCase6500
LeafUserAuthmapAssignmentTestCase800
LeafUserAutocompleteTestCase2800
LeafUserBlocksUnitTests4300
LeafUserCancelTestCase29800
LeafUserCreateTestCase2700
LeafUserEditedOwnAccountTestCase2300
LeafUserEditTestCase6800
LeafUserLoginTestCase17100
LeafUserPermissionsTestCase5000
LeafUserPictureTestCase12400
LeafUserRegistrationTestCase13200
LeafUserRoleAdminTestCase5300
LeafUserRolesAssignmentTestCase5300
LeafUserSaveTestCase300
ExpandUserSignatureTestCase4413
MessageGroupFilenameLineFunctionStatus
SQLSTATE[42S02]: Base table or view not found: 1146 Table 'drupaltestbotmysql.simpletest831315' doesn't exist: DELETE FROM {} WHERE (cid = :db_condition_placeholder_0) ; Array ( [:db_condition_placeholder_0] => plain_text:5f0d35617a64ca1ae6fca27fc2407d2b4821a4c03d432aaad817206a1add0114: ) PDOExceptioncache.inc169cache_clear_all()
SQLSTATE[42S02]: Base table or view not found: 1146 Table 'drupaltestbotmysql.simpletest831315' doesn't exist: DELETE FROM {} WHERE (cid = :db_condition_placeholder_0) ; Array ( [:db_condition_placeholder_0] => plain_text:5f0d35617a64ca1ae6fca27fc2407d2b4821a4c03d432aaad817206a1add0114: ) PDOExceptioncache.inc169cache_clear_all()
SQLSTATE[42S02]: Base table or view not found: 1146 Table 'drupaltestbotmysql.simpletest831315' doesn't exist: DELETE FROM {} WHERE (cid = :db_condition_placeholder_0) ; Array ( [:db_condition_placeholder_0] => plain_text:5f0d35617a64ca1ae6fca27fc2407d2b4821a4c03d432aaad817206a1add0114: ) PDOExceptioncache.inc169cache_clear_all()
Filtered signature text found.Otheruser.test1757UserSignatureTestCase->testUserSignature()
LeafUserTimeZoneFunctionalTest3100
LeafUserTokenReplaceTestCase4300
LeafUserUserSearchTestCase3800
LeafUserValidateCurrentPassCustomForm2600
LeafUserValidationTestCase2300
LeafValidUrlTestCase7900
LeafXMLRPCBasicTestCase1200
LeafXMLRPCMessagesTestCase1000
LeafXMLRPCValidator1IncTestCase1800