entity-taxonomy-vocab-machine-name.patch

Test status
StatusResult
Last receivedThu, 10/06/2011 - 17:39:03
Last requestedThu, 10/06/2011 - 17:39:03
Last testedThu, 10/06/2011 - 17:40:56
Test count1
Environment status
MySQLfail
File information
Fileentity-taxonomy-vocab-machine-name.patch
BranchEntity API - 7.x-1.x
LinkIssue Link
SummaryFAILED: [[SimpleTest]]: [MySQL] 290 pass(es), 0 fail(s), and 6 exception(s).
Details

MySQL

  1. Setup environment
  2. Detect an invalid patch URL
  3. Detect invalid repository information
  4. Detect invalid patch format
  5. Detect a non-applicable patch
  6. Detect invalid PHP syntax
  7. Detect a Drupal installation failure
  8. Detect a test run failure
  9. Detect a failing test
    Review the test failures below then if necessary run them locally until the problem has been fixed.
  10. Complete test suite with all tests passing
290 pass(es), 0 fail(s), and 6 exception(s)

Non-pass

Test namePassFailException
ExpandMetadata Wrapper (EntityMetadataTestCase) [Entity API]11101
MessageGroupFilenameLineFunctionStatus
EntityMetadataWrapperException: Invalid data value given. Be sure it matches the required data type and format. in EntityDrupalWrapper->set() (line 732 of /var/lib/drupaltestbot/sites/default/files/checkout/sites/default/modules/entity/includes/entity.wrapper.inc).Uncaught exceptionentity.wrapper.inc732EntityDrupalWrapper->set()
ExpandProperty info core integration (EntityMetadataIntegrationTestCase) [Entity API]11805
MessageGroupFilenameLineFunctionStatus
Trying to get property of non-objectNoticecallbacks.inc287entity_metadata_taxonomy_term_setter()
Trying to get property of non-objectNoticetaxonomy.module592taxonomy_term_save()
EntityMalformedException: Missing bundle property on entity of type taxonomy_term. in entity_extract_ids() (line 7393 of /var/lib/drupaltestbot/sites/default/files/checkout/includes/common.inc).Uncaught exceptioncommon.inc7393entity_extract_ids()
Trying to get property of non-objectNoticecallbacks.inc287entity_metadata_taxonomy_term_setter()
EntityMalformedException: Missing bundle property on entity of type taxonomy_term. in entity_extract_ids() (line 7393 of /var/lib/drupaltestbot/sites/default/files/checkout/includes/common.inc).Uncaught exceptioncommon.inc7393entity_extract_ids()

All

Test namePassFailException
LeafEntity CRUD (EntityAPITestCase) [Entity API]5900
LeafEntity tokens (EntityTokenTestCase) [Entity API]200
ExpandMetadata Wrapper (EntityMetadataTestCase) [Entity API]11101
MessageGroupFilenameLineFunctionStatus
EntityMetadataWrapperException: Invalid data value given. Be sure it matches the required data type and format. in EntityDrupalWrapper->set() (line 732 of /var/lib/drupaltestbot/sites/default/files/checkout/sites/default/modules/entity/includes/entity.wrapper.inc).Uncaught exceptionentity.wrapper.inc732EntityDrupalWrapper->set()
ExpandProperty info core integration (EntityMetadataIntegrationTestCase) [Entity API]11805
MessageGroupFilenameLineFunctionStatus
Trying to get property of non-objectNoticecallbacks.inc287entity_metadata_taxonomy_term_setter()
Trying to get property of non-objectNoticetaxonomy.module592taxonomy_term_save()
EntityMalformedException: Missing bundle property on entity of type taxonomy_term. in entity_extract_ids() (line 7393 of /var/lib/drupaltestbot/sites/default/files/checkout/includes/common.inc).Uncaught exceptioncommon.inc7393entity_extract_ids()
Trying to get property of non-objectNoticecallbacks.inc287entity_metadata_taxonomy_term_setter()
EntityMalformedException: Missing bundle property on entity of type taxonomy_term. in entity_extract_ids() (line 7393 of /var/lib/drupaltestbot/sites/default/files/checkout/includes/common.inc).Uncaught exceptioncommon.inc7393entity_extract_ids()