mollom.data-update.17.tests-only.patch

Test status
StatusResult
Last receivedTue, 05/10/2011 - 20:42:38
Last requestedTue, 05/10/2011 - 20:43:03
Last testedTue, 05/10/2011 - 20:45:05
Test count1
Environment status
MySQLfail
File information
Filemollom.data-update.17.tests-only.patch
BranchMollom - 7.x-1.x
LinkIssue Link
SummaryFAILED: [[SimpleTest]]: [MySQL] 2,265 pass(es), 0 fail(s), and 1 exception(s).
Details

MySQL

  1. Setup environment
  2. Detect an invalid patch URL
  3. Detect invalid repository information
  4. Detect invalid patch format
  5. Detect a non-applicable patch
  6. Detect invalid PHP syntax
  7. Detect a Drupal installation failure
  8. Detect a test run failure
  9. Detect a failing test
    Review the test failures below then if necessary run them locally until the problem has been fixed.
  10. Complete test suite with all tests passing
2,265 pass(es), 0 fail(s), and 1 exception(s)

Non-pass

Test namePassFailException
ExpandMollomDataCRUDTestCase2201
MessageGroupFilenameLineFunctionStatus
PDOException: SQLSTATE[23000]: Integrity constraint violation: 1062 Duplicate entry 'type1-123' for key 'PRIMARY': UPDATE {mollom} SET entity=:db_update_placeholder_0, session_id=:db_update_placeholder_1, form_id=:db_update_placeholder_2, changed=:db_update_placeholder_3, moderate=:db_update_placeholder_4, languages=:db_update_placeholder_5 WHERE (id = :db_condition_placeholder_0) ; Array ( [:db_update_placeholder_0] => type1 [:db_update_placeholder_1] => type1-session-id [:db_update_placeholder_2] => type1_form [:db_update_placeholder_3] => 1305060198 [:db_update_placeholder_4] => 0 [:db_update_placeholder_5] => [:db_condition_placeholder_0] => 123 ) in drupal_write_record() (line 6846 of /var/lib/drupaltestbot/sites/default/files/checkout/includes/common.inc).Uncaught exceptiondatabase.inc2038PDOStatement->execute()

All

Test namePassFailException
LeafMollomAccessTestCase14400
LeafMollomAnalysisTestCase12900
LeafMollomBlacklistTestCase5700
LeafMollomCommentFormTestCase20300
LeafMollomContactFormTestCase16400
ExpandMollomDataCRUDTestCase2201
MessageGroupFilenameLineFunctionStatus
PDOException: SQLSTATE[23000]: Integrity constraint violation: 1062 Duplicate entry 'type1-123' for key 'PRIMARY': UPDATE {mollom} SET entity=:db_update_placeholder_0, session_id=:db_update_placeholder_1, form_id=:db_update_placeholder_2, changed=:db_update_placeholder_3, moderate=:db_update_placeholder_4, languages=:db_update_placeholder_5 WHERE (id = :db_condition_placeholder_0) ; Array ( [:db_update_placeholder_0] => type1 [:db_update_placeholder_1] => type1-session-id [:db_update_placeholder_2] => type1_form [:db_update_placeholder_3] => 1305060198 [:db_update_placeholder_4] => 0 [:db_update_placeholder_5] => [:db_condition_placeholder_0] => 123 ) in drupal_write_record() (line 6846 of /var/lib/drupaltestbot/sites/default/files/checkout/includes/common.inc).Uncaught exceptiondatabase.inc2038PDOStatement->execute()
LeafMollomDataTestCase29800
LeafMollomFallbackTestCase13200
LeafMollomFormConfigurationTestCase30000
LeafMollomInstallationTestCase9900
LeafMollomLanguageDetectionTestCase2700
LeafMollomNodeFormTestCase4300
LeafMollomProfanityTestCase15300
LeafMollomProfileFormsTestCase8800
LeafMollomReportTestCase21400
LeafMollomResellerTestCase600
LeafMollomResponseTestCase5900
LeafMollomServerListRecoveryTestCase2000
LeafMollomUserFormsTestCase10700