title-1142992-10.patch

Test status
StatusResult
Last receivedSat, 04/30/2011 - 11:42:19
Last requestedSat, 04/30/2011 - 11:43:04
Last testedSat, 04/30/2011 - 11:43:44
Test count1
Environment status
MySQLfail
File information
Filetitle-1142992-10.patch
BranchTitle - 7.x-1.x
LinkIssue Link
SummaryFAILED: [[SimpleTest]]: [MySQL] 8 pass(es), 0 fail(s), and 1 exception(s).
Details

MySQL

  1. Setup environment
  2. Detect an invalid patch URL
  3. Detect invalid repository information
  4. Detect invalid patch format
  5. Detect a non-applicable patch
  6. Detect invalid PHP syntax
  7. Detect a Drupal installation failure
  8. Detect a test run failure
  9. Detect a failing test
    Review the test failures below then if necessary run them locally until the problem has been fixed.
  10. Complete test suite with all tests passing
8 pass(es), 0 fail(s), and 1 exception(s)

Non-pass

Test namePassFailException
ExpandTitleFieldReplacementTestCase801
MessageGroupFilenameLineFunctionStatus
PDOException: SQLSTATE[42S02]: Base table or view not found: 1146 Table 'drupaltestbotmysql.simpletest519089test_entity' doesn't exist: UPDATE {test_entity} SET ftvid=:db_update_placeholder_0 WHERE (ftid = :db_condition_placeholder_0) ; Array ( [:db_update_placeholder_0] => [:db_condition_placeholder_0] => ) in field_test_entity_save() (line 309 of /var/lib/drupaltestbot/sites/default/files/checkout/modules/field/tests/field_test.entity.inc).Uncaught exceptiondatabase.inc2038PDOStatement->execute()

All

Test namePassFailException
ExpandTitleFieldReplacementTestCase801
MessageGroupFilenameLineFunctionStatus
PDOException: SQLSTATE[42S02]: Base table or view not found: 1146 Table 'drupaltestbotmysql.simpletest519089test_entity' doesn't exist: UPDATE {test_entity} SET ftvid=:db_update_placeholder_0 WHERE (ftid = :db_condition_placeholder_0) ; Array ( [:db_update_placeholder_0] => [:db_condition_placeholder_0] => ) in field_test_entity_save() (line 309 of /var/lib/drupaltestbot/sites/default/files/checkout/modules/field/tests/field_test.entity.inc).Uncaught exceptiondatabase.inc2038PDOStatement->execute()