variable_caching.patch

Test status
StatusResult
Last receivedTue, 04/05/2011 - 16:01:53
Last requestedTue, 04/05/2011 - 16:11:15
Last testedTue, 04/05/2011 - 16:43:18
Test count1
Environment status
MySQLfail
File information
Filevariable_caching.patch
BranchDrupal core - 8.x
LinkIssue Link
SummaryFAILED: [[SimpleTest]]: [MySQL] 29,157 pass(es), 107 fail(s), and 56 exception(s).
Details

MySQL

  1. Setup environment
  2. Detect an invalid patch URL
  3. Detect invalid repository information
  4. Detect invalid patch format
  5. Detect a non-applicable patch
  6. Detect invalid PHP syntax
  7. Detect a Drupal installation failure
  8. Detect a test run failure
  9. Detect a failing test
    Review the test failures below then if necessary run them locally until the problem has been fixed.
  10. Complete test suite with all tests passing
29,157 pass(es), 107 fail(s), and 56 exception(s)

Non-pass

Test namePassFailException
ExpandBreadcrumbs (MenuBreadcrumbTestCase) [Menu]401912
MessageGroupFilenameLineFunctionStatus
Undefined variable: tab_root_mapNoticemenu.inc772_menu_translate()
implode(): Invalid arguments passedWarningmenu.inc772_menu_translate()
Undefined variable: tab_parent_mapNoticemenu.inc773_menu_translate()
implode(): Invalid arguments passedWarningmenu.inc773_menu_translate()
Active link Parent jlbE3qXV was found in menu tree, including active trail links .Othermenu.test1044MenuBreadcrumbTestCase->testBreadCrumbs()
Undefined variable: tab_root_mapNoticemenu.inc772_menu_translate()
implode(): Invalid arguments passedWarningmenu.inc772_menu_translate()
Undefined variable: tab_parent_mapNoticemenu.inc773_menu_translate()
implode(): Invalid arguments passedWarningmenu.inc773_menu_translate()
Breadcrumb Home found on http://drupaltestbot659-mysql/checkout/?q=node/2/view.Othermenu.test1047MenuBreadcrumbTestCase->testBreadCrumbs()
Active link Parent jlbE3qXV was found in menu tree, including active trail links .Othermenu.test1047MenuBreadcrumbTestCase->testBreadCrumbs()
Undefined variable: tab_root_mapNoticemenu.inc772_menu_translate()
implode(): Invalid arguments passedWarningmenu.inc772_menu_translate()
Undefined variable: tab_parent_mapNoticemenu.inc773_menu_translate()
implode(): Invalid arguments passedWarningmenu.inc773_menu_translate()
Breadcrumb Home » Parent jlbE3qXV found on http://drupaltestbot659-mysql/checkout/?q=node/2/edit.Othermenu.test1051MenuBreadcrumbTestCase->testBreadCrumbs()
Breadcrumb Home » Parent jlbE3qXV found on http://drupaltestbot659-mysql/checkout/?q=node/3.Othermenu.test1068MenuBreadcrumbTestCase->testBreadCrumbs()
Active link Parent jlbE3qXV was found in menu tree, including active trail links .Othermenu.test1068MenuBreadcrumbTestCase->testBreadCrumbs()
Breadcrumb Home » Parent jlbE3qXV found on http://drupaltestbot659-mysql/checkout/?q=node/3/view.Othermenu.test1071MenuBreadcrumbTestCase->testBreadCrumbs()
Active link Parent jlbE3qXV was found in menu tree, including active trail links .Othermenu.test1071MenuBreadcrumbTestCase->testBreadCrumbs()
Breadcrumb Home » Parent jlbE3qXV » Child hDa7oNii found on http://drupaltestbot659-mysql/checkout/?q=node/3/edit.Othermenu.test1078MenuBreadcrumbTestCase->testBreadCrumbs()
ExpandCascading stylesheets (CascadingStylesheetsTestCase) [System]2410
MessageGroupFilenameLineFunctionStatus
Query string was appended correctly to css.Othercommon.test784CascadingStylesheetsTestCase->testAddCssFileWithQueryString()
ExpandColor functionality (ColorTestCase) [Color]591214
MessageGroupFilenameLineFunctionStatus
Failed to set field palette[bg] to #123456Othercolor.test66ColorTestCase->_testColor()
Found the requested form fields at admin/appearance/settings/bartikOthercolor.test66ColorTestCase->_testColor()
Undefined offset: 0Noticecolor.test70ColorTestCase->_testColor()
Undefined offset: 0Noticecolor.test72ColorTestCase->_testColor()
file(): Filename cannot be emptyWarningcolor.test72ColorTestCase->_testColor()
join(): Invalid arguments passedWarningcolor.test72ColorTestCase->_testColor()
Make sure the color we changed is in the color stylesheet. (bartik)Othercolor.test73ColorTestCase->_testColor()
Failed to set field palette[bg] to #123456Othercolor.test78ColorTestCase->_testColor()
Found the requested form fields at admin/appearance/settings/bartikOthercolor.test78ColorTestCase->_testColor()
Undefined offset: 0Noticecolor.test82ColorTestCase->_testColor()
file(): Filename cannot be emptyWarningcolor.test82ColorTestCase->_testColor()
join(): Invalid arguments passedWarningcolor.test82ColorTestCase->_testColor()
Make sure the color we changed is in the color stylesheet. (bartik)Othercolor.test83ColorTestCase->_testColor()
Failed to set field palette[link] to #123456Othercolor.test66ColorTestCase->_testColor()
Found the requested form fields at admin/appearance/settings/garlandOthercolor.test66ColorTestCase->_testColor()
Undefined offset: 0Noticecolor.test70ColorTestCase->_testColor()
Undefined offset: 0Noticecolor.test72ColorTestCase->_testColor()
file(): Filename cannot be emptyWarningcolor.test72ColorTestCase->_testColor()
join(): Invalid arguments passedWarningcolor.test72ColorTestCase->_testColor()
Make sure the color we changed is in the color stylesheet. (garland)Othercolor.test73ColorTestCase->_testColor()
Failed to set field palette[link] to #123456Othercolor.test78ColorTestCase->_testColor()
Found the requested form fields at admin/appearance/settings/garlandOthercolor.test78ColorTestCase->_testColor()
Undefined offset: 0Noticecolor.test82ColorTestCase->_testColor()
file(): Filename cannot be emptyWarningcolor.test82ColorTestCase->_testColor()
join(): Invalid arguments passedWarningcolor.test82ColorTestCase->_testColor()
Make sure the color we changed is in the color stylesheet. (garland)Othercolor.test83ColorTestCase->_testColor()
ExpandComment paging settings (CommentPagerTest) [Comment]198100
MessageGroupFilenameLineFunctionStatus
Flat mode, 1 replies: expected page 5, returned page 0.Othercomment.test1258CommentPagerTest->testCommentNewPageIndicator()
Flat mode, 2 replies: expected page 4, returned page 0.Othercomment.test1258CommentPagerTest->testCommentNewPageIndicator()
Flat mode, 3 replies: expected page 3, returned page 0.Othercomment.test1258CommentPagerTest->testCommentNewPageIndicator()
Flat mode, 4 replies: expected page 2, returned page 0.Othercomment.test1258CommentPagerTest->testCommentNewPageIndicator()
Flat mode, 5 replies: expected page 1, returned page 0.Othercomment.test1258CommentPagerTest->testCommentNewPageIndicator()
Threaded mode, 1 replies: expected page 5, returned page 0.Othercomment.test1276CommentPagerTest->testCommentNewPageIndicator()
Threaded mode, 2 replies: expected page 1, returned page 0.Othercomment.test1276CommentPagerTest->testCommentNewPageIndicator()
Threaded mode, 3 replies: expected page 1, returned page 0.Othercomment.test1276CommentPagerTest->testCommentNewPageIndicator()
Threaded mode, 4 replies: expected page 1, returned page 0.Othercomment.test1276CommentPagerTest->testCommentNewPageIndicator()
Threaded mode, 5 replies: expected page 1, returned page 0.Othercomment.test1276CommentPagerTest->testCommentNewPageIndicator()
ExpandCron run (CronRunTestCase) [System]4330
MessageGroupFilenameLineFunctionStatus
Cron runs when the cron threshold is passed.Othersystem.test621CronRunTestCase->testAutomaticCron()
New temp file was correctly ignored.Othersystem.test679CronRunTestCase->testTempFileCleanup()
Old permanent file was correctly ignored.Othersystem.test680CronRunTestCase->testTempFileCleanup()
ExpandDrupal system listing (DrupalSystemListingTestCase) [System]510
MessageGroupFilenameLineFunctionStatus
Module drupal_system_listing_compatible_test was found at profiles/testing/modules/drupal_system_listing_compatible_test/drupal_system_listing_compatible_test.module.Othercommon.test2126DrupalSystemListingTestCase->testDirectoryPrecedence()
ExpandFile download (FileDownloadTest) [File API]2698
MessageGroupFilenameLineFunctionStatus
file_put_contents(private://g7Bq2Gy4): failed to open stream: "DrupalPrivateStreamWrapper::stream_open" call failedWarningfile.test209FileTestCase->createFile()
The test file exists on the disk.Create test filefile.test210FileTestCase->createFile()
filesize(): stat failed for private://g7Bq2Gy4Warningfile.test218FileTestCase->createFile()
Undefined index: x-fooNoticefile.test2239FileDownloadTest->testPrivateFileTransfer()
Found header set by file_test module on private download.Otherfile.test2239FileDownloadTest->testPrivateFileTransfer()
Correctly allowed access to a file when file_test provides headers.Browserfile.test2240FileDownloadTest->testPrivateFileTransfer()
Correctly denied access to a file when file_test sets the header to -1.Browserfile.test2245FileDownloadTest->testPrivateFileTransfer()
file_get_contents(public://...@[]?&+%#,;=:__%23%25%26%2B%2F%3Féøïвβ中國書۞): failed to open stream: "DrupalPublicStreamWrapper::stream_open" call failedWarningfile.test2314FileDownloadTest->checkUrl()
Contents of the file are correct.Otherfile.test2314FileDownloadTest->checkUrl()
file_put_contents(private://...@[]?&+%#,;=:__%23%25%26%2B%2F%3Féøïвβ中國書۞): failed to open stream: "DrupalPrivateStreamWrapper::stream_open" call failedWarningfile.test209FileTestCase->createFile()
The test file exists on the disk.Create test filefile.test210FileTestCase->createFile()
filesize(): stat failed for private:/// -._!$'"()*@[]?&+%#,;=:__%23%25%26%2B%2F%3Féøïвβ中國書۞Warningfile.test218FileTestCase->createFile()
HTTP response expected 200, actual 404Browserfile.test2313FileDownloadTest->checkUrl()
file_put_contents(private://...@[]?&+%#,;=:__%23%25%26%2B%2F%3Féøïвβ中國書۞): failed to open stream: "DrupalPrivateStreamWrapper::stream_open" call failedWarningfile.test209FileTestCase->createFile()
The test file exists on the disk.Create test filefile.test210FileTestCase->createFile()
filesize(): stat failed for private:/// -._!$'"()*@[]?&+%#,;=:__%23%25%26%2B%2F%3Féøïвβ中國書۞Warningfile.test218FileTestCase->createFile()
HTTP response expected 200, actual 404Browserfile.test2313FileDownloadTest->checkUrl()
ExpandFile field revision test (FileFieldRevisionTestCase) [File]6710
MessageGroupFilenameLineFunctionStatus
Original file is deleted after deleting the entire node with two revisions remaining.Otherfile.test676FileFieldRevisionTestCase->testRevisions()
ExpandFile uploading (FileSaveUploadTest) [File API]237264
MessageGroupFilenameLineFunctionStatus
Can't upload a disallowed extensionOtherfile.test674FileSaveUploadTest->testHandleExtension()
Found the failure message.Otherfile.test675FileSaveUploadTest->testHandleExtension()
Expected hooks validate to be called but validate was not called.Otherfile.test678FileSaveUploadTest->testHandleExtension()
Found the success message.Otherfile.test694FileSaveUploadTest->testHandleExtension()
Expected hooks validate, load, update to be called but validate, load, update was not called.Otherfile.test697FileSaveUploadTest->testHandleExtension()
Found the success message.Otherfile.test711FileSaveUploadTest->testHandleExtension()
Expected hooks validate, load, update to be called but validate, load, update was not called.Otherfile.test714FileSaveUploadTest->testHandleExtension()
Dangerous file was renamed.Otherfile.test733FileSaveUploadTest->testHandleDangerousFile()
Dangerous file's MIME type was changed.Otherfile.test734FileSaveUploadTest->testHandleDangerousFile()
Found the success message.Otherfile.test735FileSaveUploadTest->testHandleDangerousFile()
Expected hooks validate, insert to be called but validate, insert was not called.Otherfile.test738FileSaveUploadTest->testHandleDangerousFile()
Dangerous file was not renamed when insecure uploads is TRUE.Otherfile.test749FileSaveUploadTest->testHandleDangerousFile()
Found the success message.Otherfile.test750FileSaveUploadTest->testHandleDangerousFile()
Expected hooks validate, insert to be called but validate, insert was not called.Otherfile.test753FileSaveUploadTest->testHandleDangerousFile()
Trying to get property of non-objectNoticefile.test772FileSaveUploadTest->testHandleFileMunge()
Trying to get property of non-objectNoticefile.test776FileSaveUploadTest->testHandleFileMunge()
Found security message.Otherfile.test782FileSaveUploadTest->testHandleFileMunge()
File was successfully munged.Otherfile.test783FileSaveUploadTest->testHandleFileMunge()
Found the success message.Otherfile.test784FileSaveUploadTest->testHandleFileMunge()
Expected hooks validate, insert to be called but validate, insert was not called.Otherfile.test787FileSaveUploadTest->testHandleFileMunge()
Trying to get property of non-objectNoticefile.test794FileSaveUploadTest->testHandleFileMunge()
Trying to get property of non-objectNoticefile.test801FileSaveUploadTest->testHandleFileMunge()
File was not munged when allowing any extension.Otherfile.test801FileSaveUploadTest->testHandleFileMunge()
Found the success message.Otherfile.test802FileSaveUploadTest->testHandleFileMunge()
Expected hooks validate, insert to be called but validate, insert was not called.Otherfile.test805FileSaveUploadTest->testHandleFileMunge()
Found the success message.Otherfile.test818FileSaveUploadTest->testExistingRename()
Expected hooks validate, insert to be called but validate, insert was not called.Otherfile.test821FileSaveUploadTest->testExistingRename()
Found the success message.Otherfile.test834FileSaveUploadTest->testExistingReplace()
Expected hooks validate, load, update to be called but validate, load, update was not called.Otherfile.test837FileSaveUploadTest->testExistingReplace()
Found the failure message.Otherfile.test850FileSaveUploadTest->testExistingError()
ExpandFileTransfer unit tests (FileTranferTest) [System]203
MessageGroupFilenameLineFunctionStatus
mkdir(): File existsWarningstream_wrappers.inc627DrupalLocalStreamWrapper->mkdir()
mkdir(): File existsWarningstream_wrappers.inc627DrupalLocalStreamWrapper->mkdir()
mkdir(): File existsWarningstream_wrappers.inc627DrupalLocalStreamWrapper->mkdir()
ExpandFlood control mechanism (FloodFunctionalTest) [System]610
MessageGroupFilenameLineFunctionStatus
Value false is TRUE.Othersystem.test1899FloodFunctionalTest->testCleanUp()
ExpandForm API checkbox (FormCheckboxTestCase) [Form API]001
MessageGroupFilenameLineFunctionStatus
PDOException: SQLSTATE[42000]: Syntax error or access violation: 1064 You have an error in your SQL syntax; check the manual that corresponds to your MySQL server version for the right syntax to use near ') ORDER BY fit DESC LIMIT 0, 1' at line 1: SELECT * FROM {menu_router} WHERE path IN () ORDER BY fit DESC LIMIT 0, 1; Array ( ) in menu_get_item() (line 445 of /var/lib/drupaltestbot/sites/default/files/checkout/includes/menu.inc).Uncaught exceptiondatabase.inc2038PDOStatement->execute()
ExpandForum functionality (ForumTestCase) [Forum]60440
MessageGroupFilenameLineFunctionStatus
Forum topic was not createdOtherforum.test368ForumTestCase->createForumTopic()
Error message was shownOtherforum.test369ForumTestCase->createForumTopic()
Forum topic was not createdOtherforum.test368ForumTestCase->createForumTopic()
Error message was shownOtherforum.test369ForumTestCase->createForumTopic()
ExpandImage styles path and URL functions (ImageStylesPathAndUrlUnitTest) [Image]22244
MessageGroupFilenameLineFunctionStatus
Image was generated at the URL.Browserimage.test205ImageStylesPathAndUrlUnitTest->_testImageStyleUrlAndPath()
Generated file does exist after we accessed it.Otherimage.test206ImageStylesPathAndUrlUnitTest->_testImageStyleUrlAndPath()
file_get_contents(public://styles/style_foo/public/image-test_3.png): failed to open stream: "DrupalPublicStreamWrapper::stream_open" call failedWarningimage.test207ImageStylesPathAndUrlUnitTest->_testImageStyleUrlAndPath()
URL returns expected file.Otherimage.test207ImageStylesPathAndUrlUnitTest->_testImageStyleUrlAndPath()
Expected Content-Type was reported.Otherimage.test209ImageStylesPathAndUrlUnitTest->_testImageStyleUrlAndPath()
Expected Content-Length was reported.Otherimage.test210ImageStylesPathAndUrlUnitTest->_testImageStyleUrlAndPath()
Created the directory for the generated images for the test style.Otherimage.test182ImageStylesPathAndUrlUnitTest->_testImageStyleUrlAndPath()
Created the generated image file.Otherimage.test192ImageStylesPathAndUrlUnitTest->_testImageStyleUrlAndPath()
Image was generated at the URL.Browserimage.test205ImageStylesPathAndUrlUnitTest->_testImageStyleUrlAndPath()
Generated file does exist after we accessed it.Otherimage.test206ImageStylesPathAndUrlUnitTest->_testImageStyleUrlAndPath()
file_get_contents(private://styles/style_foo/private/): failed to open stream: "DrupalPrivateStreamWrapper::stream_open" call failedWarningimage.test207ImageStylesPathAndUrlUnitTest->_testImageStyleUrlAndPath()
URL returns expected file.Otherimage.test207ImageStylesPathAndUrlUnitTest->_testImageStyleUrlAndPath()
Expected Content-Type was reported.Otherimage.test209ImageStylesPathAndUrlUnitTest->_testImageStyleUrlAndPath()
Expected custom header has been added.Otherimage.test212ImageStylesPathAndUrlUnitTest->_testImageStyleUrlAndPath()
Image was generated at the URL.Browserimage.test205ImageStylesPathAndUrlUnitTest->_testImageStyleUrlAndPath()
Generated file does exist after we accessed it.Otherimage.test206ImageStylesPathAndUrlUnitTest->_testImageStyleUrlAndPath()
file_get_contents(public://styles/style_foo/public/image-test_11.png): failed to open stream: "DrupalPublicStreamWrapper::stream_open" call failedWarningimage.test207ImageStylesPathAndUrlUnitTest->_testImageStyleUrlAndPath()
URL returns expected file.Otherimage.test207ImageStylesPathAndUrlUnitTest->_testImageStyleUrlAndPath()
Expected Content-Type was reported.Otherimage.test209ImageStylesPathAndUrlUnitTest->_testImageStyleUrlAndPath()
Expected Content-Length was reported.Otherimage.test210ImageStylesPathAndUrlUnitTest->_testImageStyleUrlAndPath()
Created the directory for the generated images for the test style.Otherimage.test182ImageStylesPathAndUrlUnitTest->_testImageStyleUrlAndPath()
Created the generated image file.Otherimage.test192ImageStylesPathAndUrlUnitTest->_testImageStyleUrlAndPath()
Image was generated at the URL.Browserimage.test205ImageStylesPathAndUrlUnitTest->_testImageStyleUrlAndPath()
Generated file does exist after we accessed it.Otherimage.test206ImageStylesPathAndUrlUnitTest->_testImageStyleUrlAndPath()
file_get_contents(private://styles/style_foo/private/): failed to open stream: "DrupalPrivateStreamWrapper::stream_open" call failedWarningimage.test207ImageStylesPathAndUrlUnitTest->_testImageStyleUrlAndPath()
URL returns expected file.Otherimage.test207ImageStylesPathAndUrlUnitTest->_testImageStyleUrlAndPath()
Expected Content-Type was reported.Otherimage.test209ImageStylesPathAndUrlUnitTest->_testImageStyleUrlAndPath()
Expected custom header has been added.Otherimage.test212ImageStylesPathAndUrlUnitTest->_testImageStyleUrlAndPath()
ExpandJavaScript (JavaScriptTestCase) [System]4110
MessageGroupFilenameLineFunctionStatus
Query string was appended correctly to js.Othercommon.test1452JavaScriptTestCase->testAddJsFileWithQueryString()
ExpandList field (ListFieldTestCase) [Field types]001
MessageGroupFilenameLineFunctionStatus
PDOException: SQLSTATE[42000]: Syntax error or access violation: 1064 You have an error in your SQL syntax; check the manual that corresponds to your MySQL server version for the right syntax to use near ') ORDER BY fit DESC LIMIT 0, 1' at line 1: SELECT * FROM {menu_router} WHERE path IN () ORDER BY fit DESC LIMIT 0, 1; Array ( ) in menu_get_item() (line 445 of /var/lib/drupaltestbot/sites/default/files/checkout/includes/menu.inc).Uncaught exceptiondatabase.inc2038PDOStatement->execute()
ExpandModule API (ModuleUnitTest) [Module]6804
MessageGroupFilenameLineFunctionStatus
array_merge(): Argument #2 is not an arrayWarningbootstrap.inc887variable_write_cache()
array_key_exists() expects parameter 2 to be array, null givenWarningbootstrap.inc894variable_write_cache()
array_merge(): Argument #2 is not an arrayWarningbootstrap.inc887variable_write_cache()
array_key_exists() expects parameter 2 to be array, null givenWarningbootstrap.inc894variable_write_cache()
ExpandModule dependencies (ModuleDependencyTestCase) [Module]15802
MessageGroupFilenameLineFunctionStatus
array_merge(): Argument #2 is not an arrayWarningbootstrap.inc887variable_write_cache()
array_key_exists() expects parameter 2 to be array, null givenWarningbootstrap.inc894variable_write_cache()
ExpandPoll expiration (PollExpirationTestCase) [Poll]2601
MessageGroupFilenameLineFunctionStatus
PDOException: SQLSTATE[42000]: Syntax error or access violation: 1064 You have an error in your SQL syntax; check the manual that corresponds to your MySQL server version for the right syntax to use near ') ORDER BY fit DESC LIMIT 0, 1' at line 1: SELECT * FROM {menu_router} WHERE path IN () ORDER BY fit DESC LIMIT 0, 1; Array ( ) in menu_get_item() (line 445 of /var/lib/drupaltestbot/sites/default/files/checkout/includes/menu.inc).Uncaught exceptiondatabase.inc2038PDOStatement->execute()
ExpandProgrammatic form submissions (FormsProgrammaticTestCase) [Form API]001
MessageGroupFilenameLineFunctionStatus
PDOException: SQLSTATE[42000]: Syntax error or access violation: 1064 You have an error in your SQL syntax; check the manual that corresponds to your MySQL server version for the right syntax to use near ') ORDER BY fit DESC LIMIT 0, 1' at line 1: SELECT * FROM {menu_router} WHERE path IN () ORDER BY fit DESC LIMIT 0, 1; Array ( ) in menu_get_item() (line 445 of /var/lib/drupaltestbot/sites/default/files/checkout/includes/menu.inc).Uncaught exceptiondatabase.inc2038PDOStatement->execute()
ExpandRebuild content (NodeBuildContent) [Node]001
MessageGroupFilenameLineFunctionStatus
PDOException: SQLSTATE[42000]: Syntax error or access violation: 1064 You have an error in your SQL syntax; check the manual that corresponds to your MySQL server version for the right syntax to use near ') ORDER BY fit DESC LIMIT 0, 1' at line 1: SELECT * FROM {menu_router} WHERE path IN () ORDER BY fit DESC LIMIT 0, 1; Array ( ) in menu_get_item() (line 445 of /var/lib/drupaltestbot/sites/default/files/checkout/includes/menu.inc).Uncaught exceptiondatabase.inc2038PDOStatement->execute()
ExpandSearch engine ranking (SearchRankingTestCase) [Search]5730
MessageGroupFilenameLineFunctionStatus
Search ranking "recent" order.Othersearch.test443SearchRankingTestCase->testRankings()
Search ranking "comments" order.Othersearch.test443SearchRankingTestCase->testRankings()
Search ranking "views" order.Othersearch.test443SearchRankingTestCase->testRankings()
ExpandStream wrappers (StreamWrapperTest) [File API]1410
MessageGroupFilenameLineFunctionStatus
Expected default directory path was returned.Otherfile.test2604StreamWrapperTest->testUriFunctions()
ExpandTest statistics admin. (StatisticsAdminTestCase) [Statistics]10310
MessageGroupFilenameLineFunctionStatus
No hit URL found.Otherstatistics.test391StatisticsAdminTestCase->testExpiredLogs()

All

Test namePassFailException
Leaf403 functionality (AccessDeniedTestCase) [System]7500
Leaf404 functionality (PageNotFoundTestCase) [System]1800
LeafActionLoopTestCase2300
LeafActionsConfigurationTestCase3800
LeafAdd feed functionality (AddFeedTestCase) [Unknown]2800
LeafAdmin theme block admin accessibility (BlockAdminThemeTestCase) [Block]1800
LeafAdministrative pages (SystemAdminTestCase) [System]19100
LeafAdvanced search form (SearchAdvancedSearchForm) [Search]3100
LeafAJAX command form values (AJAXFormValuesTestCase) [AJAX]2800
LeafAJAX commands (AJAXCommandsTestCase) [AJAX]6800
LeafAJAX framework (AJAXFrameworkTestCase) [AJAX]1000
LeafAJAX multi form (AJAXMultiFormTestCase) [AJAX]3500
LeafAnonymous comments (CommentAnonymous) [Comment]16500
LeafAuthmap assignment (UserAuthmapAssignmentTestCase) [User]800
LeafAuthorize API (SystemAuthorizeCase) [System]1500
LeafAutocompletion (ProfileTestAutocomplete) [Profile]10800
LeafBasic SQL syntax tests (DatabaseBasicSyntaxTestCase) [Database]2600
LeafBatch percentages (BatchPercentagesUnitTestCase) [Batch API]1300
LeafBatch processing (BatchProcessingTestCase) [Batch API]15400
LeafBatch progress page (BatchPageTestCase) [Batch API]1500
LeafBlock availability (NodeBlockTestCase) [Node]1800
LeafBlock availability (PollBlockTestCase) [Poll]11800
LeafBlock availability (ProfileBlockTestCase) [Profile]18000
LeafBlock availability (SearchBlockTestCase) [Search]5800
LeafBlock caching (BlockCacheTestCase) [Block]22800
LeafBlock functionality (BlockTestCase) [Block]31300
LeafBlock functionality (SystemBlockTestCase) [System]3400
LeafBlock HTML id (BlockHTMLIdTestCase) [Block]1500
LeafBlog functionality (BlogTestCase) [Blog]24100
LeafBook functionality (BookTestCase) [Book]34900
LeafBoot and exit hook invocation (HookBootExitTestCase) [Bootstrap]1800
ExpandBreadcrumbs (MenuBreadcrumbTestCase) [Menu]401912
MessageGroupFilenameLineFunctionStatus
Undefined variable: tab_root_mapNoticemenu.inc772_menu_translate()
implode(): Invalid arguments passedWarningmenu.inc772_menu_translate()
Undefined variable: tab_parent_mapNoticemenu.inc773_menu_translate()
implode(): Invalid arguments passedWarningmenu.inc773_menu_translate()
Active link Parent jlbE3qXV was found in menu tree, including active trail links .Othermenu.test1044MenuBreadcrumbTestCase->testBreadCrumbs()
Undefined variable: tab_root_mapNoticemenu.inc772_menu_translate()
implode(): Invalid arguments passedWarningmenu.inc772_menu_translate()
Undefined variable: tab_parent_mapNoticemenu.inc773_menu_translate()
implode(): Invalid arguments passedWarningmenu.inc773_menu_translate()
Breadcrumb Home found on http://drupaltestbot659-mysql/checkout/?q=node/2/view.Othermenu.test1047MenuBreadcrumbTestCase->testBreadCrumbs()
Active link Parent jlbE3qXV was found in menu tree, including active trail links .Othermenu.test1047MenuBreadcrumbTestCase->testBreadCrumbs()
Undefined variable: tab_root_mapNoticemenu.inc772_menu_translate()
implode(): Invalid arguments passedWarningmenu.inc772_menu_translate()
Undefined variable: tab_parent_mapNoticemenu.inc773_menu_translate()
implode(): Invalid arguments passedWarningmenu.inc773_menu_translate()
Breadcrumb Home » Parent jlbE3qXV found on http://drupaltestbot659-mysql/checkout/?q=node/2/edit.Othermenu.test1051MenuBreadcrumbTestCase->testBreadCrumbs()
Breadcrumb Home » Parent jlbE3qXV found on http://drupaltestbot659-mysql/checkout/?q=node/3.Othermenu.test1068MenuBreadcrumbTestCase->testBreadCrumbs()
Active link Parent jlbE3qXV was found in menu tree, including active trail links .Othermenu.test1068MenuBreadcrumbTestCase->testBreadCrumbs()
Breadcrumb Home » Parent jlbE3qXV found on http://drupaltestbot659-mysql/checkout/?q=node/3/view.Othermenu.test1071MenuBreadcrumbTestCase->testBreadCrumbs()
Active link Parent jlbE3qXV was found in menu tree, including active trail links .Othermenu.test1071MenuBreadcrumbTestCase->testBreadCrumbs()
Breadcrumb Home » Parent jlbE3qXV » Child hDa7oNii found on http://drupaltestbot659-mysql/checkout/?q=node/3/edit.Othermenu.test1078MenuBreadcrumbTestCase->testBreadCrumbs()
LeafCache clear test (CacheClearCase) [Cache]1300
LeafCache emptiness test (CacheIsEmptyCase) [Cache]500
LeafCache saving test (CacheSavingCase) [Cache]500
LeafCancel account (UserCancelTestCase) [User]23700
ExpandCascading stylesheets (CascadingStylesheetsTestCase) [System]2410
MessageGroupFilenameLineFunctionStatus
Query string was appended correctly to css.Othercommon.test784CascadingStylesheetsTestCase->testAddCssFileWithQueryString()
LeafCategorize feed functionality (CategorizeFeedTestCase) [Unknown]1900
LeafCategorize feed item functionality (CategorizeFeedItemTestCase) [Unknown]5300
LeafChecks display of aggregator items (AggregatorRenderingTestCase) [Unknown]6800
LeafCJK tokenizer (SearchTokenizerTestCase) [Search]200
ExpandColor functionality (ColorTestCase) [Color]591214
MessageGroupFilenameLineFunctionStatus
Failed to set field palette[bg] to #123456Othercolor.test66ColorTestCase->_testColor()
Found the requested form fields at admin/appearance/settings/bartikOthercolor.test66ColorTestCase->_testColor()
Undefined offset: 0Noticecolor.test70ColorTestCase->_testColor()
Undefined offset: 0Noticecolor.test72ColorTestCase->_testColor()
file(): Filename cannot be emptyWarningcolor.test72ColorTestCase->_testColor()
join(): Invalid arguments passedWarningcolor.test72ColorTestCase->_testColor()
Make sure the color we changed is in the color stylesheet. (bartik)Othercolor.test73ColorTestCase->_testColor()
Failed to set field palette[bg] to #123456Othercolor.test78ColorTestCase->_testColor()
Found the requested form fields at admin/appearance/settings/bartikOthercolor.test78ColorTestCase->_testColor()
Undefined offset: 0Noticecolor.test82ColorTestCase->_testColor()
file(): Filename cannot be emptyWarningcolor.test82ColorTestCase->_testColor()
join(): Invalid arguments passedWarningcolor.test82ColorTestCase->_testColor()
Make sure the color we changed is in the color stylesheet. (bartik)Othercolor.test83ColorTestCase->_testColor()
Failed to set field palette[link] to #123456Othercolor.test66ColorTestCase->_testColor()
Found the requested form fields at admin/appearance/settings/garlandOthercolor.test66ColorTestCase->_testColor()
Undefined offset: 0Noticecolor.test70ColorTestCase->_testColor()
Undefined offset: 0Noticecolor.test72ColorTestCase->_testColor()
file(): Filename cannot be emptyWarningcolor.test72ColorTestCase->_testColor()
join(): Invalid arguments passedWarningcolor.test72ColorTestCase->_testColor()
Make sure the color we changed is in the color stylesheet. (garland)Othercolor.test73ColorTestCase->_testColor()
Failed to set field palette[link] to #123456Othercolor.test78ColorTestCase->_testColor()
Found the requested form fields at admin/appearance/settings/garlandOthercolor.test78ColorTestCase->_testColor()
Undefined offset: 0Noticecolor.test82ColorTestCase->_testColor()
file(): Filename cannot be emptyWarningcolor.test82ColorTestCase->_testColor()
join(): Invalid arguments passedWarningcolor.test82ColorTestCase->_testColor()
Make sure the color we changed is in the color stylesheet. (garland)Othercolor.test83ColorTestCase->_testColor()
LeafComment actions (CommentActionsTestCase) [Comment]2800
LeafComment approval (CommentApprovalTest) [Comment]15400
LeafComment blocks (CommentBlockFunctionalTest) [Comment]11500
LeafComment count toggle (SearchCommentCountToggleTestCase) [Search]3000
LeafComment fields (CommentFieldsTest) [Comment]8300
ExpandComment interface (CommentInterfaceTest) [Comment]136300
MessageGroupFilenameLineFunctionStatus
Changed environment:array ( 'authenticated' => false, 'comment count' => false, 'form' => 'below', 'user_register' => 1, 'contact' => 'optional', 'comments' => 'open', 'access comments' => 0, 'post comments' => 0, 'skip comment approval' => 1, 'edit own comments' => 0, )Debugcomment.test652CommentInterfaceTest->setEnvironment()
Changed environment:array ( 'authenticated' => true, 'comment count' => false, 'form' => 'below', 'user_register' => 1, 'contact' => 'optional', 'comments' => 'open', 'access comments' => 0, 'post comments' => 0, 'skip comment approval' => 1, 'edit own comments' => 0, )Debugcomment.test652CommentInterfaceTest->setEnvironment()
Changed environment:array ( 'authenticated' => false, 'comment count' => true, 'form' => 'below', 'user_register' => 1, 'contact' => 'optional', 'comments' => 'open', 'access comments' => 0, 'post comments' => 0, 'skip comment approval' => 1, 'edit own comments' => 0, )Debugcomment.test652CommentInterfaceTest->setEnvironment()
Changed environment:array ( 'authenticated' => true, 'comment count' => true, 'form' => 'below', 'user_register' => 1, 'contact' => 'optional', 'comments' => 'open', 'access comments' => 0, 'post comments' => 0, 'skip comment approval' => 1, 'edit own comments' => 0, )Debugcomment.test652CommentInterfaceTest->setEnvironment()
Changed environment:array ( 'authenticated' => false, 'comment count' => false, 'form' => 'below', 'user_register' => 1, 'contact' => 'optional', 'comments' => 'open', 'access comments' => 1, 'post comments' => 0, 'skip comment approval' => 1, 'edit own comments' => 0, )Debugcomment.test652CommentInterfaceTest->setEnvironment()
Changed environment:array ( 'authenticated' => true, 'comment count' => false, 'form' => 'below', 'user_register' => 1, 'contact' => 'optional', 'comments' => 'open', 'access comments' => 1, 'post comments' => 0, 'skip comment approval' => 1, 'edit own comments' => 0, )Debugcomment.test652CommentInterfaceTest->setEnvironment()
Changed environment:array ( 'authenticated' => false, 'comment count' => true, 'form' => 'below', 'user_register' => 1, 'contact' => 'optional', 'comments' => 'open', 'access comments' => 1, 'post comments' => 0, 'skip comment approval' => 1, 'edit own comments' => 0, )Debugcomment.test652CommentInterfaceTest->setEnvironment()
Changed environment:array ( 'authenticated' => true, 'comment count' => true, 'form' => 'below', 'user_register' => 1, 'contact' => 'optional', 'comments' => 'open', 'access comments' => 1, 'post comments' => 0, 'skip comment approval' => 1, 'edit own comments' => 0, )Debugcomment.test652CommentInterfaceTest->setEnvironment()
Changed environment:array ( 'authenticated' => false, 'comment count' => false, 'form' => 'below', 'user_register' => 1, 'contact' => 'optional', 'comments' => 'open', 'access comments' => 0, 'post comments' => 1, 'skip comment approval' => 1, 'edit own comments' => 0, )Debugcomment.test652CommentInterfaceTest->setEnvironment()
Changed environment:array ( 'authenticated' => true, 'comment count' => false, 'form' => 'below', 'user_register' => 1, 'contact' => 'optional', 'comments' => 'open', 'access comments' => 0, 'post comments' => 1, 'skip comment approval' => 1, 'edit own comments' => 0, )Debugcomment.test652CommentInterfaceTest->setEnvironment()
Changed environment:array ( 'authenticated' => false, 'comment count' => true, 'form' => 'below', 'user_register' => 1, 'contact' => 'optional', 'comments' => 'open', 'access comments' => 0, 'post comments' => 1, 'skip comment approval' => 1, 'edit own comments' => 0, )Debugcomment.test652CommentInterfaceTest->setEnvironment()
Changed environment:array ( 'authenticated' => true, 'comment count' => true, 'form' => 'below', 'user_register' => 1, 'contact' => 'optional', 'comments' => 'open', 'access comments' => 0, 'post comments' => 1, 'skip comment approval' => 1, 'edit own comments' => 0, )Debugcomment.test652CommentInterfaceTest->setEnvironment()
Changed environment:array ( 'authenticated' => false, 'comment count' => false, 'form' => 'below', 'user_register' => 1, 'contact' => 'optional', 'comments' => 'open', 'access comments' => 1, 'post comments' => 1, 'skip comment approval' => 1, 'edit own comments' => 0, )Debugcomment.test652CommentInterfaceTest->setEnvironment()
Changed environment:array ( 'authenticated' => true, 'comment count' => false, 'form' => 'below', 'user_register' => 1, 'contact' => 'optional', 'comments' => 'open', 'access comments' => 1, 'post comments' => 1, 'skip comment approval' => 1, 'edit own comments' => 0, )Debugcomment.test652CommentInterfaceTest->setEnvironment()
Changed environment:array ( 'authenticated' => false, 'comment count' => true, 'form' => 'below', 'user_register' => 1, 'contact' => 'optional', 'comments' => 'open', 'access comments' => 1, 'post comments' => 1, 'skip comment approval' => 1, 'edit own comments' => 0, )Debugcomment.test652CommentInterfaceTest->setEnvironment()
Changed environment:array ( 'authenticated' => true, 'comment count' => true, 'form' => 'below', 'user_register' => 1, 'contact' => 'optional', 'comments' => 'open', 'access comments' => 1, 'post comments' => 1, 'skip comment approval' => 1, 'edit own comments' => 0, )Debugcomment.test652CommentInterfaceTest->setEnvironment()
Changed environment:array ( 'authenticated' => false, 'comment count' => false, 'form' => 'separate page', 'user_register' => 1, 'contact' => 'optional', 'comments' => 'open', 'access comments' => 0, 'post comments' => 0, 'skip comment approval' => 1, 'edit own comments' => 0, )Debugcomment.test652CommentInterfaceTest->setEnvironment()
Changed environment:array ( 'authenticated' => true, 'comment count' => false, 'form' => 'separate page', 'user_register' => 1, 'contact' => 'optional', 'comments' => 'open', 'access comments' => 0, 'post comments' => 0, 'skip comment approval' => 1, 'edit own comments' => 0, )Debugcomment.test652CommentInterfaceTest->setEnvironment()
Changed environment:array ( 'authenticated' => false, 'comment count' => true, 'form' => 'separate page', 'user_register' => 1, 'contact' => 'optional', 'comments' => 'open', 'access comments' => 0, 'post comments' => 0, 'skip comment approval' => 1, 'edit own comments' => 0, )Debugcomment.test652CommentInterfaceTest->setEnvironment()
Changed environment:array ( 'authenticated' => true, 'comment count' => true, 'form' => 'separate page', 'user_register' => 1, 'contact' => 'optional', 'comments' => 'open', 'access comments' => 0, 'post comments' => 0, 'skip comment approval' => 1, 'edit own comments' => 0, )Debugcomment.test652CommentInterfaceTest->setEnvironment()
Changed environment:array ( 'authenticated' => false, 'comment count' => false, 'form' => 'separate page', 'user_register' => 1, 'contact' => 'optional', 'comments' => 'open', 'access comments' => 1, 'post comments' => 0, 'skip comment approval' => 1, 'edit own comments' => 0, )Debugcomment.test652CommentInterfaceTest->setEnvironment()
Changed environment:array ( 'authenticated' => true, 'comment count' => false, 'form' => 'separate page', 'user_register' => 1, 'contact' => 'optional', 'comments' => 'open', 'access comments' => 1, 'post comments' => 0, 'skip comment approval' => 1, 'edit own comments' => 0, )Debugcomment.test652CommentInterfaceTest->setEnvironment()
Changed environment:array ( 'authenticated' => false, 'comment count' => true, 'form' => 'separate page', 'user_register' => 1, 'contact' => 'optional', 'comments' => 'open', 'access comments' => 1, 'post comments' => 0, 'skip comment approval' => 1, 'edit own comments' => 0, )Debugcomment.test652CommentInterfaceTest->setEnvironment()
Changed environment:array ( 'authenticated' => true, 'comment count' => true, 'form' => 'separate page', 'user_register' => 1, 'contact' => 'optional', 'comments' => 'open', 'access comments' => 1, 'post comments' => 0, 'skip comment approval' => 1, 'edit own comments' => 0, )Debugcomment.test652CommentInterfaceTest->setEnvironment()
Changed environment:array ( 'authenticated' => false, 'comment count' => false, 'form' => 'separate page', 'user_register' => 1, 'contact' => 'optional', 'comments' => 'open', 'access comments' => 0, 'post comments' => 1, 'skip comment approval' => 1, 'edit own comments' => 0, )Debugcomment.test652CommentInterfaceTest->setEnvironment()
Changed environment:array ( 'authenticated' => true, 'comment count' => false, 'form' => 'separate page', 'user_register' => 1, 'contact' => 'optional', 'comments' => 'open', 'access comments' => 0, 'post comments' => 1, 'skip comment approval' => 1, 'edit own comments' => 0, )Debugcomment.test652CommentInterfaceTest->setEnvironment()
Changed environment:array ( 'authenticated' => false, 'comment count' => true, 'form' => 'separate page', 'user_register' => 1, 'contact' => 'optional', 'comments' => 'open', 'access comments' => 0, 'post comments' => 1, 'skip comment approval' => 1, 'edit own comments' => 0, )Debugcomment.test652CommentInterfaceTest->setEnvironment()
Changed environment:array ( 'authenticated' => true, 'comment count' => true, 'form' => 'separate page', 'user_register' => 1, 'contact' => 'optional', 'comments' => 'open', 'access comments' => 0, 'post comments' => 1, 'skip comment approval' => 1, 'edit own comments' => 0, )Debugcomment.test652CommentInterfaceTest->setEnvironment()
Changed environment:array ( 'authenticated' => false, 'comment count' => false, 'form' => 'separate page', 'user_register' => 1, 'contact' => 'optional', 'comments' => 'open', 'access comments' => 1, 'post comments' => 1, 'skip comment approval' => 1, 'edit own comments' => 0, )Debugcomment.test652CommentInterfaceTest->setEnvironment()
Changed environment:array ( 'authenticated' => true, 'comment count' => false, 'form' => 'separate page', 'user_register' => 1, 'contact' => 'optional', 'comments' => 'open', 'access comments' => 1, 'post comments' => 1, 'skip comment approval' => 1, 'edit own comments' => 0, )Debugcomment.test652CommentInterfaceTest->setEnvironment()
Changed environment:array ( 'authenticated' => false, 'comment count' => true, 'form' => 'separate page', 'user_register' => 1, 'contact' => 'optional', 'comments' => 'open', 'access comments' => 1, 'post comments' => 1, 'skip comment approval' => 1, 'edit own comments' => 0, )Debugcomment.test652CommentInterfaceTest->setEnvironment()
Changed environment:array ( 'authenticated' => true, 'comment count' => true, 'form' => 'separate page', 'user_register' => 1, 'contact' => 'optional', 'comments' => 'open', 'access comments' => 1, 'post comments' => 1, 'skip comment approval' => 1, 'edit own comments' => 0, )Debugcomment.test652CommentInterfaceTest->setEnvironment()
Changed environment:array ( 'authenticated' => false, 'comment count' => false, 'form' => 'below', 'user_register' => 0, 'contact' => 'optional', 'comments' => 'open', 'access comments' => 0, 'post comments' => 0, 'skip comment approval' => 1, 'edit own comments' => 0, )Debugcomment.test652CommentInterfaceTest->setEnvironment()
Changed environment:array ( 'authenticated' => true, 'comment count' => false, 'form' => 'below', 'user_register' => 0, 'contact' => 'optional', 'comments' => 'open', 'access comments' => 0, 'post comments' => 0, 'skip comment approval' => 1, 'edit own comments' => 0, )Debugcomment.test652CommentInterfaceTest->setEnvironment()
Changed environment:array ( 'authenticated' => false, 'comment count' => true, 'form' => 'below', 'user_register' => 0, 'contact' => 'optional', 'comments' => 'open', 'access comments' => 0, 'post comments' => 0, 'skip comment approval' => 1, 'edit own comments' => 0, )Debugcomment.test652CommentInterfaceTest->setEnvironment()
Changed environment:array ( 'authenticated' => true, 'comment count' => true, 'form' => 'below', 'user_register' => 0, 'contact' => 'optional', 'comments' => 'open', 'access comments' => 0, 'post comments' => 0, 'skip comment approval' => 1, 'edit own comments' => 0, )Debugcomment.test652CommentInterfaceTest->setEnvironment()
Changed environment:array ( 'authenticated' => false, 'comment count' => false, 'form' => 'below', 'user_register' => 0, 'contact' => 'optional', 'comments' => 'open', 'access comments' => 1, 'post comments' => 0, 'skip comment approval' => 1, 'edit own comments' => 0, )Debugcomment.test652CommentInterfaceTest->setEnvironment()
Changed environment:array ( 'authenticated' => true, 'comment count' => false, 'form' => 'below', 'user_register' => 0, 'contact' => 'optional', 'comments' => 'open', 'access comments' => 1, 'post comments' => 0, 'skip comment approval' => 1, 'edit own comments' => 0, )Debugcomment.test652CommentInterfaceTest->setEnvironment()
Changed environment:array ( 'authenticated' => false, 'comment count' => true, 'form' => 'below', 'user_register' => 0, 'contact' => 'optional', 'comments' => 'open', 'access comments' => 1, 'post comments' => 0, 'skip comment approval' => 1, 'edit own comments' => 0, )Debugcomment.test652CommentInterfaceTest->setEnvironment()
Changed environment:array ( 'authenticated' => true, 'comment count' => true, 'form' => 'below', 'user_register' => 0, 'contact' => 'optional', 'comments' => 'open', 'access comments' => 1, 'post comments' => 0, 'skip comment approval' => 1, 'edit own comments' => 0, )Debugcomment.test652CommentInterfaceTest->setEnvironment()
Changed environment:array ( 'authenticated' => false, 'comment count' => false, 'form' => 'below', 'user_register' => 0, 'contact' => 'optional', 'comments' => 'open', 'access comments' => 0, 'post comments' => 1, 'skip comment approval' => 1, 'edit own comments' => 0, )Debugcomment.test652CommentInterfaceTest->setEnvironment()
Changed environment:array ( 'authenticated' => true, 'comment count' => false, 'form' => 'below', 'user_register' => 0, 'contact' => 'optional', 'comments' => 'open', 'access comments' => 0, 'post comments' => 1, 'skip comment approval' => 1, 'edit own comments' => 0, )Debugcomment.test652CommentInterfaceTest->setEnvironment()
Changed environment:array ( 'authenticated' => false, 'comment count' => true, 'form' => 'below', 'user_register' => 0, 'contact' => 'optional', 'comments' => 'open', 'access comments' => 0, 'post comments' => 1, 'skip comment approval' => 1, 'edit own comments' => 0, )Debugcomment.test652CommentInterfaceTest->setEnvironment()
Changed environment:array ( 'authenticated' => true, 'comment count' => true, 'form' => 'below', 'user_register' => 0, 'contact' => 'optional', 'comments' => 'open', 'access comments' => 0, 'post comments' => 1, 'skip comment approval' => 1, 'edit own comments' => 0, )Debugcomment.test652CommentInterfaceTest->setEnvironment()
Changed environment:array ( 'authenticated' => false, 'comment count' => false, 'form' => 'below', 'user_register' => 0, 'contact' => 'optional', 'comments' => 'open', 'access comments' => 1, 'post comments' => 1, 'skip comment approval' => 1, 'edit own comments' => 0, )Debugcomment.test652CommentInterfaceTest->setEnvironment()
Changed environment:array ( 'authenticated' => true, 'comment count' => false, 'form' => 'below', 'user_register' => 0, 'contact' => 'optional', 'comments' => 'open', 'access comments' => 1, 'post comments' => 1, 'skip comment approval' => 1, 'edit own comments' => 0, )Debugcomment.test652CommentInterfaceTest->setEnvironment()
Changed environment:array ( 'authenticated' => false, 'comment count' => true, 'form' => 'below', 'user_register' => 0, 'contact' => 'optional', 'comments' => 'open', 'access comments' => 1, 'post comments' => 1, 'skip comment approval' => 1, 'edit own comments' => 0, )Debugcomment.test652CommentInterfaceTest->setEnvironment()
Changed environment:array ( 'authenticated' => true, 'comment count' => true, 'form' => 'below', 'user_register' => 0, 'contact' => 'optional', 'comments' => 'open', 'access comments' => 1, 'post comments' => 1, 'skip comment approval' => 1, 'edit own comments' => 0, )Debugcomment.test652CommentInterfaceTest->setEnvironment()
Changed environment:array ( 'authenticated' => false, 'comment count' => false, 'form' => 'separate page', 'user_register' => 0, 'contact' => 'optional', 'comments' => 'open', 'access comments' => 0, 'post comments' => 0, 'skip comment approval' => 1, 'edit own comments' => 0, )Debugcomment.test652CommentInterfaceTest->setEnvironment()
Changed environment:array ( 'authenticated' => true, 'comment count' => false, 'form' => 'separate page', 'user_register' => 0, 'contact' => 'optional', 'comments' => 'open', 'access comments' => 0, 'post comments' => 0, 'skip comment approval' => 1, 'edit own comments' => 0, )Debugcomment.test652CommentInterfaceTest->setEnvironment()
Changed environment:array ( 'authenticated' => false, 'comment count' => true, 'form' => 'separate page', 'user_register' => 0, 'contact' => 'optional', 'comments' => 'open', 'access comments' => 0, 'post comments' => 0, 'skip comment approval' => 1, 'edit own comments' => 0, )Debugcomment.test652CommentInterfaceTest->setEnvironment()
Changed environment:array ( 'authenticated' => true, 'comment count' => true, 'form' => 'separate page', 'user_register' => 0, 'contact' => 'optional', 'comments' => 'open', 'access comments' => 0, 'post comments' => 0, 'skip comment approval' => 1, 'edit own comments' => 0, )Debugcomment.test652CommentInterfaceTest->setEnvironment()
Changed environment:array ( 'authenticated' => false, 'comment count' => false, 'form' => 'separate page', 'user_register' => 0, 'contact' => 'optional', 'comments' => 'open', 'access comments' => 1, 'post comments' => 0, 'skip comment approval' => 1, 'edit own comments' => 0, )Debugcomment.test652CommentInterfaceTest->setEnvironment()
Changed environment:array ( 'authenticated' => true, 'comment count' => false, 'form' => 'separate page', 'user_register' => 0, 'contact' => 'optional', 'comments' => 'open', 'access comments' => 1, 'post comments' => 0, 'skip comment approval' => 1, 'edit own comments' => 0, )Debugcomment.test652CommentInterfaceTest->setEnvironment()
Changed environment:array ( 'authenticated' => false, 'comment count' => true, 'form' => 'separate page', 'user_register' => 0, 'contact' => 'optional', 'comments' => 'open', 'access comments' => 1, 'post comments' => 0, 'skip comment approval' => 1, 'edit own comments' => 0, )Debugcomment.test652CommentInterfaceTest->setEnvironment()
Changed environment:array ( 'authenticated' => true, 'comment count' => true, 'form' => 'separate page', 'user_register' => 0, 'contact' => 'optional', 'comments' => 'open', 'access comments' => 1, 'post comments' => 0, 'skip comment approval' => 1, 'edit own comments' => 0, )Debugcomment.test652CommentInterfaceTest->setEnvironment()
Changed environment:array ( 'authenticated' => false, 'comment count' => false, 'form' => 'separate page', 'user_register' => 0, 'contact' => 'optional', 'comments' => 'open', 'access comments' => 0, 'post comments' => 1, 'skip comment approval' => 1, 'edit own comments' => 0, )Debugcomment.test652CommentInterfaceTest->setEnvironment()
Changed environment:array ( 'authenticated' => true, 'comment count' => false, 'form' => 'separate page', 'user_register' => 0, 'contact' => 'optional', 'comments' => 'open', 'access comments' => 0, 'post comments' => 1, 'skip comment approval' => 1, 'edit own comments' => 0, )Debugcomment.test652CommentInterfaceTest->setEnvironment()
Changed environment:array ( 'authenticated' => false, 'comment count' => true, 'form' => 'separate page', 'user_register' => 0, 'contact' => 'optional', 'comments' => 'open', 'access comments' => 0, 'post comments' => 1, 'skip comment approval' => 1, 'edit own comments' => 0, )Debugcomment.test652CommentInterfaceTest->setEnvironment()
Changed environment:array ( 'authenticated' => true, 'comment count' => true, 'form' => 'separate page', 'user_register' => 0, 'contact' => 'optional', 'comments' => 'open', 'access comments' => 0, 'post comments' => 1, 'skip comment approval' => 1, 'edit own comments' => 0, )Debugcomment.test652CommentInterfaceTest->setEnvironment()
Changed environment:array ( 'authenticated' => false, 'comment count' => false, 'form' => 'separate page', 'user_register' => 0, 'contact' => 'optional', 'comments' => 'open', 'access comments' => 1, 'post comments' => 1, 'skip comment approval' => 1, 'edit own comments' => 0, )Debugcomment.test652CommentInterfaceTest->setEnvironment()
Changed environment:array ( 'authenticated' => true, 'comment count' => false, 'form' => 'separate page', 'user_register' => 0, 'contact' => 'optional', 'comments' => 'open', 'access comments' => 1, 'post comments' => 1, 'skip comment approval' => 1, 'edit own comments' => 0, )Debugcomment.test652CommentInterfaceTest->setEnvironment()
Changed environment:array ( 'authenticated' => false, 'comment count' => true, 'form' => 'separate page', 'user_register' => 0, 'contact' => 'optional', 'comments' => 'open', 'access comments' => 1, 'post comments' => 1, 'skip comment approval' => 1, 'edit own comments' => 0, )Debugcomment.test652CommentInterfaceTest->setEnvironment()
Changed environment:array ( 'authenticated' => true, 'comment count' => true, 'form' => 'separate page', 'user_register' => 0, 'contact' => 'optional', 'comments' => 'open', 'access comments' => 1, 'post comments' => 1, 'skip comment approval' => 1, 'edit own comments' => 0, )Debugcomment.test652CommentInterfaceTest->setEnvironment()
LeafComment language (LocaleCommentLanguageFunctionalTest) [Locale]5200
LeafComment node access (CommentNodeAccessTest) [Comment]5300
ExpandComment paging settings (CommentPagerTest) [Comment]198100
MessageGroupFilenameLineFunctionStatus
Flat mode, 1 replies: expected page 5, returned page 0.Othercomment.test1258CommentPagerTest->testCommentNewPageIndicator()
Flat mode, 2 replies: expected page 4, returned page 0.Othercomment.test1258CommentPagerTest->testCommentNewPageIndicator()
Flat mode, 3 replies: expected page 3, returned page 0.Othercomment.test1258CommentPagerTest->testCommentNewPageIndicator()
Flat mode, 4 replies: expected page 2, returned page 0.Othercomment.test1258CommentPagerTest->testCommentNewPageIndicator()
Flat mode, 5 replies: expected page 1, returned page 0.Othercomment.test1258CommentPagerTest->testCommentNewPageIndicator()
Threaded mode, 1 replies: expected page 5, returned page 0.Othercomment.test1276CommentPagerTest->testCommentNewPageIndicator()
Threaded mode, 2 replies: expected page 1, returned page 0.Othercomment.test1276CommentPagerTest->testCommentNewPageIndicator()
Threaded mode, 3 replies: expected page 1, returned page 0.Othercomment.test1276CommentPagerTest->testCommentNewPageIndicator()
Threaded mode, 4 replies: expected page 1, returned page 0.Othercomment.test1276CommentPagerTest->testCommentNewPageIndicator()
Threaded mode, 5 replies: expected page 1, returned page 0.Othercomment.test1276CommentPagerTest->testCommentNewPageIndicator()
LeafComment preview (CommentPreviewTest) [Comment]9100
LeafComment Rebuild (CommentContentRebuild) [Comment]3200
LeafComment RSS (CommentRSSUnitTest) [Comment]2400
LeafComment Search tests (SearchCommentTestCase) [Search]18700
LeafComment token replacement (CommentTokenReplaceTestCase) [Comment]6400
LeafConfig settings form (SearchConfigSettingsForm) [Search]11600
LeafConnection tests (DatabaseConnectionTestCase) [Database]3400
LeafContent language settings (LocaleContentFunctionalTest) [Locale]6400
ExpandCron run (CronRunTestCase) [System]4330
MessageGroupFilenameLineFunctionStatus
Cron runs when the cron threshold is passed.Othersystem.test621CronRunTestCase->testAutomaticCron()
New temp file was correctly ignored.Othersystem.test679CronRunTestCase->testTempFileCleanup()
Old permanent file was correctly ignored.Othersystem.test680CronRunTestCase->testTempFileCleanup()
LeafCSS Unit Tests (CascadingStylesheetsUnitTest) [System]1200
LeafCustom query syntax tests (DatabaseQueryTestCase) [Database]600
LeafDashboard blocks (DashboardBlocksTestCase) [Dashboard]10900
LeafData API functions (DrupalDataApiTest) [System]3200
LeafDate and time (DateTimeFunctionalTest) [System]9600
LeafDBLog functionality (DBLogTestCase) [DBLog]44500
LeafDefault text format functionality (FilterDefaultFormatTestCase) [Filter]3300
LeafDelete/Truncate tests (DatabaseDeleteTruncateTestCase) [Database]2000
LeafDrupal error handlers (DrupalErrorHandlerUnitTest) [System]2800
LeafDrupal goto (DrupalGotoTest) [System]1800
LeafDrupal HTTP request (DrupalHTTPRequestTestCase) [System]2700
LeafDrupal match path (DrupalMatchPathTestCase) [Path API]4100
LeafDrupal set/get regions (DrupalSetContentTestCase) [System]4000
ExpandDrupal system listing (DrupalSystemListingTestCase) [System]510
MessageGroupFilenameLineFunctionStatus
Module drupal_system_listing_compatible_test was found at profiles/testing/modules/drupal_system_listing_compatible_test/drupal_system_listing_compatible_test.module.Othercommon.test2126DrupalSystemListingTestCase->testDirectoryPrecedence()
LeafDrupal tags handling (DrupalTagsHandlingTestCase) [System]800
Leafdrupal_add_feed() tests (DrupalAddFeedTestCase) [System]600
Leafdrupal_alter() tests (DrupalAlterTestCase) [System]500
Leafdrupal_render() (DrupalRenderTestCase) [System]4000
LeafElement processing (FormElementTestCase) [Form API]2600
LeafEmbedded forms (SearchEmbedForm) [Search]2900
LeafEmpty statement (DatabaseEmptyStatementTestCase) [Database]400
LeafEnable/disable modules (EnableDisableTestCase) [Module]5600
LeafEntity CRUD hooks (EntityCrudHookTestCase) [Entity API]7200
LeafEntity properties (EntityPropertiesTestCase) [Entity API]300
LeafEntity query (EntityFieldQueryTestCase) [Entity API]10000
LeafFeed parser functionality (FeedParserTestCase) [Unknown]4100
LeafFetch tests (DatabaseFetchTestCase) [Database]3300
LeafFetch tests, part 2 (DatabaseFetch2TestCase) [Database]2600
LeafFetching multiple cache items (CacheGetMultipleUnitTest) [Cache]700
LeafField attach tests (other) (FieldAttachOtherTestCase) [Field API]4800
LeafField attach tests (storage-related) (FieldAttachStorageTestCase) [Field API]8300
LeafField bulk delete tests (FieldBulkDeleteTestCase) [Field API]3900
LeafField CRUD tests (FieldCrudTestCase) [Field API]5900
LeafField Display API tests (FieldDisplayAPITestCase) [Field API]4400
LeafField form tests (FieldFormTestCase) [Field API]23700
LeafField info tests (FieldInfoTestCase) [Field API]7900
LeafField instance CRUD tests (FieldInstanceCrudTestCase) [Field API]3300
LeafField SQL storage tests (FieldSqlStorageTestCase) [Field API]8100
LeafField translations tests (FieldTranslationsTestCase) [Field API]4600
LeafFile copying (FileCopyTest) [File API]10600
LeafFile delete (FileDeleteTest) [File API]1800
ExpandFile download (FileDownloadTest) [File API]2698
MessageGroupFilenameLineFunctionStatus
file_put_contents(private://g7Bq2Gy4): failed to open stream: "DrupalPrivateStreamWrapper::stream_open" call failedWarningfile.test209FileTestCase->createFile()
The test file exists on the disk.Create test filefile.test210FileTestCase->createFile()
filesize(): stat failed for private://g7Bq2Gy4Warningfile.test218FileTestCase->createFile()
Undefined index: x-fooNoticefile.test2239FileDownloadTest->testPrivateFileTransfer()
Found header set by file_test module on private download.Otherfile.test2239FileDownloadTest->testPrivateFileTransfer()
Correctly allowed access to a file when file_test provides headers.Browserfile.test2240FileDownloadTest->testPrivateFileTransfer()
Correctly denied access to a file when file_test sets the header to -1.Browserfile.test2245FileDownloadTest->testPrivateFileTransfer()
file_get_contents(public://...@[]?&+%#,;=:__%23%25%26%2B%2F%3Féøïвβ中國書۞): failed to open stream: "DrupalPublicStreamWrapper::stream_open" call failedWarningfile.test2314FileDownloadTest->checkUrl()
Contents of the file are correct.Otherfile.test2314FileDownloadTest->checkUrl()
file_put_contents(private://...@[]?&+%#,;=:__%23%25%26%2B%2F%3Féøïвβ中國書۞): failed to open stream: "DrupalPrivateStreamWrapper::stream_open" call failedWarningfile.test209FileTestCase->createFile()
The test file exists on the disk.Create test filefile.test210FileTestCase->createFile()
filesize(): stat failed for private:/// -._!$'"()*@[]?&+%#,;=:__%23%25%26%2B%2F%3Féøïвβ中國書۞Warningfile.test218FileTestCase->createFile()
HTTP response expected 200, actual 404Browserfile.test2313FileDownloadTest->checkUrl()
file_put_contents(private://...@[]?&+%#,;=:__%23%25%26%2B%2F%3Féøïвβ中國書۞): failed to open stream: "DrupalPrivateStreamWrapper::stream_open" call failedWarningfile.test209FileTestCase->createFile()
The test file exists on the disk.Create test filefile.test210FileTestCase->createFile()
filesize(): stat failed for private:/// -._!$'"()*@[]?&+%#,;=:__%23%25%26%2B%2F%3Féøïвβ中國書۞Warningfile.test218FileTestCase->createFile()
HTTP response expected 200, actual 404Browserfile.test2313FileDownloadTest->checkUrl()
LeafFile field display tests (FileFieldDisplayTestCase) [File]2100
LeafFile field file path tests (FileFieldPathTestCase) [File]2600
ExpandFile field revision test (FileFieldRevisionTestCase) [File]6710
MessageGroupFilenameLineFunctionStatus
Original file is deleted after deleting the entire node with two revisions remaining.Otherfile.test676FileFieldRevisionTestCase->testRevisions()
LeafFile field validation tests (FileFieldValidateTestCase) [File]12600
LeafFile field widget test (FileFieldWidgetTestCase) [File]20300
LeafFile loading (FileLoadTest) [File API]2900
LeafFile mimetypes (FileMimeTypeTest) [File API]3800
LeafFile moving (FileMoveTest) [File API]10500
LeafFile naming (FileNameMungingTest) [File API]500
LeafFile paths and directories (FileDirectoryTest) [File API]2000
LeafFile save data (FileSaveDataTest) [File API]8800
LeafFile saving (FileSaveTest) [File API]1400
LeafFile scan directory (FileScanDirectoryTest) [File API]2300
LeafFile space used tests (FileSpaceUsedTest) [File API]1100
LeafFile token replacement (FileTokenReplaceTestCase) [File]7200
ExpandFile uploading (FileSaveUploadTest) [File API]237264
MessageGroupFilenameLineFunctionStatus
Can't upload a disallowed extensionOtherfile.test674FileSaveUploadTest->testHandleExtension()
Found the failure message.Otherfile.test675FileSaveUploadTest->testHandleExtension()
Expected hooks validate to be called but validate was not called.Otherfile.test678FileSaveUploadTest->testHandleExtension()
Found the success message.Otherfile.test694FileSaveUploadTest->testHandleExtension()
Expected hooks validate, load, update to be called but validate, load, update was not called.Otherfile.test697FileSaveUploadTest->testHandleExtension()
Found the success message.Otherfile.test711FileSaveUploadTest->testHandleExtension()
Expected hooks validate, load, update to be called but validate, load, update was not called.Otherfile.test714FileSaveUploadTest->testHandleExtension()
Dangerous file was renamed.Otherfile.test733FileSaveUploadTest->testHandleDangerousFile()
Dangerous file's MIME type was changed.Otherfile.test734FileSaveUploadTest->testHandleDangerousFile()
Found the success message.Otherfile.test735FileSaveUploadTest->testHandleDangerousFile()
Expected hooks validate, insert to be called but validate, insert was not called.Otherfile.test738FileSaveUploadTest->testHandleDangerousFile()
Dangerous file was not renamed when insecure uploads is TRUE.Otherfile.test749FileSaveUploadTest->testHandleDangerousFile()
Found the success message.Otherfile.test750FileSaveUploadTest->testHandleDangerousFile()
Expected hooks validate, insert to be called but validate, insert was not called.Otherfile.test753FileSaveUploadTest->testHandleDangerousFile()
Trying to get property of non-objectNoticefile.test772FileSaveUploadTest->testHandleFileMunge()
Trying to get property of non-objectNoticefile.test776FileSaveUploadTest->testHandleFileMunge()
Found security message.Otherfile.test782FileSaveUploadTest->testHandleFileMunge()
File was successfully munged.Otherfile.test783FileSaveUploadTest->testHandleFileMunge()
Found the success message.Otherfile.test784FileSaveUploadTest->testHandleFileMunge()
Expected hooks validate, insert to be called but validate, insert was not called.Otherfile.test787FileSaveUploadTest->testHandleFileMunge()
Trying to get property of non-objectNoticefile.test794FileSaveUploadTest->testHandleFileMunge()
Trying to get property of non-objectNoticefile.test801FileSaveUploadTest->testHandleFileMunge()
File was not munged when allowing any extension.Otherfile.test801FileSaveUploadTest->testHandleFileMunge()
Found the success message.Otherfile.test802FileSaveUploadTest->testHandleFileMunge()
Expected hooks validate, insert to be called but validate, insert was not called.Otherfile.test805FileSaveUploadTest->testHandleFileMunge()
Found the success message.Otherfile.test818FileSaveUploadTest->testExistingRename()
Expected hooks validate, insert to be called but validate, insert was not called.Otherfile.test821FileSaveUploadTest->testExistingRename()
Found the success message.Otherfile.test834FileSaveUploadTest->testExistingReplace()
Expected hooks validate, load, update to be called but validate, load, update was not called.Otherfile.test837FileSaveUploadTest->testExistingReplace()
Found the failure message.Otherfile.test850FileSaveUploadTest->testExistingError()
LeafFile URL rewriting (FileURLRewritingTest) [File]2100
LeafFile usage (FileUsageTest) [File]2800
LeafFile validate (FileValidateTest) [File API]1100
LeafFile validator tests (FileValidatorTest) [File API]2700
ExpandFileTransfer unit tests (FileTranferTest) [System]203
MessageGroupFilenameLineFunctionStatus
mkdir(): File existsWarningstream_wrappers.inc627DrupalLocalStreamWrapper->mkdir()
mkdir(): File existsWarningstream_wrappers.inc627DrupalLocalStreamWrapper->mkdir()
mkdir(): File existsWarningstream_wrappers.inc627DrupalLocalStreamWrapper->mkdir()
LeafFilter administration functionality (FilterAdminTestCase) [Filter]16400
LeafFilter CRUD operations (FilterCRUDTestCase) [Filter]21400
LeafFilter format access (FilterFormatAccessTestCase) [Filter]24400
LeafFilter format hooks (FilterHooksTestCase) [Filter]3200
LeafFilter module filters (FilterUnitTestCase) [Filter]20900
LeafFingerprinting meta tag (AdminMetaTagTestCase) [System]300
ExpandFlood control mechanism (FloodFunctionalTest) [System]610
MessageGroupFilenameLineFunctionStatus
Value false is TRUE.Othersystem.test1899FloodFunctionalTest->testCleanUp()
LeafForm alter hooks (FormAlterTestCase) [Form API]300
ExpandForm API checkbox (FormCheckboxTestCase) [Form API]001
MessageGroupFilenameLineFunctionStatus
PDOException: SQLSTATE[42000]: Syntax error or access violation: 1064 You have an error in your SQL syntax; check the manual that corresponds to your MySQL server version for the right syntax to use near ') ORDER BY fit DESC LIMIT 0, 1' at line 1: SELECT * FROM {menu_router} WHERE path IN () ORDER BY fit DESC LIMIT 0, 1; Array ( ) in menu_get_item() (line 445 of /var/lib/drupaltestbot/sites/default/files/checkout/includes/menu.inc).Uncaught exceptiondatabase.inc2038PDOStatement->execute()
LeafForm API file inclusion (FormsFileInclusionTestCase) [Form API]900
LeafForm element and label output test (FormsElementsLabelsTestCase) [Form API]1500
LeafForm element validation (FormsTestCase) [Form API]27000
LeafForm rebuilding (FormsRebuildTestCase) [Form API]5000
LeafForm state values clearance (FormStateValuesCleanTestCase) [Form API]1300
LeafForm triggering element determination (FormsTriggeringElementTestCase) [Form API]4800
LeafForm validation handlers (FormValidationTestCase) [Form API]4700
LeafForm wrapper callback (FormsFormWrapperTestCase) [Form API]400
LeafFormat date (FormatDateUnitTest) [System]6100
ExpandForum functionality (ForumTestCase) [Forum]60440
MessageGroupFilenameLineFunctionStatus
Forum topic was not createdOtherforum.test368ForumTestCase->createForumTopic()
Error message was shownOtherforum.test369ForumTestCase->createForumTopic()
Forum topic was not createdOtherforum.test368ForumTestCase->createForumTopic()
Error message was shownOtherforum.test369ForumTestCase->createForumTopic()
LeafFront page (FrontPageTestCase) [System]3600
LeafGet filename test (BootstrapGetFilenameTestCase) [Bootstrap]400
LeafGraph (GraphUnitTest) [System]2800
LeafHelp functionality (HelpTestCase) [Help]30800
LeafHTML Attributes (DrupalAttributesUnitTest) [System]600
LeafHTML identifiers (DrupalHTMLIdentifierTestCase) [System]1000
LeafHTML in page titles (PageTitleFiltering) [System]4000
LeafHTTP file retrieval (RetrieveFileTestCase) [System]700
LeafImage effects (ImageEffectsUnitTest) [Image]3300
LeafImage field display tests (ImageFieldDisplayTestCase) [Image]13400
LeafImage field validation tests (ImageFieldValidateTestCase) [Image]1800
LeafImage GD manipulation tests (ImageToolkitGdTestCase) [Image]100
LeafImage styles and effects UI configuration (ImageAdminStylesUnitTest) [Image]16700
ExpandImage styles path and URL functions (ImageStylesPathAndUrlUnitTest) [Image]22244
MessageGroupFilenameLineFunctionStatus
Image was generated at the URL.Browserimage.test205ImageStylesPathAndUrlUnitTest->_testImageStyleUrlAndPath()
Generated file does exist after we accessed it.Otherimage.test206ImageStylesPathAndUrlUnitTest->_testImageStyleUrlAndPath()
file_get_contents(public://styles/style_foo/public/image-test_3.png): failed to open stream: "DrupalPublicStreamWrapper::stream_open" call failedWarningimage.test207ImageStylesPathAndUrlUnitTest->_testImageStyleUrlAndPath()
URL returns expected file.Otherimage.test207ImageStylesPathAndUrlUnitTest->_testImageStyleUrlAndPath()
Expected Content-Type was reported.Otherimage.test209ImageStylesPathAndUrlUnitTest->_testImageStyleUrlAndPath()
Expected Content-Length was reported.Otherimage.test210ImageStylesPathAndUrlUnitTest->_testImageStyleUrlAndPath()
Created the directory for the generated images for the test style.Otherimage.test182ImageStylesPathAndUrlUnitTest->_testImageStyleUrlAndPath()
Created the generated image file.Otherimage.test192ImageStylesPathAndUrlUnitTest->_testImageStyleUrlAndPath()
Image was generated at the URL.Browserimage.test205ImageStylesPathAndUrlUnitTest->_testImageStyleUrlAndPath()
Generated file does exist after we accessed it.Otherimage.test206ImageStylesPathAndUrlUnitTest->_testImageStyleUrlAndPath()
file_get_contents(private://styles/style_foo/private/): failed to open stream: "DrupalPrivateStreamWrapper::stream_open" call failedWarningimage.test207ImageStylesPathAndUrlUnitTest->_testImageStyleUrlAndPath()
URL returns expected file.Otherimage.test207ImageStylesPathAndUrlUnitTest->_testImageStyleUrlAndPath()
Expected Content-Type was reported.Otherimage.test209ImageStylesPathAndUrlUnitTest->_testImageStyleUrlAndPath()
Expected custom header has been added.Otherimage.test212ImageStylesPathAndUrlUnitTest->_testImageStyleUrlAndPath()
Image was generated at the URL.Browserimage.test205ImageStylesPathAndUrlUnitTest->_testImageStyleUrlAndPath()
Generated file does exist after we accessed it.Otherimage.test206ImageStylesPathAndUrlUnitTest->_testImageStyleUrlAndPath()
file_get_contents(public://styles/style_foo/public/image-test_11.png): failed to open stream: "DrupalPublicStreamWrapper::stream_open" call failedWarningimage.test207ImageStylesPathAndUrlUnitTest->_testImageStyleUrlAndPath()
URL returns expected file.Otherimage.test207ImageStylesPathAndUrlUnitTest->_testImageStyleUrlAndPath()
Expected Content-Type was reported.Otherimage.test209ImageStylesPathAndUrlUnitTest->_testImageStyleUrlAndPath()
Expected Content-Length was reported.Otherimage.test210ImageStylesPathAndUrlUnitTest->_testImageStyleUrlAndPath()
Created the directory for the generated images for the test style.Otherimage.test182ImageStylesPathAndUrlUnitTest->_testImageStyleUrlAndPath()
Created the generated image file.Otherimage.test192ImageStylesPathAndUrlUnitTest->_testImageStyleUrlAndPath()
Image was generated at the URL.Browserimage.test205ImageStylesPathAndUrlUnitTest->_testImageStyleUrlAndPath()
Generated file does exist after we accessed it.Otherimage.test206ImageStylesPathAndUrlUnitTest->_testImageStyleUrlAndPath()
file_get_contents(private://styles/style_foo/private/): failed to open stream: "DrupalPrivateStreamWrapper::stream_open" call failedWarningimage.test207ImageStylesPathAndUrlUnitTest->_testImageStyleUrlAndPath()
URL returns expected file.Otherimage.test207ImageStylesPathAndUrlUnitTest->_testImageStyleUrlAndPath()
Expected Content-Type was reported.Otherimage.test209ImageStylesPathAndUrlUnitTest->_testImageStyleUrlAndPath()
Expected custom header has been added.Otherimage.test212ImageStylesPathAndUrlUnitTest->_testImageStyleUrlAndPath()
LeafImage toolkit tests (ImageToolkitUnitTest) [Image]4400
LeafImport feeds from OPML functionality (ImportOPMLTestCase) [Unknown]5300
LeafInfo file format parser (InfoFileParserTestCase) [System]900
LeafInsert tests (DatabaseInsertTestCase) [Database]4500
LeafInsert tests, default fields (DatabaseInsertDefaultsTestCase) [Database]1900
LeafInsert tests, LOB fields (DatabaseInsertLOBTestCase) [Database]1300
LeafInvalid data (DatabaseInvalidDataTestCase) [Database]700
LeafIP address and HTTP_HOST test (BootstrapIPAddressTestCase) [Bootstrap]1100
LeafIP address blocking (IPAddressBlockingTestCase) [System]4200
ExpandJavaScript (JavaScriptTestCase) [System]4110
MessageGroupFilenameLineFunctionStatus
Query string was appended correctly to js.Othercommon.test1452JavaScriptTestCase->testAddJsFileWithQueryString()
LeafJSON (DrupalJSONTest) [System]1400
LeafKeywords and conditions (SearchKeywordsConditions) [Search]2500
LeafLanguage configuration (LocaleConfigurationTest) [Locale]8100
LeafLanguage switching (LocaleLanguageSwitchingFunctionalTest) [Locale]2500
LeafLinks (ThemeLinksUnitTest) [Theme]1700
ExpandList field (ListFieldTestCase) [Field types]001
MessageGroupFilenameLineFunctionStatus
PDOException: SQLSTATE[42000]: Syntax error or access violation: 1064 You have an error in your SQL syntax; check the manual that corresponds to your MySQL server version for the right syntax to use near ') ORDER BY fit DESC LIMIT 0, 1' at line 1: SELECT * FROM {menu_router} WHERE path IN () ORDER BY fit DESC LIMIT 0, 1; Array ( ) in menu_get_item() (line 445 of /var/lib/drupaltestbot/sites/default/files/checkout/includes/menu.inc).Uncaught exceptiondatabase.inc2038PDOStatement->execute()
LeafList field UI (ListFieldUITestCase) [Field types]20300
LeafLoad multiple nodes (NodeLoadMultipleUnitTest) [Node]3600
LeafLocale uninstall (EN) (LocaleUninstallFunctionalTest) [Locale]3100
LeafLocale uninstall (FR) (LocaleUninstallFrenchFunctionalTest) [Locale]3100
LeafLocalize date formats (LocaleDateFormatsFunctionalTest) [Locale]3500
LeafLocking framework tests (LockFunctionalTest) [System]1700
LeafMail system (MailTestCase) [System]100
LeafMain content rendering fallback (SystemMainContentFallback) [System]6600
LeafManage display (FieldUIManageDisplayTestCase) [Field UI]8100
LeafManage fields (FieldUIManageFieldsTestCase) [Field UI]19000
LeafManaged file element test (FileManagedFileElementTestCase) [File]46300
LeafMenu link creation/deletion (MenuTestCase) [Menu]64400
LeafMenu links (MenuLinksUnitTestCase) [Menu]5000
LeafMenu rebuild test (MenuRebuildTestCase) [Menu]500
LeafMenu router (MenuRouterTestCase) [Menu]20100
LeafMenu settings for nodes (MenuNodeTestCase) [Menu]4700
LeafMenu tree generation (MenuTreeDataTestCase) [Menu]400
LeafMerge tests (DatabaseMergeTestCase) [Database]7500
LeafMiscellaneous AJAX tests (AJAXElementValidation) [AJAX]800
LeafMiscellaneous bootstrap unit tests (BootstrapMiscTestCase) [Bootstrap]100
LeafMissing update dependencies (UpdateDependencyMissingTestCase) [Update API]300
ExpandModule API (ModuleUnitTest) [Module]6804
MessageGroupFilenameLineFunctionStatus
array_merge(): Argument #2 is not an arrayWarningbootstrap.inc887variable_write_cache()
array_key_exists() expects parameter 2 to be array, null givenWarningbootstrap.inc894variable_write_cache()
array_merge(): Argument #2 is not an arrayWarningbootstrap.inc887variable_write_cache()
array_key_exists() expects parameter 2 to be array, null givenWarningbootstrap.inc894variable_write_cache()
ExpandModule dependencies (ModuleDependencyTestCase) [Module]15802
MessageGroupFilenameLineFunctionStatus
array_merge(): Argument #2 is not an arrayWarningbootstrap.inc887variable_write_cache()
array_key_exists() expects parameter 2 to be array, null givenWarningbootstrap.inc894variable_write_cache()
LeafModule installation (ModuleInstallTestCase) [Module]200
LeafModule uninstallation (ModuleUninstallTestCase) [Module]100
LeafModule versions (ModuleVersionTestCase) [Module]5000
LeafMultilingual fields (LocaleMultilingualFieldsFunctionalTest) [Locale]6000
LeafMultistep form using form storage (FormsFormStorageTestCase) [Form API]11500
LeafMultistep node form basic options (MultiStepNodeFormBasicOptionsTest) [Node]1500
LeafNew default theme blocks (NewDefaultThemeBlocks) [Block]2400
LeafNo help (NoHelpTestCase) [Help]1100
LeafNode access (NodeAccessUnitTest) [Node]3100
LeafNode access rebuild (NodeAccessRebuildTestCase) [Node]1600
LeafNode access records (NodeAccessRecordsUnitTest) [Node]2300
LeafNode administration (NodeAdminTestCase) [Node]14200
LeafNode blocks (NodeBlockFunctionalTest) [Node]8300
LeafNode creation (NodeCreationTestCase) [Node]2500
LeafNode edit (PageEditTestCase) [Node]9300
LeafNode edit permissions (PageViewTestCase) [Node]3200
LeafNode entity query alter (NodeEntityFieldQueryAlter) [Node]3000
LeafNode feed (NodeFeedTestCase) [Node]100
LeafNode load hooks (NodeLoadHooksTestCase) [Node]400
LeafNode post information display (NodePostSettingsTestCase) [Node]3400
LeafNode preview (PagePreviewTestCase) [Node]3500
LeafNode query alter (NodeQueryAlter) [Node]7900
LeafNode revisions (NodeRevisionsTestCase) [Node]4400
LeafNode RSS Content (NodeRSSContentTestCase) [Node]1600
LeafNode save (NodeSaveTestCase) [Node]3900
LeafNode title (NodeTitleTestCase) [Node]2000
LeafNode title XSS filtering (NodeTitleXSSTestCase) [Node]2000
LeafNode token replacement (NodeTokenReplaceTestCase) [Node]3400
LeafNode type persist (NodeTypePersistenceTestCase) [Node]6200
LeafNode types (NodeTypeTestCase) [Node]11300
LeafNon default theme admin (NonDefaultBlockAdmin) [Block]1000
LeafNumber field (NumberFieldTestCase) [Field types]1500
LeafOpenID account registration (OpenIDRegistrationTestCase) [OpenID]14200
LeafOpenID discovery and login (OpenIDFunctionalTestCase) [OpenID]25800
LeafOpenID helper functions (OpenIDUnitTest) [OpenID]3200
LeafOptions widgets (OptionsWidgetsTestCase) [Field types]28800
LeafOverriding server variables (BootstrapOverrideServerVariablesTestCase) [Bootstrap]600
LeafPage cache test (BootstrapPageCacheTestCase) [Bootstrap]7800
LeafPager query tests (DatabaseSelectPagerDefaultTestCase) [Database]4200
LeafParsing .info files (ParseInfoFilesTestCase) [System]300
LeafPassword hashing (PasswordHashingTest) [System]1000
LeafPath alias functionality (PathTestCase) [Path]10200
LeafPath aliases with languages (PathLanguageUITestCase) [Path]6900
LeafPath aliases with translated nodes (PathLanguageTestCase) [Path]6300
LeafPath language settings (LocalePathFunctionalTest) [Locale]4900
LeafPath lookup (PathLookupTest) [Path API]1700
LeafPaths on non-English monolingual sites (PathMonolingualTestCase) [Path]3400
LeafPersonal contact form (ContactPersonalTestCase) [Contact]14200
LeafPHP filter access check (PHPAccessTestCase) [PHP]3700
LeafPHP filter functionality (PHPFilterTestCase) [PHP]4100
LeafPoll add choice (PollJSAddChoice) [Poll]1500
LeafPoll create (PollCreateTestCase) [Poll]14300
ExpandPoll expiration (PollExpirationTestCase) [Poll]2601
MessageGroupFilenameLineFunctionStatus
PDOException: SQLSTATE[42000]: Syntax error or access violation: 1064 You have an error in your SQL syntax; check the manual that corresponds to your MySQL server version for the right syntax to use near ') ORDER BY fit DESC LIMIT 0, 1' at line 1: SELECT * FROM {menu_router} WHERE path IN () ORDER BY fit DESC LIMIT 0, 1; Array ( ) in menu_get_item() (line 445 of /var/lib/drupaltestbot/sites/default/files/checkout/includes/menu.inc).Uncaught exceptiondatabase.inc2038PDOStatement->execute()
LeafPoll token replacement (PollTokenReplaceTestCase) [Poll]11000
LeafPoll vote (PollVoteTestCase) [Poll]11700
LeafProfile browsing (ProfileTestBrowsing) [Profile]6400
ExpandProgrammatic form submissions (FormsProgrammaticTestCase) [Form API]001
MessageGroupFilenameLineFunctionStatus
PDOException: SQLSTATE[42000]: Syntax error or access violation: 1064 You have an error in your SQL syntax; check the manual that corresponds to your MySQL server version for the right syntax to use near ') ORDER BY fit DESC LIMIT 0, 1' at line 1: SELECT * FROM {menu_router} WHERE path IN () ORDER BY fit DESC LIMIT 0, 1; Array ( ) in menu_get_item() (line 445 of /var/lib/drupaltestbot/sites/default/files/checkout/includes/menu.inc).Uncaught exceptiondatabase.inc2038PDOStatement->execute()
LeafQuery altering tests (DatabaseAlterTestCase) [Database]5500
LeafQuery logging (DatabaseLoggingTestCase) [Database]3800
LeafQuery tagging tests (DatabaseTaggingTestCase) [Database]2800
LeafQueue functionality (QueueTestCase) [System]700
LeafRange query test (DatabaseRangeQueryTestCase) [Database]200
LeafRDF comment mapping (RdfCommentAttributesTestCase) [RDF]20400
LeafRDF mapping CRUD functions (RdfCrudTestCase) [RDF]900
LeafRDF mapping definition functionality (RdfMappingDefinitionTestCase) [RDF]5800
LeafRDF mapping hook (RdfMappingHookTestCase) [RDF]500
LeafRDF namespaces (RdfGetRdfNamespacesTestCase) [RDF]400
LeafRDF namespaces XML serialization tests (DrupalGetRdfNamespacesTestCase) [System]600
LeafRDF tracker page mapping (RdfTrackerAttributesTestCase) [RDF]3200
LeafRDFa markup (RdfRdfaMarkupTestCase) [RDF]2700
LeafRebuild arbitrary forms (FormsArbitraryRebuildTestCase) [Form API]1400
ExpandRebuild content (NodeBuildContent) [Node]001
MessageGroupFilenameLineFunctionStatus
PDOException: SQLSTATE[42000]: Syntax error or access violation: 1064 You have an error in your SQL syntax; check the manual that corresponds to your MySQL server version for the right syntax to use near ') ORDER BY fit DESC LIMIT 0, 1' at line 1: SELECT * FROM {menu_router} WHERE path IN () ORDER BY fit DESC LIMIT 0, 1; Array ( ) in menu_get_item() (line 445 of /var/lib/drupaltestbot/sites/default/files/checkout/includes/menu.inc).Uncaught exceptiondatabase.inc2038PDOStatement->execute()
LeafRegistry parse file test (RegistryParseFileTestCase) [System]200
LeafRegistry parse files test (RegistryParseFilesTestCase) [System]600
LeafRegression tests (DatabaseRegressionTestCase) [Database]2700
LeafRemove feed functionality (RemoveFeedTestCase) [Unknown]2300
LeafRemove feed item functionality (RemoveFeedItemTestCase) [Unknown]19600
LeafRequired modules (ModuleRequiredTestCase) [Module]1800
LeafRequirements hook failure (HookRequirementsTestCase) [Module]1500
LeafResettable static variables test (BootstrapResettableStaticTestCase) [Bootstrap]500
LeafRole assignment (UserRolesAssignmentTestCase) [User]5300
LeafRole permissions (UserPermissionsTestCase) [User]5000
LeafSchema API (SchemaTestCase) [Database]58800
LeafSearch engine phrase queries (SearchExactTestCase) [Search]2200
LeafSearch engine queries (SearchMatchTestCase) [Search]14400
ExpandSearch engine ranking (SearchRankingTestCase) [Search]5730
MessageGroupFilenameLineFunctionStatus
Search ranking "recent" order.Othersearch.test443SearchRankingTestCase->testRankings()
Search ranking "comments" order.Othersearch.test443SearchRankingTestCase->testRankings()
Search ranking "views" order.Othersearch.test443SearchRankingTestCase->testRankings()
LeafSearch excerpt extraction (SearchExcerptTestCase) [Search]1100
LeafSearch expression insert/extract (SearchExpressionInsertExtractTestCase) [Search]2400
LeafSearch language selection (SearchLanguageTestCase) [Search]4500
LeafSearch number matching (SearchNumberMatchingTestCase) [Search]29200
LeafSearch numbers (SearchNumbersTestCase) [Search]17200
LeafSearch page override (SearchPageOverride) [Search]1200
LeafSearch page text (SearchPageText) [Search]2900
LeafSearch simplify (SearchSimplifyTestCase) [Search]65100
LeafSecurity (FilterSecurityTestCase) [Filter]2600
LeafSelect tests (DatabaseSelectTestCase) [Database]11700
LeafSelect tests, complex (DatabaseSelectComplexTestCase) [Database]12300
LeafSelect tests, complex 2 (DatabaseSelectComplexTestCase2) [Database]1400
LeafSelect tests, ordered (DatabaseSelectOrderedTestCase) [Database]2600
LeafSelect tests, subqueries (DatabaseSelectSubqueryTestCase) [Database]3600
LeafSequences API (DatabaseNextIdCase) [Database]200
LeafSerialize query (DatabaseSerializeQueryTestCase) [Database]600
LeafSession https handling (SessionHttpsTestCase) [Session]8200
LeafSession tests (SessionTestCase) [Session]18700
LeafShortcut link functionality (ShortcutLinksTestCase) [Shortcut]10300
LeafShortcut set functionality (ShortcutSetsTestCase) [Shortcut]15300
LeafShutdown functions (ShutdownFunctionsTest) [System]400
LeafSimpleTest browser (SimpleTestBrowserTestCase) [SimpleTest]1600
LeafSimpleTest e-mail capturing (SimpleTestMailCaptureTestCase) [SimpleTest]1300
LeafSimpleTest error collector (DrupalErrorCollectionUnitTest) [SimpleTest]1500
LeafSimpleTest functionality (SimpleTestFunctionalTest) [SimpleTest]11400
LeafSite maintenance mode functionality (SiteMaintenanceTestCase) [System]8000
LeafSite-wide contact form (ContactSitewideTestCase) [Contact]23700
LeafSize parsing test (CommonSizeTestCase) [System]3500
LeafStatistics logging tests (StatisticsLoggingTestCase) [Statistics]2500
LeafStatistics reports tests (StatisticsReportsTestCase) [Statistics]8000
LeafStatistics token replacement (StatisticsTokenReplaceTestCase) [Statistics]2900
ExpandStream wrappers (StreamWrapperTest) [File API]1410
MessageGroupFilenameLineFunctionStatus
Expected default directory path was returned.Otherfile.test2604StreamWrapperTest->testUriFunctions()
LeafString filtering tests (CommonXssUnitTest) [System]900
LeafString translate, search and validate (LocaleTranslationFunctionalTest) [Locale]25000
LeafString translation using st() (LocaleInstallTest) [Locale]100
LeafSummary length (SummaryLengthTestCase) [Node]1500
LeafSyslog functionality (SyslogTestCase) [Syslog]1600
LeafSystem info alter (SystemInfoAlterTestCase) [System]1000
LeafTableselect form element type test (FormsElementsTableSelectFunctionalTest) [Form API]5200
LeafTablesort query tests (DatabaseSelectTableSortDefaultTestCase) [Database]4100
LeafTaxonomy term functions and forms. (TaxonomyTermTestCase) [Taxonomy]16800
LeafTaxonomy term hooks (TaxonomyHooksTestCase) [Taxonomy]1900
LeafTaxonomy term multiple loading (TaxonomyLoadMultipleUnitTest) [Taxonomy]1700
LeafTaxonomy term reference field (TaxonomyTermFieldTestCase) [Taxonomy]3600
LeafTaxonomy term unit tests (TaxonomyTermUnitTest) [Taxonomy]100
LeafTaxonomy term URL aliases (PathTaxonomyTermTestCase) [Path]3400
LeafTaxonomy theme switching (TaxonomyThemeTestCase) [Taxonomy]1700
LeafTaxonomy token replacement (TaxonomyTokenReplaceTestCase) [Taxonomy]5300
LeafTaxonomy vocabularies (TaxonomyVocabularyUnitTest) [Taxonomy]6100
LeafTaxonomy vocabulary interface (TaxonomyVocabularyFunctionalTest) [Taxonomy]9700
LeafTemporary query test (DatabaseTemporaryQueryTestCase) [Database]500
LeafTest date field (ProfileTestDate) [Profile]9800
LeafTest field weights (ProfileTestWeights) [Profile]5300
LeafTest for legacy node bug. (TaxonomyLegacyTestCase) [Taxonomy]1300
LeafTest select field (ProfileTestSelect) [Profile]4500
LeafTest single fields (ProfileTestFields) [Profile]21500
ExpandTest statistics admin. (StatisticsAdminTestCase) [Statistics]10310
MessageGroupFilenameLineFunctionStatus
No hit URL found.Otherstatistics.test391StatisticsAdminTestCase->testExpiredLogs()
LeafTest user actions (TriggerUserActionTestCase) [Trigger]6500
LeafTest user triggers (TriggerUserTokenTestCase) [Trigger]18500
LeafTesting SimpleTest setUp (SimpleTestFolderTestCase) [SimpleTest]100
LeafText field (TextFieldTestCase) [Field types]19700
LeafText summary (TextSummaryTestCase) [Field types]13800
LeafText translation (TextTranslationTestCase) [Field types]10400
LeafTheme API (ThemeUnitTest) [Theme]1600
LeafTheme fast initialization (ThemeFastTestCase) [Theme]1000
LeafTheme initialization in hook_init() (ThemeHookInitUnitTest) [Theme]400
LeafTheme interface functionality (SystemThemeFunctionalTest) [System]6600
LeafTheme item list (ThemeItemListUnitTest) [Theme]100
LeafTheme Table (ThemeTableUnitTest) [Theme]600
LeafTimer test (BootstrapTimerTestCase) [Bootstrap]500
LeafToken replacement (TokenReplaceTestCase) [System]2700
LeafTop visitor blocking (StatisticsBlockVisitorsTestCase) [Statistics]4500
LeafTracker (TrackerTest) [Tracker]22200
LeafTransaction tests (DatabaseTransactionTestCase) [Database]3100
LeafTranslation export (LocaleExportFunctionalTest) [Locale]2900
LeafTranslation functionality (TranslationTestCase) [Translation]45000
LeafTranslation import (LocaleImportFunctionalTest) [Locale]11600
LeafTrigger content (node) actions (TriggerContentTestCase) [Trigger]35300
LeafTrigger cron (system) actions (TriggerCronTestCase) [Trigger]3300
LeafTrigger orphaned actions (TriggerOrphanedActionsTestCase) [Trigger]3700
LeafTrigger other actions (TriggerOtherTestCase) [Trigger]11200
LeafUI language negotiation (LocaleUILanguageNegotiationTest) [Locale]7300
LeafUnassigned text format functionality (FilterNoFormatTestCase) [Filter]100
LeafUnicode handling (UnicodeUnitTest) [System]17600
LeafUnmanaged file copying (FileUnmanagedCopyTest) [File API]3100
LeafUnmanaged file delete (FileUnmanagedDeleteTest) [File API]800
LeafUnmanaged file moving (FileUnmanagedMoveTest) [File API]2200
LeafUnmanaged file save data (FileUnmanagedSaveDataTest) [File API]700
LeafUnmanaged recursive file delete (FileUnmanagedDeleteRecursiveTest) [File API]1700
LeafUpdate contrib functionality (UpdateTestContribCase) [Update]18100
LeafUpdate core functionality (UpdateCoreTestCase) [Update]16000
LeafUpdate dependency hook invocation (UpdateDependencyHookInvocationTestCase) [Update API]300
LeafUpdate dependency ordering (UpdateDependencyOrderingTestCase) [Update API]300
LeafUpdate feed functionality (UpdateFeedTestCase) [Unknown]7400
LeafUpdate feed item functionality (UpdateFeedItemTestCase) [Unknown]6100
LeafUpdate functionality (UpdateScriptFunctionalTest) [System]5600
LeafUpdate on cron functionality (AggregatorCronTestCase) [Unknown]5300
LeafUpdate tests (DatabaseUpdateTestCase) [Database]4100
LeafUpdate tests, Complex (DatabaseUpdateComplexTestCase) [Database]5200
LeafUpdate tests, LOB (DatabaseUpdateLOBTestCase) [Database]1300
LeafUpload and extract module functionality (UpdateTestUploadCase) [Update]6100
LeafUpload user picture (UserPictureTestCase) [User]8900
LeafURL altering (UrlAlterFunctionalTest) [Path API]2800
LeafURL generation tests (CommonURLUnitTest) [System]5600
LeafURL rewriting (LocaleUrlRewritingTest) [Locale]3200
LeafUser account links (UserAccountLinksUnitTests) [User]2100
LeafUser administration (UserAdminTestCase) [User]6500
LeafUser autocompletion (UserAutocompleteTestCase) [User]2800
LeafUser blocks (UserBlocksUnitTests) [User]4300
LeafUser create (UserCreateTestCase) [User]2700
LeafUser creation (LocaleUserCreationTest) [Locale]6800
LeafUser edit (UserEditTestCase) [User]6800
LeafUser edited own account (UserEditedOwnAccountTestCase) [User]2300
LeafUser language settings (LocaleUserLanguageFunctionalTest) [Locale]5100
LeafUser login (UserLoginTestCase) [User]17100
LeafUser poll vote capability. (PollVoteCheckHostname) [Poll]13100
LeafUser registration (UserRegistrationTestCase) [User]11900
LeafUser role administration (UserRoleAdminTestCase) [User]5300
LeafUser save test (UserSaveTestCase) [User]300
LeafUser search (UserUserSearchTestCase) [User]3800
LeafUser signatures (UserSignatureTestCase) [User]4500
LeafUser time zones (UserTimeZoneFunctionalTest) [User]3100
LeafUser token replacement (UserTokenReplaceTestCase) [User]4300
LeafUser validate current pass custom form (UserValidateCurrentPassCustomForm) [User]1600
LeafUsername/e-mail validation (UserValidationTestCase) [User]1900
LeafValid Url (ValidUrlTestCase) [System]7900
LeafVariable test (BootstrapVariableTestCase) [Bootstrap]700
LeafVertical tabs form element type test (FormsElementsVerticalTabsFunctionalTest) [Form API]300
LeafXML-RPC basic (XMLRPCBasicTestCase) [XML-RPC]500
LeafXML-RPC message and alteration (XMLRPCMessagesTestCase) [XML-RPC]500
LeafXML-RPC validator (XMLRPCValidator1IncTestCase) [XML-RPC]900