1041240.patch

Test status
StatusResult
Last receivedThu, 01/27/2011 - 09:51:37
Last requestedThu, 01/27/2011 - 09:52:01
Last testedThu, 01/27/2011 - 09:53:25
Test count1
Environment status
MySQLfail
File information
File1041240.patch
BranchEntity API - 7.x-1.x
LinkIssue Link
SummaryFAILED: [[SimpleTest]]: [MySQL] 271 pass(es), 0 fail(s), and 1 exception(s).
Details

MySQL

  1. Setup environment
  2. Detect an invalid patch URL
  3. Detect invalid repository information
  4. Detect invalid patch format
  5. Detect a non-applicable patch
  6. Detect invalid PHP syntax
  7. Detect a Drupal installation failure
  8. Detect a test run failure
  9. Detect a failing test
    Review the test failures below then if necessary run them locally until the problem has been fixed.
  10. Complete test suite with all tests passing
271 pass(es), 0 fail(s), and 1 exception(s)

Non-pass

Test namePassFailException
ExpandMetadata Wrapper (EntityMetadataTestCase) [Entity API]8801
MessageGroupFilenameLineFunctionStatus
PDOException: SQLSTATE[21000]: Cardinality violation: 1241 Operand should contain 1 column(s): SELECT node.nid AS entity_id, node.vid AS revision_id, node.type AS bundle, :entity_type AS entity_type FROM {node} node WHERE (node.title = :db_condition_placeholder_0_0, :db_condition_placeholder_0_1) LIMIT 30 OFFSET 0; Array ( [:entity_type] => node [:db_condition_placeholder_0_0] => <b>Is it bold?<b> [:db_condition_placeholder_0_1] => another title ) in EntityFieldQuery->execute() (line 1012 of /var/lib/drupaltestbot/sites/default/files/checkout/includes/entity.inc).Uncaught exceptiondatabase.inc2039PDOStatement->execute()

All

Test namePassFailException
LeafEntity CRUD (EntityAPITestCase) [Entity API]5100
LeafEntity tokens (EntityTokenTestCase) [Entity API]100
ExpandMetadata Wrapper (EntityMetadataTestCase) [Entity API]8801
MessageGroupFilenameLineFunctionStatus
PDOException: SQLSTATE[21000]: Cardinality violation: 1241 Operand should contain 1 column(s): SELECT node.nid AS entity_id, node.vid AS revision_id, node.type AS bundle, :entity_type AS entity_type FROM {node} node WHERE (node.title = :db_condition_placeholder_0_0, :db_condition_placeholder_0_1) LIMIT 30 OFFSET 0; Array ( [:entity_type] => node [:db_condition_placeholder_0_0] => <b>Is it bold?<b> [:db_condition_placeholder_0_1] => another title ) in EntityFieldQuery->execute() (line 1012 of /var/lib/drupaltestbot/sites/default/files/checkout/includes/entity.inc).Uncaught exceptiondatabase.inc2039PDOStatement->execute()
LeafProperty info core integration (EntityMetadataIntegrationTestCase) [Entity API]13100