2593983-commerce_order_has_changed-tests-6.patch

Test status
StatusResult
Last receivedFri, 11/06/2015 - 04:32:03
Last requestedFri, 11/06/2015 - 04:33:02
Last testedFri, 11/06/2015 - 04:41:03
Test count1
Environment status
MySQLfail
File information
File2593983-commerce_order_has_changed-tests-6.patch
BranchDrupal Commerce - 7.x-1.x
LinkIssue Link
SummaryFAILED: [[SimpleTest]]: [MySQL] 3,582 pass(es), 4 fail(s), and 9 exception(s).
Details

MySQL

  1. Setup environment
  2. Detect an invalid patch URL
  3. Detect invalid repository information
  4. Detect invalid patch format
  5. Detect a non-applicable patch
  6. Detect invalid PHP syntax
  7. Detect a Drupal installation failure
  8. Detect a test run failure
  9. Detect a failing test
    Review the test failures below then if necessary run them locally until the problem has been fixed.
  10. Complete test suite with all tests passing
3,582 pass(es), 4 fail(s), and 9 exception(s)

Non-pass

Test namePassFailException
ExpandOrder CRUD (CommerceOrderCRUDTestCase) [Drupal Commerce]4649
MessageGroupFilenameLineFunctionStatus
Undefined property: CommerceOrderCRUDTestCase::$store_customerNoticecommerce_order.test130CommerceOrderCRUDTestCase->testCommerceOrderHasChanged()
Argument 1 passed to DrupalWebTestCase::drupalLogin() must be an instance of stdClass, null given, called in /var/lib/drupaltestbot/sites/default/files/checkout/sites/default/modules/commerce/modules/order/tests/commerce_order.test on line 130 and definedRecoverable errordrupal_web_test_case.php1250DrupalWebTestCase->drupalLogin()
Trying to get property of non-objectNoticedrupal_web_test_case.php1256DrupalWebTestCase->drupalLogin()
Trying to get property of non-objectNoticedrupal_web_test_case.php1257DrupalWebTestCase->drupalLogin()
Failed to set field name to Othercommerce_order.test130CommerceOrderCRUDTestCase->testCommerceOrderHasChanged()
Failed to set field pass to Othercommerce_order.test130CommerceOrderCRUDTestCase->testCommerceOrderHasChanged()
Found the requested form fields at userOthercommerce_order.test130CommerceOrderCRUDTestCase->testCommerceOrderHasChanged()
Trying to get property of non-objectNoticedrupal_web_test_case.php1263DrupalWebTestCase->drupalLogin()
User successfully logged in.User logincommerce_order.test130CommerceOrderCRUDTestCase->testCommerceOrderHasChanged()
Undefined property: CommerceOrderCRUDTestCase::$store_customerNoticecommerce_order.test136CommerceOrderCRUDTestCase->testCommerceOrderHasChanged()
Trying to get property of non-objectNoticecommerce_order.test136CommerceOrderCRUDTestCase->testCommerceOrderHasChanged()
Trying to get property of non-objectNoticecommerce_order.module1283commerce_order_status_update()
EntityMalformedException: Missing bundle property on entity of type commerce_order. in entity_extract_ids() (line 7879 of /var/lib/drupaltestbot/sites/default/files/checkout/includes/common.inc).Uncaught exceptioncommon.inc7879entity_extract_ids()

All

Test namePassFailException
LeafCheckout process (CommerceCheckoutTestProcess) [Drupal Commerce]34900
LeafCommerce base (CommerceBaseTesterTestCase) [Drupal Commerce]21600
LeafCustomer user interface (CommerceCustomerUITest) [Drupal Commerce]42800
LeafOrder administration (CommerceOrderUIAdminTest) [Drupal Commerce]51500
ExpandOrder CRUD (CommerceOrderCRUDTestCase) [Drupal Commerce]4649
MessageGroupFilenameLineFunctionStatus
Undefined property: CommerceOrderCRUDTestCase::$store_customerNoticecommerce_order.test130CommerceOrderCRUDTestCase->testCommerceOrderHasChanged()
Argument 1 passed to DrupalWebTestCase::drupalLogin() must be an instance of stdClass, null given, called in /var/lib/drupaltestbot/sites/default/files/checkout/sites/default/modules/commerce/modules/order/tests/commerce_order.test on line 130 and definedRecoverable errordrupal_web_test_case.php1250DrupalWebTestCase->drupalLogin()
Trying to get property of non-objectNoticedrupal_web_test_case.php1256DrupalWebTestCase->drupalLogin()
Trying to get property of non-objectNoticedrupal_web_test_case.php1257DrupalWebTestCase->drupalLogin()
Failed to set field name to Othercommerce_order.test130CommerceOrderCRUDTestCase->testCommerceOrderHasChanged()
Failed to set field pass to Othercommerce_order.test130CommerceOrderCRUDTestCase->testCommerceOrderHasChanged()
Found the requested form fields at userOthercommerce_order.test130CommerceOrderCRUDTestCase->testCommerceOrderHasChanged()
Trying to get property of non-objectNoticedrupal_web_test_case.php1263DrupalWebTestCase->drupalLogin()
User successfully logged in.User logincommerce_order.test130CommerceOrderCRUDTestCase->testCommerceOrderHasChanged()
Undefined property: CommerceOrderCRUDTestCase::$store_customerNoticecommerce_order.test136CommerceOrderCRUDTestCase->testCommerceOrderHasChanged()
Trying to get property of non-objectNoticecommerce_order.test136CommerceOrderCRUDTestCase->testCommerceOrderHasChanged()
Trying to get property of non-objectNoticecommerce_order.module1283commerce_order_status_update()
EntityMalformedException: Missing bundle property on entity of type commerce_order. in entity_extract_ids() (line 7879 of /var/lib/drupaltestbot/sites/default/files/checkout/includes/common.inc).Uncaught exceptioncommon.inc7879entity_extract_ids()
LeafOrder Rules (CommerceOrderRulesTest) [Drupal Commerce]3100
LeafPayment Offsite (CommercePaymentOffsiteTest) [Drupal Commerce]3700
LeafPayment Rules (CommercePaymentRulesTest) [Drupal Commerce]1200
LeafPayment user interface (CommercePaymentUITest) [Drupal Commerce]18800
LeafProduct administration (CommerceProductUIAdminTest) [Drupal Commerce]47600
LeafProduct CRUD (CommerceProductCRUDTestCase) [Drupal Commerce]7100
LeafProduct reference (CommerceProductReferenceAdminTest) [Drupal Commerce]29300
LeafShopping cart (CommerceCartTestCaseSimpleProduct) [Drupal Commerce]14400
LeafShopping cart anonymous to authenticated (CommerceCartTestCaseAnonymousToAuthenticated) [Drupal Commerce]3400
LeafShopping cart attributes (CommerceCartTestCaseAttributes) [Drupal Commerce]5000
LeafShopping cart multiple (CommerceCartTestCaseMultiProducts) [Drupal Commerce]9400
LeafTax administration (CommerceTaxUIAdminTest) [Drupal Commerce]59800