scald-dnd_drag_parent-2606360-2.patch

Test status
StatusResult
Last receivedMon, 11/02/2015 - 13:31:00
Last requestedMon, 11/02/2015 - 13:38:40
Last testedMon, 11/02/2015 - 13:39:17
Test count1
Environment status
MySQLfail
File information
Filescald-dnd_drag_parent-2606360-2.patch
BranchScald: Media Management made easy - 7.x-1.2
LinkIssue Link
SummaryFAILED: [[SimpleTest]]: [MySQL] 38 pass(es), 95 fail(s), and 27 exception(s).
Details

MySQL

  1. Setup environment
  2. Detect an invalid patch URL
  3. Detect invalid repository information
  4. Detect invalid patch format
  5. Detect a non-applicable patch
  6. Detect invalid PHP syntax
  7. Detect a Drupal installation failure
  8. Detect a test run failure
  9. Detect a failing test
    Review the test failures below then if necessary run them locally until the problem has been fixed.
  10. Complete test suite with all tests passing
38 pass(es), 95 fail(s), and 27 exception(s)

Non-pass

Test namePassFailException
ExpandScald atom entities (ScaldAtomEntityTestCase) [Scald]245818
MessageGroupFilenameLineFunctionStatus
Enabled modules: scald_image, scaldOtherscald.test20ScaldWebTestCase->setUp()
Invalid permission create atom of image type.Rolescald.test338ScaldAtomEntityTestCase->setUp()
Invalid permission view any atom.Rolescald.test338ScaldAtomEntityTestCase->setUp()
Invalid permission fetch any atom.Rolescald.test338ScaldAtomEntityTestCase->setUp()
Invalid permission edit own atom.Rolescald.test338ScaldAtomEntityTestCase->setUp()
Argument 1 passed to DrupalWebTestCase::drupalLogin() must be an instance of stdClass, boolean given, called in /var/lib/drupaltestbot/sites/default/files/checkout/sites/default/modules/scald/tests/scald.test on line 339 and definedRecoverable errordrupal_web_test_case.php1250DrupalWebTestCase->drupalLogin()
Trying to get property of non-objectNoticedrupal_web_test_case.php1256DrupalWebTestCase->drupalLogin()
Trying to get property of non-objectNoticedrupal_web_test_case.php1257DrupalWebTestCase->drupalLogin()
Failed to set field name to Otherscald.test339ScaldAtomEntityTestCase->setUp()
Failed to set field pass to Otherscald.test339ScaldAtomEntityTestCase->setUp()
Found the requested form fields at userOtherscald.test339ScaldAtomEntityTestCase->setUp()
Trying to get property of non-objectNoticedrupal_web_test_case.php1263DrupalWebTestCase->drupalLogin()
User successfully logged in.User loginscald.test339ScaldAtomEntityTestCase->setUp()
Failed to set field files[file] to /var/lib/drupaltestbot/sites/default/files/checkout/sites/default/files/simpletest/870085/image-test.pngOtherscald.test55ScaldWebTestCase->createAtom()
Found the Continue buttonOtherscald.test55ScaldWebTestCase->createAtom()
Found the requested form fields at atom/add/imageOtherscald.test55ScaldWebTestCase->createAtom()
Found field with name 'atom0[title]' and value 'image-test.png'Browserscald.test56ScaldWebTestCase->createAtom()
Failed to set field atom0[title] to Image t3ygtPe9FgXf4eKQAKDvOtherscald.test64ScaldWebTestCase->createAtom()
Failed to set field atom0[scald_authors][und] to lWDWecqCe5Otherscald.test64ScaldWebTestCase->createAtom()
Found the Finish buttonOtherscald.test64ScaldWebTestCase->createAtom()
Found the requested form fields at Otherscald.test64ScaldWebTestCase->createAtom()
EntityFieldQueryException: Entity <em class="placeholder">scald_atom</em> has no base table. in EntityFieldQuery->propertyQuery() (line 1247 of /var/lib/drupaltestbot/sites/default/files/checkout/includes/entity.inc).Uncaught exceptionentity.inc1247EntityFieldQuery->propertyQuery()
Enabled modules: scald_image, scaldOtherscald.test20ScaldWebTestCase->setUp()
Invalid permission create atom of image type.Rolescald.test338ScaldAtomEntityTestCase->setUp()
Invalid permission view any atom.Rolescald.test338ScaldAtomEntityTestCase->setUp()
Invalid permission fetch any atom.Rolescald.test338ScaldAtomEntityTestCase->setUp()
Invalid permission edit own atom.Rolescald.test338ScaldAtomEntityTestCase->setUp()
Argument 1 passed to DrupalWebTestCase::drupalLogin() must be an instance of stdClass, boolean given, called in /var/lib/drupaltestbot/sites/default/files/checkout/sites/default/modules/scald/tests/scald.test on line 339 and definedRecoverable errordrupal_web_test_case.php1250DrupalWebTestCase->drupalLogin()
Trying to get property of non-objectNoticedrupal_web_test_case.php1256DrupalWebTestCase->drupalLogin()
Trying to get property of non-objectNoticedrupal_web_test_case.php1257DrupalWebTestCase->drupalLogin()
Failed to set field name to Otherscald.test339ScaldAtomEntityTestCase->setUp()
Failed to set field pass to Otherscald.test339ScaldAtomEntityTestCase->setUp()
Found the requested form fields at userOtherscald.test339ScaldAtomEntityTestCase->setUp()
Trying to get property of non-objectNoticedrupal_web_test_case.php1263DrupalWebTestCase->drupalLogin()
User successfully logged in.User loginscald.test339ScaldAtomEntityTestCase->setUp()
Failed to set field files[file] to /var/lib/drupaltestbot/sites/default/files/checkout/sites/default/files/simpletest/997988/image-test.pngOtherscald.test55ScaldWebTestCase->createAtom()
Found the Continue buttonOtherscald.test55ScaldWebTestCase->createAtom()
Found the requested form fields at atom/add/imageOtherscald.test55ScaldWebTestCase->createAtom()
Found field with name 'atom0[title]' and value 'image-test.png'Browserscald.test56ScaldWebTestCase->createAtom()
Failed to set field atom0[title] to Image o8MuxDu65vdTjnWKW3xwOtherscald.test64ScaldWebTestCase->createAtom()
Failed to set field atom0[scald_authors][und] to h5qlZkOyK1Otherscald.test64ScaldWebTestCase->createAtom()
Found the Finish buttonOtherscald.test64ScaldWebTestCase->createAtom()
Found the requested form fields at Otherscald.test64ScaldWebTestCase->createAtom()
EntityFieldQueryException: Entity <em class="placeholder">scald_atom</em> has no base table. in EntityFieldQuery->propertyQuery() (line 1247 of /var/lib/drupaltestbot/sites/default/files/checkout/includes/entity.inc).Uncaught exceptionentity.inc1247EntityFieldQuery->propertyQuery()
The test did not complete due to a fatal error.Completion checkscald.test400ScaldAtomEntityTestCase->testScaldAtomManual()
Enabled modules: scald_image, scaldOtherscald.test20ScaldWebTestCase->setUp()
Invalid permission create atom of image type.Rolescald.test338ScaldAtomEntityTestCase->setUp()
Invalid permission view any atom.Rolescald.test338ScaldAtomEntityTestCase->setUp()
Invalid permission fetch any atom.Rolescald.test338ScaldAtomEntityTestCase->setUp()
Invalid permission edit own atom.Rolescald.test338ScaldAtomEntityTestCase->setUp()
Argument 1 passed to DrupalWebTestCase::drupalLogin() must be an instance of stdClass, boolean given, called in /var/lib/drupaltestbot/sites/default/files/checkout/sites/default/modules/scald/tests/scald.test on line 339 and definedRecoverable errordrupal_web_test_case.php1250DrupalWebTestCase->drupalLogin()
Trying to get property of non-objectNoticedrupal_web_test_case.php1256DrupalWebTestCase->drupalLogin()
Trying to get property of non-objectNoticedrupal_web_test_case.php1257DrupalWebTestCase->drupalLogin()
Failed to set field name to Otherscald.test339ScaldAtomEntityTestCase->setUp()
Failed to set field pass to Otherscald.test339ScaldAtomEntityTestCase->setUp()
Found the requested form fields at userOtherscald.test339ScaldAtomEntityTestCase->setUp()
Trying to get property of non-objectNoticedrupal_web_test_case.php1263DrupalWebTestCase->drupalLogin()
User successfully logged in.User loginscald.test339ScaldAtomEntityTestCase->setUp()
Invalid permission view any atom.Rolescald.test412ScaldAtomEntityTestCase->testScaldAtomManual()
Invalid permission fetch any atom.Rolescald.test412ScaldAtomEntityTestCase->testScaldAtomManual()
Invalid permission edit own atom.Rolescald.test412ScaldAtomEntityTestCase->testScaldAtomManual()
Invalid permission create atom of image type.Rolescald.test412ScaldAtomEntityTestCase->testScaldAtomManual()
Invalid permission delete own atom.Rolescald.test412ScaldAtomEntityTestCase->testScaldAtomManual()
Argument 1 passed to DrupalWebTestCase::drupalLogin() must be an instance of stdClass, boolean given, called in /var/lib/drupaltestbot/sites/default/files/checkout/sites/default/modules/scald/tests/scald.test on line 413 and definedRecoverable errordrupal_web_test_case.php1250DrupalWebTestCase->drupalLogin()
Trying to get property of non-objectNoticedrupal_web_test_case.php1256DrupalWebTestCase->drupalLogin()
Trying to get property of non-objectNoticedrupal_web_test_case.php1257DrupalWebTestCase->drupalLogin()
Failed to set field name to Otherscald.test413ScaldAtomEntityTestCase->testScaldAtomManual()
Failed to set field pass to Otherscald.test413ScaldAtomEntityTestCase->testScaldAtomManual()
Found the requested form fields at userOtherscald.test413ScaldAtomEntityTestCase->testScaldAtomManual()
Trying to get property of non-objectNoticedrupal_web_test_case.php1263DrupalWebTestCase->drupalLogin()
User successfully logged in.User loginscald.test413ScaldAtomEntityTestCase->testScaldAtomManual()
Failed to set field files[file] to /var/lib/drupaltestbot/sites/default/files/checkout/sites/default/files/simpletest/971016/image-test.pngOtherscald.test419ScaldAtomEntityTestCase->testScaldAtomManual()
Found the Continue buttonOtherscald.test419ScaldAtomEntityTestCase->testScaldAtomManual()
Found the requested form fields at atom/add/imageOtherscald.test419ScaldAtomEntityTestCase->testScaldAtomManual()
Image file found in database.Otherscald.test430ScaldAtomEntityTestCase->testScaldAtomManual()
Call to undefined function scald_fetch()PHP Fatal errorscald.test432Unknown
ExpandScald base (ScaldBaseTestCase) [Scald]020
MessageGroupFilenameLineFunctionStatus
The test did not complete due to a fatal error.Completion checkscald.test139ScaldBaseTestCase->testScaldBaseAtomType()
Enabled modules: scaldOtherscald.test20ScaldWebTestCase->setUp()
ExpandScald DnD (ScaldDnDTestCase) [Scald]3104
MessageGroupFilenameLineFunctionStatus
The test did not complete due to a fatal error.Completion checkscald.test550ScaldDnDTestCase->testScaldDndLibrary()
Enabled modules: scald_image, scald_dnd_library, scaldOtherscald.test20ScaldWebTestCase->setUp()
Invalid permission create atom of image type.Rolescald.test543ScaldDnDTestCase->setUp()
Invalid permission view any atom.Rolescald.test543ScaldDnDTestCase->setUp()
Invalid permission fetch any atom.Rolescald.test543ScaldDnDTestCase->setUp()
Invalid permission edit own atom.Rolescald.test543ScaldDnDTestCase->setUp()
Argument 1 passed to DrupalWebTestCase::drupalLogin() must be an instance of stdClass, boolean given, called in /var/lib/drupaltestbot/sites/default/files/checkout/sites/default/modules/scald/tests/scald.test on line 544 and definedRecoverable errordrupal_web_test_case.php1250DrupalWebTestCase->drupalLogin()
Trying to get property of non-objectNoticedrupal_web_test_case.php1256DrupalWebTestCase->drupalLogin()
Trying to get property of non-objectNoticedrupal_web_test_case.php1257DrupalWebTestCase->drupalLogin()
Failed to set field name to Otherscald.test544ScaldDnDTestCase->setUp()
Failed to set field pass to Otherscald.test544ScaldDnDTestCase->setUp()
Found the requested form fields at userOtherscald.test544ScaldDnDTestCase->setUp()
Trying to get property of non-objectNoticedrupal_web_test_case.php1263DrupalWebTestCase->drupalLogin()
User successfully logged in.User loginscald.test544ScaldDnDTestCase->setUp()
ExpandScald Localize (ScaldLocalizeTestCase) [Scald]11255
MessageGroupFilenameLineFunctionStatus
Enabled modules: scald_image, locale, scaldOtherscald.test20ScaldWebTestCase->setUp()
Invalid permission administer scald.Rolescald.test597ScaldLocalizeTestCase->setUp()
Invalid permission create atom of image type.Rolescald.test597ScaldLocalizeTestCase->setUp()
Invalid permission view any atom.Rolescald.test597ScaldLocalizeTestCase->setUp()
Invalid permission fetch any atom.Rolescald.test597ScaldLocalizeTestCase->setUp()
Invalid permission edit own atom.Rolescald.test597ScaldLocalizeTestCase->setUp()
Invalid permission administer languages.Rolescald.test597ScaldLocalizeTestCase->setUp()
Invalid permission translate interface.Rolescald.test597ScaldLocalizeTestCase->setUp()
Argument 1 passed to DrupalWebTestCase::drupalLogin() must be an instance of stdClass, boolean given, called in /var/lib/drupaltestbot/sites/default/files/checkout/sites/default/modules/scald/tests/scald.test on line 598 and definedRecoverable errordrupal_web_test_case.php1250DrupalWebTestCase->drupalLogin()
Trying to get property of non-objectNoticedrupal_web_test_case.php1256DrupalWebTestCase->drupalLogin()
Trying to get property of non-objectNoticedrupal_web_test_case.php1257DrupalWebTestCase->drupalLogin()
Failed to set field name to Otherscald.test598ScaldLocalizeTestCase->setUp()
Failed to set field pass to Otherscald.test598ScaldLocalizeTestCase->setUp()
Found the requested form fields at userOtherscald.test598ScaldLocalizeTestCase->setUp()
Trying to get property of non-objectNoticedrupal_web_test_case.php1263DrupalWebTestCase->drupalLogin()
User successfully logged in.User loginscald.test598ScaldLocalizeTestCase->setUp()
Failed to set field langcode to frOtherscald.test608ScaldLocalizeTestCase->testStringTranslation()
Found the Add language buttonOtherscald.test608ScaldLocalizeTestCase->testStringTranslation()
Found the requested form fields at admin/config/regional/language/addOtherscald.test608ScaldLocalizeTestCase->testStringTranslation()
Failed to set field language[enabled][locale-url] to 1Otherscald.test611ScaldLocalizeTestCase->testStringTranslation()
Found the Save settings buttonOtherscald.test611ScaldLocalizeTestCase->testStringTranslation()
Found the requested form fields at admin/config/regional/language/configureOtherscald.test611ScaldLocalizeTestCase->testStringTranslation()
Failed to set field string to EditOtherscald.test619ScaldLocalizeTestCase->testStringTranslation()
Found the Filter buttonOtherscald.test619ScaldLocalizeTestCase->testStringTranslation()
Found the requested form fields at admin/config/regional/translate/translateOtherscald.test619ScaldLocalizeTestCase->testStringTranslation()
Link edit does not exist on http://ec2-54-69-10-31.us-west-2.compute.amazonaws.com/checkout/?q=admin/config/regional/translate/translateBrowserscald.test621ScaldLocalizeTestCase->testStringTranslation()
Failed to set field translations[fr] to ModifierOtherscald.test625ScaldLocalizeTestCase->testStringTranslation()
Found the Save translations buttonOtherscald.test625ScaldLocalizeTestCase->testStringTranslation()
Found the requested form fields at Otherscald.test625ScaldLocalizeTestCase->testStringTranslation()
PDOException: SQLSTATE[42S02]: Base table or view not found: 1146 Table 'drupaltestbotmysql.simpletest48003cache_scald' doesn't exist: TRUNCATE {cache_scald} ; Array ( ) in cache_clear_all() (line 168 of /var/lib/drupaltestbot/sites/default/files/checkout/includes/cache.inc).Uncaught exceptiondatabase.inc2171PDOStatement->execute()

All

Test namePassFailException
ExpandScald atom entities (ScaldAtomEntityTestCase) [Scald]245818
MessageGroupFilenameLineFunctionStatus
Enabled modules: scald_image, scaldOtherscald.test20ScaldWebTestCase->setUp()
Invalid permission create atom of image type.Rolescald.test338ScaldAtomEntityTestCase->setUp()
Invalid permission view any atom.Rolescald.test338ScaldAtomEntityTestCase->setUp()
Invalid permission fetch any atom.Rolescald.test338ScaldAtomEntityTestCase->setUp()
Invalid permission edit own atom.Rolescald.test338ScaldAtomEntityTestCase->setUp()
Argument 1 passed to DrupalWebTestCase::drupalLogin() must be an instance of stdClass, boolean given, called in /var/lib/drupaltestbot/sites/default/files/checkout/sites/default/modules/scald/tests/scald.test on line 339 and definedRecoverable errordrupal_web_test_case.php1250DrupalWebTestCase->drupalLogin()
Trying to get property of non-objectNoticedrupal_web_test_case.php1256DrupalWebTestCase->drupalLogin()
Trying to get property of non-objectNoticedrupal_web_test_case.php1257DrupalWebTestCase->drupalLogin()
Failed to set field name to Otherscald.test339ScaldAtomEntityTestCase->setUp()
Failed to set field pass to Otherscald.test339ScaldAtomEntityTestCase->setUp()
Found the requested form fields at userOtherscald.test339ScaldAtomEntityTestCase->setUp()
Trying to get property of non-objectNoticedrupal_web_test_case.php1263DrupalWebTestCase->drupalLogin()
User successfully logged in.User loginscald.test339ScaldAtomEntityTestCase->setUp()
Failed to set field files[file] to /var/lib/drupaltestbot/sites/default/files/checkout/sites/default/files/simpletest/870085/image-test.pngOtherscald.test55ScaldWebTestCase->createAtom()
Found the Continue buttonOtherscald.test55ScaldWebTestCase->createAtom()
Found the requested form fields at atom/add/imageOtherscald.test55ScaldWebTestCase->createAtom()
Found field with name 'atom0[title]' and value 'image-test.png'Browserscald.test56ScaldWebTestCase->createAtom()
Failed to set field atom0[title] to Image t3ygtPe9FgXf4eKQAKDvOtherscald.test64ScaldWebTestCase->createAtom()
Failed to set field atom0[scald_authors][und] to lWDWecqCe5Otherscald.test64ScaldWebTestCase->createAtom()
Found the Finish buttonOtherscald.test64ScaldWebTestCase->createAtom()
Found the requested form fields at Otherscald.test64ScaldWebTestCase->createAtom()
EntityFieldQueryException: Entity <em class="placeholder">scald_atom</em> has no base table. in EntityFieldQuery->propertyQuery() (line 1247 of /var/lib/drupaltestbot/sites/default/files/checkout/includes/entity.inc).Uncaught exceptionentity.inc1247EntityFieldQuery->propertyQuery()
Enabled modules: scald_image, scaldOtherscald.test20ScaldWebTestCase->setUp()
Invalid permission create atom of image type.Rolescald.test338ScaldAtomEntityTestCase->setUp()
Invalid permission view any atom.Rolescald.test338ScaldAtomEntityTestCase->setUp()
Invalid permission fetch any atom.Rolescald.test338ScaldAtomEntityTestCase->setUp()
Invalid permission edit own atom.Rolescald.test338ScaldAtomEntityTestCase->setUp()
Argument 1 passed to DrupalWebTestCase::drupalLogin() must be an instance of stdClass, boolean given, called in /var/lib/drupaltestbot/sites/default/files/checkout/sites/default/modules/scald/tests/scald.test on line 339 and definedRecoverable errordrupal_web_test_case.php1250DrupalWebTestCase->drupalLogin()
Trying to get property of non-objectNoticedrupal_web_test_case.php1256DrupalWebTestCase->drupalLogin()
Trying to get property of non-objectNoticedrupal_web_test_case.php1257DrupalWebTestCase->drupalLogin()
Failed to set field name to Otherscald.test339ScaldAtomEntityTestCase->setUp()
Failed to set field pass to Otherscald.test339ScaldAtomEntityTestCase->setUp()
Found the requested form fields at userOtherscald.test339ScaldAtomEntityTestCase->setUp()
Trying to get property of non-objectNoticedrupal_web_test_case.php1263DrupalWebTestCase->drupalLogin()
User successfully logged in.User loginscald.test339ScaldAtomEntityTestCase->setUp()
Failed to set field files[file] to /var/lib/drupaltestbot/sites/default/files/checkout/sites/default/files/simpletest/997988/image-test.pngOtherscald.test55ScaldWebTestCase->createAtom()
Found the Continue buttonOtherscald.test55ScaldWebTestCase->createAtom()
Found the requested form fields at atom/add/imageOtherscald.test55ScaldWebTestCase->createAtom()
Found field with name 'atom0[title]' and value 'image-test.png'Browserscald.test56ScaldWebTestCase->createAtom()
Failed to set field atom0[title] to Image o8MuxDu65vdTjnWKW3xwOtherscald.test64ScaldWebTestCase->createAtom()
Failed to set field atom0[scald_authors][und] to h5qlZkOyK1Otherscald.test64ScaldWebTestCase->createAtom()
Found the Finish buttonOtherscald.test64ScaldWebTestCase->createAtom()
Found the requested form fields at Otherscald.test64ScaldWebTestCase->createAtom()
EntityFieldQueryException: Entity <em class="placeholder">scald_atom</em> has no base table. in EntityFieldQuery->propertyQuery() (line 1247 of /var/lib/drupaltestbot/sites/default/files/checkout/includes/entity.inc).Uncaught exceptionentity.inc1247EntityFieldQuery->propertyQuery()
The test did not complete due to a fatal error.Completion checkscald.test400ScaldAtomEntityTestCase->testScaldAtomManual()
Enabled modules: scald_image, scaldOtherscald.test20ScaldWebTestCase->setUp()
Invalid permission create atom of image type.Rolescald.test338ScaldAtomEntityTestCase->setUp()
Invalid permission view any atom.Rolescald.test338ScaldAtomEntityTestCase->setUp()
Invalid permission fetch any atom.Rolescald.test338ScaldAtomEntityTestCase->setUp()
Invalid permission edit own atom.Rolescald.test338ScaldAtomEntityTestCase->setUp()
Argument 1 passed to DrupalWebTestCase::drupalLogin() must be an instance of stdClass, boolean given, called in /var/lib/drupaltestbot/sites/default/files/checkout/sites/default/modules/scald/tests/scald.test on line 339 and definedRecoverable errordrupal_web_test_case.php1250DrupalWebTestCase->drupalLogin()
Trying to get property of non-objectNoticedrupal_web_test_case.php1256DrupalWebTestCase->drupalLogin()
Trying to get property of non-objectNoticedrupal_web_test_case.php1257DrupalWebTestCase->drupalLogin()
Failed to set field name to Otherscald.test339ScaldAtomEntityTestCase->setUp()
Failed to set field pass to Otherscald.test339ScaldAtomEntityTestCase->setUp()
Found the requested form fields at userOtherscald.test339ScaldAtomEntityTestCase->setUp()
Trying to get property of non-objectNoticedrupal_web_test_case.php1263DrupalWebTestCase->drupalLogin()
User successfully logged in.User loginscald.test339ScaldAtomEntityTestCase->setUp()
Invalid permission view any atom.Rolescald.test412ScaldAtomEntityTestCase->testScaldAtomManual()
Invalid permission fetch any atom.Rolescald.test412ScaldAtomEntityTestCase->testScaldAtomManual()
Invalid permission edit own atom.Rolescald.test412ScaldAtomEntityTestCase->testScaldAtomManual()
Invalid permission create atom of image type.Rolescald.test412ScaldAtomEntityTestCase->testScaldAtomManual()
Invalid permission delete own atom.Rolescald.test412ScaldAtomEntityTestCase->testScaldAtomManual()
Argument 1 passed to DrupalWebTestCase::drupalLogin() must be an instance of stdClass, boolean given, called in /var/lib/drupaltestbot/sites/default/files/checkout/sites/default/modules/scald/tests/scald.test on line 413 and definedRecoverable errordrupal_web_test_case.php1250DrupalWebTestCase->drupalLogin()
Trying to get property of non-objectNoticedrupal_web_test_case.php1256DrupalWebTestCase->drupalLogin()
Trying to get property of non-objectNoticedrupal_web_test_case.php1257DrupalWebTestCase->drupalLogin()
Failed to set field name to Otherscald.test413ScaldAtomEntityTestCase->testScaldAtomManual()
Failed to set field pass to Otherscald.test413ScaldAtomEntityTestCase->testScaldAtomManual()
Found the requested form fields at userOtherscald.test413ScaldAtomEntityTestCase->testScaldAtomManual()
Trying to get property of non-objectNoticedrupal_web_test_case.php1263DrupalWebTestCase->drupalLogin()
User successfully logged in.User loginscald.test413ScaldAtomEntityTestCase->testScaldAtomManual()
Failed to set field files[file] to /var/lib/drupaltestbot/sites/default/files/checkout/sites/default/files/simpletest/971016/image-test.pngOtherscald.test419ScaldAtomEntityTestCase->testScaldAtomManual()
Found the Continue buttonOtherscald.test419ScaldAtomEntityTestCase->testScaldAtomManual()
Found the requested form fields at atom/add/imageOtherscald.test419ScaldAtomEntityTestCase->testScaldAtomManual()
Image file found in database.Otherscald.test430ScaldAtomEntityTestCase->testScaldAtomManual()
Call to undefined function scald_fetch()PHP Fatal errorscald.test432Unknown
ExpandScald base (ScaldBaseTestCase) [Scald]020
MessageGroupFilenameLineFunctionStatus
The test did not complete due to a fatal error.Completion checkscald.test139ScaldBaseTestCase->testScaldBaseAtomType()
Enabled modules: scaldOtherscald.test20ScaldWebTestCase->setUp()
ExpandScald DnD (ScaldDnDTestCase) [Scald]3104
MessageGroupFilenameLineFunctionStatus
The test did not complete due to a fatal error.Completion checkscald.test550ScaldDnDTestCase->testScaldDndLibrary()
Enabled modules: scald_image, scald_dnd_library, scaldOtherscald.test20ScaldWebTestCase->setUp()
Invalid permission create atom of image type.Rolescald.test543ScaldDnDTestCase->setUp()
Invalid permission view any atom.Rolescald.test543ScaldDnDTestCase->setUp()
Invalid permission fetch any atom.Rolescald.test543ScaldDnDTestCase->setUp()
Invalid permission edit own atom.Rolescald.test543ScaldDnDTestCase->setUp()
Argument 1 passed to DrupalWebTestCase::drupalLogin() must be an instance of stdClass, boolean given, called in /var/lib/drupaltestbot/sites/default/files/checkout/sites/default/modules/scald/tests/scald.test on line 544 and definedRecoverable errordrupal_web_test_case.php1250DrupalWebTestCase->drupalLogin()
Trying to get property of non-objectNoticedrupal_web_test_case.php1256DrupalWebTestCase->drupalLogin()
Trying to get property of non-objectNoticedrupal_web_test_case.php1257DrupalWebTestCase->drupalLogin()
Failed to set field name to Otherscald.test544ScaldDnDTestCase->setUp()
Failed to set field pass to Otherscald.test544ScaldDnDTestCase->setUp()
Found the requested form fields at userOtherscald.test544ScaldDnDTestCase->setUp()
Trying to get property of non-objectNoticedrupal_web_test_case.php1263DrupalWebTestCase->drupalLogin()
User successfully logged in.User loginscald.test544ScaldDnDTestCase->setUp()
ExpandScald Localize (ScaldLocalizeTestCase) [Scald]11255
MessageGroupFilenameLineFunctionStatus
Enabled modules: scald_image, locale, scaldOtherscald.test20ScaldWebTestCase->setUp()
Invalid permission administer scald.Rolescald.test597ScaldLocalizeTestCase->setUp()
Invalid permission create atom of image type.Rolescald.test597ScaldLocalizeTestCase->setUp()
Invalid permission view any atom.Rolescald.test597ScaldLocalizeTestCase->setUp()
Invalid permission fetch any atom.Rolescald.test597ScaldLocalizeTestCase->setUp()
Invalid permission edit own atom.Rolescald.test597ScaldLocalizeTestCase->setUp()
Invalid permission administer languages.Rolescald.test597ScaldLocalizeTestCase->setUp()
Invalid permission translate interface.Rolescald.test597ScaldLocalizeTestCase->setUp()
Argument 1 passed to DrupalWebTestCase::drupalLogin() must be an instance of stdClass, boolean given, called in /var/lib/drupaltestbot/sites/default/files/checkout/sites/default/modules/scald/tests/scald.test on line 598 and definedRecoverable errordrupal_web_test_case.php1250DrupalWebTestCase->drupalLogin()
Trying to get property of non-objectNoticedrupal_web_test_case.php1256DrupalWebTestCase->drupalLogin()
Trying to get property of non-objectNoticedrupal_web_test_case.php1257DrupalWebTestCase->drupalLogin()
Failed to set field name to Otherscald.test598ScaldLocalizeTestCase->setUp()
Failed to set field pass to Otherscald.test598ScaldLocalizeTestCase->setUp()
Found the requested form fields at userOtherscald.test598ScaldLocalizeTestCase->setUp()
Trying to get property of non-objectNoticedrupal_web_test_case.php1263DrupalWebTestCase->drupalLogin()
User successfully logged in.User loginscald.test598ScaldLocalizeTestCase->setUp()
Failed to set field langcode to frOtherscald.test608ScaldLocalizeTestCase->testStringTranslation()
Found the Add language buttonOtherscald.test608ScaldLocalizeTestCase->testStringTranslation()
Found the requested form fields at admin/config/regional/language/addOtherscald.test608ScaldLocalizeTestCase->testStringTranslation()
Failed to set field language[enabled][locale-url] to 1Otherscald.test611ScaldLocalizeTestCase->testStringTranslation()
Found the Save settings buttonOtherscald.test611ScaldLocalizeTestCase->testStringTranslation()
Found the requested form fields at admin/config/regional/language/configureOtherscald.test611ScaldLocalizeTestCase->testStringTranslation()
Failed to set field string to EditOtherscald.test619ScaldLocalizeTestCase->testStringTranslation()
Found the Filter buttonOtherscald.test619ScaldLocalizeTestCase->testStringTranslation()
Found the requested form fields at admin/config/regional/translate/translateOtherscald.test619ScaldLocalizeTestCase->testStringTranslation()
Link edit does not exist on http://ec2-54-69-10-31.us-west-2.compute.amazonaws.com/checkout/?q=admin/config/regional/translate/translateBrowserscald.test621ScaldLocalizeTestCase->testStringTranslation()
Failed to set field translations[fr] to ModifierOtherscald.test625ScaldLocalizeTestCase->testStringTranslation()
Found the Save translations buttonOtherscald.test625ScaldLocalizeTestCase->testStringTranslation()
Found the requested form fields at Otherscald.test625ScaldLocalizeTestCase->testStringTranslation()
PDOException: SQLSTATE[42S02]: Base table or view not found: 1146 Table 'drupaltestbotmysql.simpletest48003cache_scald' doesn't exist: TRUNCATE {cache_scald} ; Array ( ) in cache_clear_all() (line 168 of /var/lib/drupaltestbot/sites/default/files/checkout/includes/cache.inc).Uncaught exceptiondatabase.inc2171PDOStatement->execute()