add_vertical_tabs_to-2557247-20.patch

Test status
StatusResult
Last receivedWed, 10/28/2015 - 19:22:02
Last requestedWed, 10/28/2015 - 19:23:01
Last testedWed, 10/28/2015 - 19:28:13
Test count1
Environment status
MySQLfail
File information
Fileadd_vertical_tabs_to-2557247-20.patch
BranchCommerce Discount - 7.x-1.x
LinkIssue Link
SummaryFAILED: [[SimpleTest]]: [MySQL] 547 pass(es), 11 fail(s), and 1 exception(s).
Details

MySQL

  1. Setup environment
  2. Detect an invalid patch URL
  3. Detect invalid repository information
  4. Detect invalid patch format
  5. Detect a non-applicable patch
  6. Detect invalid PHP syntax
  7. Detect a Drupal installation failure
  8. Detect a test run failure
  9. Detect a failing test
    Review the test failures below then if necessary run them locally until the problem has been fixed.
  10. Complete test suite with all tests passing
547 pass(es), 11 fail(s), and 1 exception(s)

Non-pass

Test namePassFailException
ExpandDiscounts usage (CommerceDiscountUsageTest) [Commerce discounts]103111
MessageGroupFilenameLineFunctionStatus
Maximum usage per customer field is presentBrowsercommerce_discount_usage.test50CommerceDiscountUsageTest->testCommerceDiscountUsageUIAddDiscount()
Maximum overall usage field is presentBrowsercommerce_discount_usage.test51CommerceDiscountUsageTest->testCommerceDiscountUsageUIAddDiscount()
Failed to set field commerce_discount_fields[discount_usage_limit][und][0][value] to 5Othercommerce_discount_usage.test61CommerceDiscountUsageTest->testCommerceDiscountUsageUIAddDiscount()
Found the requested form fields at Othercommerce_discount_usage.test61CommerceDiscountUsageTest->testCommerceDiscountUsageUIAddDiscount()
EntityMetadataWrapperException: Invalid data value given. Be sure it matches the required data type and format. in EntityDrupalWrapper->set() (line 737 of /var/lib/drupaltestbot/sites/default/files/checkout/sites/default/modules/entity/includes/entity.wrapper.inc).Uncaught exceptionentity.wrapper.inc737EntityDrupalWrapper->set()
Maximum usage per customer field is presentBrowsercommerce_discount_usage.test91CommerceDiscountUsageTest->testCommerceDiscountUsageUIEditDiscount()
Maximum overall usage field is presentBrowsercommerce_discount_usage.test92CommerceDiscountUsageTest->testCommerceDiscountUsageUIEditDiscount()
Failed to set field commerce_discount_fields[discount_usage_limit][und][0][value] to 5Othercommerce_discount_usage.test102CommerceDiscountUsageTest->testCommerceDiscountUsageUIEditDiscount()
Found the requested form fields at Othercommerce_discount_usage.test102CommerceDiscountUsageTest->testCommerceDiscountUsageUIEditDiscount()
Discount max uses stored correctly.Othercommerce_discount_usage.test110CommerceDiscountUsageTest->testCommerceDiscountUsageUIEditDiscount()
Analytics - Max usage is shown.Othercommerce_discount_usage.test113CommerceDiscountUsageTest->testCommerceDiscountUsageUIEditDiscount()
Analytics - Usage is shown.Othercommerce_discount_usage.test114CommerceDiscountUsageTest->testCommerceDiscountUsageUIEditDiscount()

All

Test namePassFailException
LeafDiscounts (CommerceDiscountTest) [Commerce Discount]35000
LeafDiscounts date (CommerceDiscountDateTest) [Commerce discounts]9400
ExpandDiscounts usage (CommerceDiscountUsageTest) [Commerce discounts]103111
MessageGroupFilenameLineFunctionStatus
Maximum usage per customer field is presentBrowsercommerce_discount_usage.test50CommerceDiscountUsageTest->testCommerceDiscountUsageUIAddDiscount()
Maximum overall usage field is presentBrowsercommerce_discount_usage.test51CommerceDiscountUsageTest->testCommerceDiscountUsageUIAddDiscount()
Failed to set field commerce_discount_fields[discount_usage_limit][und][0][value] to 5Othercommerce_discount_usage.test61CommerceDiscountUsageTest->testCommerceDiscountUsageUIAddDiscount()
Found the requested form fields at Othercommerce_discount_usage.test61CommerceDiscountUsageTest->testCommerceDiscountUsageUIAddDiscount()
EntityMetadataWrapperException: Invalid data value given. Be sure it matches the required data type and format. in EntityDrupalWrapper->set() (line 737 of /var/lib/drupaltestbot/sites/default/files/checkout/sites/default/modules/entity/includes/entity.wrapper.inc).Uncaught exceptionentity.wrapper.inc737EntityDrupalWrapper->set()
Maximum usage per customer field is presentBrowsercommerce_discount_usage.test91CommerceDiscountUsageTest->testCommerceDiscountUsageUIEditDiscount()
Maximum overall usage field is presentBrowsercommerce_discount_usage.test92CommerceDiscountUsageTest->testCommerceDiscountUsageUIEditDiscount()
Failed to set field commerce_discount_fields[discount_usage_limit][und][0][value] to 5Othercommerce_discount_usage.test102CommerceDiscountUsageTest->testCommerceDiscountUsageUIEditDiscount()
Found the requested form fields at Othercommerce_discount_usage.test102CommerceDiscountUsageTest->testCommerceDiscountUsageUIEditDiscount()
Discount max uses stored correctly.Othercommerce_discount_usage.test110CommerceDiscountUsageTest->testCommerceDiscountUsageUIEditDiscount()
Analytics - Max usage is shown.Othercommerce_discount_usage.test113CommerceDiscountUsageTest->testCommerceDiscountUsageUIEditDiscount()
Analytics - Usage is shown.Othercommerce_discount_usage.test114CommerceDiscountUsageTest->testCommerceDiscountUsageUIEditDiscount()