2601414.patch

Test status
StatusResult
Last receivedMon, 10/26/2015 - 16:20:00
Last requestedMon, 10/26/2015 - 16:20:01
Last testedMon, 10/26/2015 - 16:21:17
Test count1
Environment status
MySQLfail
File information
File2601414.patch
BranchTranslation template extractor - 7.x-3.x
LinkIssue Link
SummaryFAILED: [[SimpleTest]]: [MySQL] 213 pass(es), 0 fail(s), and 1 exception(s).
Details

MySQL

  1. Setup environment
  2. Detect an invalid patch URL
  3. Detect invalid repository information
  4. Detect invalid patch format
  5. Detect a non-applicable patch
  6. Detect invalid PHP syntax
  7. Detect a Drupal installation failure
  8. Detect a test run failure
  9. Detect a failing test
    Review the test failures below then if necessary run them locally until the problem has been fixed.
  10. Complete test suite with all tests passing
213 pass(es), 0 fail(s), and 1 exception(s)

Non-pass

Test namePassFailException
ExpandTranslation template extractor (PotxTestCase) [Translation template extractor]21301
MessageGroupFilenameLineFunctionStatus
Symfony\Component\Yaml\Exception\ParseException: Unable to parse at line 17 (near " mapping:"). in Symfony\Component\Yaml\Parser->parse() (line 243 of /var/lib/drupaltestbot/sites/default/files/checkout/sites/default/modules/potx/vendor/Symfony/Component/Yaml/Parser.php).Uncaught exceptionParser.php243Symfony\Component\Yaml\Parser->parse()

All

Test namePassFailException
ExpandTranslation template extractor (PotxTestCase) [Translation template extractor]21301
MessageGroupFilenameLineFunctionStatus
Symfony\Component\Yaml\Exception\ParseException: Unable to parse at line 17 (near " mapping:"). in Symfony\Component\Yaml\Parser->parse() (line 243 of /var/lib/drupaltestbot/sites/default/files/checkout/sites/default/modules/potx/vendor/Symfony/Component/Yaml/Parser.php).Uncaught exceptionParser.php243Symfony\Component\Yaml\Parser->parse()