remove_rounding_of-2468943-68.patch

Test status
StatusResult
Last receivedThu, 10/22/2015 - 05:22:01
Last requestedThu, 10/22/2015 - 05:22:02
Last testedThu, 10/22/2015 - 05:27:22
Test count1
Environment status
MySQLfail
File information
Fileremove_rounding_of-2468943-68.patch
BranchCommerce Discount - 7.x-1.x
LinkIssue Link
SummaryFAILED: [[SimpleTest]]: [MySQL] 558 pass(es), 1 fail(s), and 1 exception(s).
Details

MySQL

  1. Setup environment
  2. Detect an invalid patch URL
  3. Detect invalid repository information
  4. Detect invalid patch format
  5. Detect a non-applicable patch
  6. Detect invalid PHP syntax
  7. Detect a Drupal installation failure
  8. Detect a test run failure
  9. Detect a failing test
    Review the test failures below then if necessary run them locally until the problem has been fixed.
  10. Complete test suite with all tests passing
558 pass(es), 1 fail(s), and 1 exception(s)

Non-pass

Test namePassFailException
ExpandDiscounts (CommerceDiscountTest) [Commerce Discount]34811
MessageGroupFilenameLineFunctionStatus
Rounding does not inflate discount amountOthercommerce_discount.test640CommerceDiscountTest->testCommerceDiscountRounding()
PDOException: SQLSTATE[23000]: Integrity constraint violation: 1062 Duplicate entry 'product_discount_percentage' for key 'name': INSERT INTO {commerce_discount} (name, label, type, status, export_status, component_title, sort_order) VALUES (:db_insert_placeholder_0, :db_insert_placeholder_1, :db_insert_placeholder_2, :db_insert_placeholder_3, :db_insert_placeholder_4, :db_insert_placeholder_5, :db_insert_placeholder_6); Array ( [:db_insert_placeholder_0] => product_discount_percentage [:db_insert_placeholder_1] => product_discount_percentage [:db_insert_placeholder_2] => product_discount [:db_insert_placeholder_3] => 1 [:db_insert_placeholder_4] => 1 [:db_insert_placeholder_5] => product_discount_percentage [:db_insert_placeholder_6] => 10 ) in drupal_write_record() (line 7333 of /var/lib/drupaltestbot/sites/default/files/checkout/includes/common.inc).Uncaught exceptiondatabase.inc2171PDOStatement->execute()

All

Test namePassFailException
ExpandDiscounts (CommerceDiscountTest) [Commerce Discount]34811
MessageGroupFilenameLineFunctionStatus
Rounding does not inflate discount amountOthercommerce_discount.test640CommerceDiscountTest->testCommerceDiscountRounding()
PDOException: SQLSTATE[23000]: Integrity constraint violation: 1062 Duplicate entry 'product_discount_percentage' for key 'name': INSERT INTO {commerce_discount} (name, label, type, status, export_status, component_title, sort_order) VALUES (:db_insert_placeholder_0, :db_insert_placeholder_1, :db_insert_placeholder_2, :db_insert_placeholder_3, :db_insert_placeholder_4, :db_insert_placeholder_5, :db_insert_placeholder_6); Array ( [:db_insert_placeholder_0] => product_discount_percentage [:db_insert_placeholder_1] => product_discount_percentage [:db_insert_placeholder_2] => product_discount [:db_insert_placeholder_3] => 1 [:db_insert_placeholder_4] => 1 [:db_insert_placeholder_5] => product_discount_percentage [:db_insert_placeholder_6] => 10 ) in drupal_write_record() (line 7333 of /var/lib/drupaltestbot/sites/default/files/checkout/includes/common.inc).Uncaught exceptiondatabase.inc2171PDOStatement->execute()
LeafDiscounts date (CommerceDiscountDateTest) [Commerce discounts]9400
LeafDiscounts usage (CommerceDiscountUsageTest) [Commerce discounts]11600