commerce_order-refresh_order_object_after_each_checkout_pane_is_invoked-1804592-78.patch

Test status
StatusResult
Last receivedThu, 10/22/2015 - 03:06:00
Last requestedThu, 10/22/2015 - 03:06:01
Last testedThu, 10/22/2015 - 03:13:57
Test count1
Environment status
MySQLfail
File information
Filecommerce_order-refresh_order_object_after_each_checkout_pane_is_invoked-1804592-78.patch
BranchDrupal Commerce - 7.x-1.x
LinkIssue Link
SummaryFAILED: [[SimpleTest]]: [MySQL] 3,472 pass(es), 203 fail(s), and 167 exception(s).
Details

MySQL

  1. Setup environment
  2. Detect an invalid patch URL
  3. Detect invalid repository information
  4. Detect invalid patch format
  5. Detect a non-applicable patch
  6. Detect invalid PHP syntax
  7. Detect a Drupal installation failure
  8. Detect a test run failure
  9. Detect a failing test
    Review the test failures below then if necessary run them locally until the problem has been fixed.
  10. Complete test suite with all tests passing
3,472 pass(es), 203 fail(s), and 167 exception(s)

Non-pass

Test namePassFailException
ExpandCheckout process (CommerceCheckoutTestProcess) [Drupal Commerce]28310471
MessageGroupFilenameLineFunctionStatus
The owner of the order can access to the checkout pageBrowsercommerce_checkout.test124CommerceCheckoutTestProcess->testCommerceCheckoutProcessAuthenticatedUser()
simplexml_import_dom(): Invalid Nodetype to importWarningdrupal_web_test_case.php1915DrupalWebTestCase->parse()
Parsed page successfully.Browsercommerce_checkout.test125CommerceCheckoutTestProcess->testCommerceCheckoutProcessAuthenticatedUser()
current() expects parameter 1 to be array, boolean givenWarningdrupal_web_test_case.php3178DrupalWebTestCase->assertTitle()
Title of the checkout phase is correctOthercommerce_checkout.test125CommerceCheckoutTestProcess->testCommerceCheckoutProcessAuthenticatedUser()
Shopping cart contents pane is presentOthercommerce_checkout.test126CommerceCheckoutTestProcess->testCommerceCheckoutProcessAuthenticatedUser()
Billing information pane is presentOthercommerce_checkout.test127CommerceCheckoutTestProcess->testCommerceCheckoutProcessAuthenticatedUser()
simplexml_import_dom(): Invalid Nodetype to importWarningdrupal_web_test_case.php1915DrupalWebTestCase->parse()
Parsed page successfully.Browsercommerce_checkout.test137CommerceCheckoutTestProcess->testCommerceCheckoutProcessAuthenticatedUser()
simplexml_import_dom(): Invalid Nodetype to importWarningdrupal_web_test_case.php1915DrupalWebTestCase->parse()
Parsed page successfully.Browsercommerce_checkout.test138CommerceCheckoutTestProcess->testCommerceCheckoutProcessAuthenticatedUser()
Undefined index: ajaxNoticedrupal_web_test_case.php2189DrupalWebTestCase->drupalPostAJAX()
simplexml_import_dom(): Invalid Nodetype to importWarningdrupal_web_test_case.php1915DrupalWebTestCase->parse()
Parsed page successfully.Browsercommerce_checkout.test138CommerceCheckoutTestProcess->testCommerceCheckoutProcessAuthenticatedUser()
Invalid argument supplied for foreach()Warningdrupal_web_test_case.php2199DrupalWebTestCase->drupalPostAJAX()
simplexml_import_dom(): Invalid Nodetype to importWarningdrupal_web_test_case.php1915DrupalWebTestCase->parse()
Parsed page successfully.Browsercommerce_checkout.test138CommerceCheckoutTestProcess->testCommerceCheckoutProcessAuthenticatedUser()
Ajax response header found.Othercommerce_checkout.test138CommerceCheckoutTestProcess->testCommerceCheckoutProcessAuthenticatedUser()
simplexml_import_dom(): Invalid Nodetype to importWarningdrupal_web_test_case.php1915DrupalWebTestCase->parse()
Parsed page successfully.Browsercommerce_checkout.test142CommerceCheckoutTestProcess->testCommerceCheckoutProcessAuthenticatedUser()
Country selectedOthercommerce_checkout.test142CommerceCheckoutTestProcess->testCommerceCheckoutProcessAuthenticatedUser()
simplexml_import_dom(): Invalid Nodetype to importWarningdrupal_web_test_case.php1915DrupalWebTestCase->parse()
Parsed page successfully.Browsercommerce_checkout.test152CommerceCheckoutTestProcess->testCommerceCheckoutProcessAuthenticatedUser()
simplexml_import_dom(): Invalid Nodetype to importWarningdrupal_web_test_case.php1915DrupalWebTestCase->parse()
Parsed page successfully.Browsercommerce_checkout.test156CommerceCheckoutTestProcess->testCommerceCheckoutProcessAuthenticatedUser()
current() expects parameter 1 to be array, boolean givenWarningdrupal_web_test_case.php3178DrupalWebTestCase->assertTitle()
Title of the checkout phase 'Review order' is correctOthercommerce_checkout.test156CommerceCheckoutTestProcess->testCommerceCheckoutProcessAuthenticatedUser()
Billing information for 'name_line' is correctOthercommerce_checkout.test157CommerceCheckoutTestProcess->testCommerceCheckoutProcessAuthenticatedUser()
Billing information for 'thoroughfare' is correctOthercommerce_checkout.test158CommerceCheckoutTestProcess->testCommerceCheckoutProcessAuthenticatedUser()
Billing information for 'locality' is correctOthercommerce_checkout.test159CommerceCheckoutTestProcess->testCommerceCheckoutProcessAuthenticatedUser()
Billing information for 'postal_code' is correctOthercommerce_checkout.test160CommerceCheckoutTestProcess->testCommerceCheckoutProcessAuthenticatedUser()
Billing information country is correctOthercommerce_checkout.test161CommerceCheckoutTestProcess->testCommerceCheckoutProcessAuthenticatedUser()
Example payment method pane is presentOthercommerce_checkout.test162CommerceCheckoutTestProcess->testCommerceCheckoutProcessAuthenticatedUser()
Order status is 'Checkout Review' in the review phase.Othercommerce_checkout.test170CommerceCheckoutTestProcess->testCommerceCheckoutProcessAuthenticatedUser()
simplexml_import_dom(): Invalid Nodetype to importWarningdrupal_web_test_case.php1915DrupalWebTestCase->parse()
Parsed page successfully.Browsercommerce_checkout.test173CommerceCheckoutTestProcess->testCommerceCheckoutProcessAuthenticatedUser()
simplexml_import_dom(): Invalid Nodetype to importWarningdrupal_web_test_case.php1915DrupalWebTestCase->parse()
Parsed page successfully.Browsercommerce_checkout.test174CommerceCheckoutTestProcess->testCommerceCheckoutProcessAuthenticatedUser()
current() expects parameter 1 to be array, boolean givenWarningdrupal_web_test_case.php3178DrupalWebTestCase->assertTitle()
When clicking in the 'Back' button, the title displayed corresponds with the current checkout phase: 'Checkout'Othercommerce_checkout.test174CommerceCheckoutTestProcess->testCommerceCheckoutProcessAuthenticatedUser()
simplexml_import_dom(): Invalid Nodetype to importWarningdrupal_web_test_case.php1915DrupalWebTestCase->parse()
Parsed page successfully.Browsercommerce_checkout.test175CommerceCheckoutTestProcess->testCommerceCheckoutProcessAuthenticatedUser()
simplexml_import_dom(): Invalid Nodetype to importWarningdrupal_web_test_case.php1915DrupalWebTestCase->parse()
Parsed page successfully.Browsercommerce_checkout.test176CommerceCheckoutTestProcess->testCommerceCheckoutProcessAuthenticatedUser()
current() expects parameter 1 to be array, boolean givenWarningdrupal_web_test_case.php3178DrupalWebTestCase->assertTitle()
When clicking in the 'Continue' button, the title displayed corresponds with the current checkout phase: 'Review order'Othercommerce_checkout.test176CommerceCheckoutTestProcess->testCommerceCheckoutProcessAuthenticatedUser()
simplexml_import_dom(): Invalid Nodetype to importWarningdrupal_web_test_case.php1915DrupalWebTestCase->parse()
Parsed page successfully.Browsercommerce_checkout.test179CommerceCheckoutTestProcess->testCommerceCheckoutProcessAuthenticatedUser()
Order status is 'Pending' after completing checkoutOthercommerce_checkout.test185CommerceCheckoutTestProcess->testCommerceCheckoutProcessAuthenticatedUser()
simplexml_import_dom(): Invalid Nodetype to importWarningdrupal_web_test_case.php1915DrupalWebTestCase->parse()
Parsed page successfully.Browsercommerce_checkout.test187CommerceCheckoutTestProcess->testCommerceCheckoutProcessAuthenticatedUser()
current() expects parameter 1 to be array, boolean givenWarningdrupal_web_test_case.php3178DrupalWebTestCase->assertTitle()
Title of the page is 'Checkout complete' when finishing the checkout processOthercommerce_checkout.test187CommerceCheckoutTestProcess->testCommerceCheckoutProcessAuthenticatedUser()
Completion message for the checkout is correctly displayedOthercommerce_checkout.test188CommerceCheckoutTestProcess->testCommerceCheckoutProcessAuthenticatedUser()
Billing information pane is present in the checkout pageOthercommerce_checkout.test201CommerceCheckoutTestProcess->testCommerceCheckoutValidatePanesAnonymousUser()
Account information pane is present in the checkout pageOthercommerce_checkout.test202CommerceCheckoutTestProcess->testCommerceCheckoutValidatePanesAnonymousUser()
simplexml_import_dom(): Invalid Nodetype to importWarningdrupal_web_test_case.php1915DrupalWebTestCase->parse()
Parsed page successfully.Browsercommerce_checkout.test205CommerceCheckoutTestProcess->testCommerceCheckoutValidatePanesAnonymousUser()
Check required account pane message.Othercommerce_checkout.test225CommerceCheckoutTestProcess->testCommerceCheckoutValidatePanesAnonymousUser()
simplexml_import_dom(): Invalid Nodetype to importWarningdrupal_web_test_case.php1915DrupalWebTestCase->parse()
Parsed page successfully.Browsercommerce_checkout.test236CommerceCheckoutTestProcess->testCommerceCheckoutValidatePanesAnonymousUser()
simplexml_import_dom(): Invalid Nodetype to importWarningdrupal_web_test_case.php1915DrupalWebTestCase->parse()
Parsed page successfully.Browsercommerce_checkout.test237CommerceCheckoutTestProcess->testCommerceCheckoutValidatePanesAnonymousUser()
Undefined index: ajaxNoticedrupal_web_test_case.php2189DrupalWebTestCase->drupalPostAJAX()
simplexml_import_dom(): Invalid Nodetype to importWarningdrupal_web_test_case.php1915DrupalWebTestCase->parse()
Parsed page successfully.Browsercommerce_checkout.test237CommerceCheckoutTestProcess->testCommerceCheckoutValidatePanesAnonymousUser()
Invalid argument supplied for foreach()Warningdrupal_web_test_case.php2199DrupalWebTestCase->drupalPostAJAX()
simplexml_import_dom(): Invalid Nodetype to importWarningdrupal_web_test_case.php1915DrupalWebTestCase->parse()
Parsed page successfully.Browsercommerce_checkout.test237CommerceCheckoutTestProcess->testCommerceCheckoutValidatePanesAnonymousUser()
Ajax response header found.Othercommerce_checkout.test237CommerceCheckoutTestProcess->testCommerceCheckoutValidatePanesAnonymousUser()
simplexml_import_dom(): Invalid Nodetype to importWarningdrupal_web_test_case.php1915DrupalWebTestCase->parse()
Parsed page successfully.Browsercommerce_checkout.test254CommerceCheckoutTestProcess->testCommerceCheckoutValidatePanesAnonymousUser()
A warning message is displayed when the e-mail address for the anonymous user is not validOthercommerce_checkout.test257CommerceCheckoutTestProcess->testCommerceCheckoutValidatePanesAnonymousUser()
simplexml_import_dom(): Invalid Nodetype to importWarningdrupal_web_test_case.php1915DrupalWebTestCase->parse()
Parsed page successfully.Browsercommerce_checkout.test262CommerceCheckoutTestProcess->testCommerceCheckoutValidatePanesAnonymousUser()
simplexml_import_dom(): Invalid Nodetype to importWarningdrupal_web_test_case.php1915DrupalWebTestCase->parse()
Parsed page successfully.Browsercommerce_checkout.test267CommerceCheckoutTestProcess->testCommerceCheckoutValidatePanesAnonymousUser()
Anonymous user can access to the checkout page for the order.Browsercommerce_checkout.test280CommerceCheckoutTestProcess->testCommerceCheckoutProcessAnonymousUser()
simplexml_import_dom(): Invalid Nodetype to importWarningdrupal_web_test_case.php1915DrupalWebTestCase->parse()
Parsed page successfully.Browsercommerce_checkout.test281CommerceCheckoutTestProcess->testCommerceCheckoutProcessAnonymousUser()
current() expects parameter 1 to be array, boolean givenWarningdrupal_web_test_case.php3178DrupalWebTestCase->assertTitle()
Title of the checkout phase is correctOthercommerce_checkout.test281CommerceCheckoutTestProcess->testCommerceCheckoutProcessAnonymousUser()
Shopping cart contents pane is presentOthercommerce_checkout.test282CommerceCheckoutTestProcess->testCommerceCheckoutProcessAnonymousUser()
Billing information pane is presentOthercommerce_checkout.test283CommerceCheckoutTestProcess->testCommerceCheckoutProcessAnonymousUser()
Account information pane is presentOthercommerce_checkout.test284CommerceCheckoutTestProcess->testCommerceCheckoutProcessAnonymousUser()
simplexml_import_dom(): Invalid Nodetype to importWarningdrupal_web_test_case.php1915DrupalWebTestCase->parse()
Parsed page successfully.Browsercommerce_checkout.test291CommerceCheckoutTestProcess->testCommerceCheckoutProcessAnonymousUser()
simplexml_import_dom(): Invalid Nodetype to importWarningdrupal_web_test_case.php1915DrupalWebTestCase->parse()
Parsed page successfully.Browsercommerce_checkout.test292CommerceCheckoutTestProcess->testCommerceCheckoutProcessAnonymousUser()
Undefined index: ajaxNoticedrupal_web_test_case.php2189DrupalWebTestCase->drupalPostAJAX()
simplexml_import_dom(): Invalid Nodetype to importWarningdrupal_web_test_case.php1915DrupalWebTestCase->parse()
Parsed page successfully.Browsercommerce_checkout.test292CommerceCheckoutTestProcess->testCommerceCheckoutProcessAnonymousUser()
Invalid argument supplied for foreach()Warningdrupal_web_test_case.php2199DrupalWebTestCase->drupalPostAJAX()
simplexml_import_dom(): Invalid Nodetype to importWarningdrupal_web_test_case.php1915DrupalWebTestCase->parse()
Parsed page successfully.Browsercommerce_checkout.test292CommerceCheckoutTestProcess->testCommerceCheckoutProcessAnonymousUser()
Ajax response header found.Othercommerce_checkout.test292CommerceCheckoutTestProcess->testCommerceCheckoutProcessAnonymousUser()
simplexml_import_dom(): Invalid Nodetype to importWarningdrupal_web_test_case.php1915DrupalWebTestCase->parse()
Parsed page successfully.Browsercommerce_checkout.test296CommerceCheckoutTestProcess->testCommerceCheckoutProcessAnonymousUser()
Country selectedOthercommerce_checkout.test296CommerceCheckoutTestProcess->testCommerceCheckoutProcessAnonymousUser()
simplexml_import_dom(): Invalid Nodetype to importWarningdrupal_web_test_case.php1915DrupalWebTestCase->parse()
Parsed page successfully.Browsercommerce_checkout.test313CommerceCheckoutTestProcess->testCommerceCheckoutProcessAnonymousUser()
simplexml_import_dom(): Invalid Nodetype to importWarningdrupal_web_test_case.php1915DrupalWebTestCase->parse()
Parsed page successfully.Browsercommerce_checkout.test317CommerceCheckoutTestProcess->testCommerceCheckoutProcessAnonymousUser()
current() expects parameter 1 to be array, boolean givenWarningdrupal_web_test_case.php3178DrupalWebTestCase->assertTitle()
Title of the checkout phase 'Review order' is correctOthercommerce_checkout.test317CommerceCheckoutTestProcess->testCommerceCheckoutProcessAnonymousUser()
Billing information for 'name_line' is correctOthercommerce_checkout.test318CommerceCheckoutTestProcess->testCommerceCheckoutProcessAnonymousUser()
Billing information for 'thoroughfare' is correctOthercommerce_checkout.test319CommerceCheckoutTestProcess->testCommerceCheckoutProcessAnonymousUser()
Billing information for 'locality' is correctOthercommerce_checkout.test320CommerceCheckoutTestProcess->testCommerceCheckoutProcessAnonymousUser()
Billing information for 'postal_code' is correctOthercommerce_checkout.test321CommerceCheckoutTestProcess->testCommerceCheckoutProcessAnonymousUser()
Billing information country is correctOthercommerce_checkout.test322CommerceCheckoutTestProcess->testCommerceCheckoutProcessAnonymousUser()
Example payment method pane is presentOthercommerce_checkout.test323CommerceCheckoutTestProcess->testCommerceCheckoutProcessAnonymousUser()
Account information is correctOthercommerce_checkout.test324CommerceCheckoutTestProcess->testCommerceCheckoutProcessAnonymousUser()
Order status is 'Checkout Review' in the review phase.Othercommerce_checkout.test332CommerceCheckoutTestProcess->testCommerceCheckoutProcessAnonymousUser()
simplexml_import_dom(): Invalid Nodetype to importWarningdrupal_web_test_case.php1915DrupalWebTestCase->parse()
Parsed page successfully.Browsercommerce_checkout.test335CommerceCheckoutTestProcess->testCommerceCheckoutProcessAnonymousUser()
Order status is 'Pending' after completing checkout.Othercommerce_checkout.test341CommerceCheckoutTestProcess->testCommerceCheckoutProcessAnonymousUser()
simplexml_import_dom(): Invalid Nodetype to importWarningdrupal_web_test_case.php1915DrupalWebTestCase->parse()
Parsed page successfully.Browsercommerce_checkout.test344CommerceCheckoutTestProcess->testCommerceCheckoutProcessAnonymousUser()
current() expects parameter 1 to be array, boolean givenWarningdrupal_web_test_case.php3178DrupalWebTestCase->assertTitle()
Title of the page is 'Checkout complete' when finishing the checkout processOthercommerce_checkout.test344CommerceCheckoutTestProcess->testCommerceCheckoutProcessAnonymousUser()
Completion message for the checkout is correctly displayedOthercommerce_checkout.test346CommerceCheckoutTestProcess->testCommerceCheckoutProcessAnonymousUser()
simplexml_import_dom(): Invalid Nodetype to importWarningdrupal_web_test_case.php1915DrupalWebTestCase->parse()
Parsed page successfully.Browsercommerce_checkout.test364CommerceCheckoutTestProcess->testCommerceCheckoutProcessAnonymousExistingUser()
simplexml_import_dom(): Invalid Nodetype to importWarningdrupal_web_test_case.php1915DrupalWebTestCase->parse()
Parsed page successfully.Browsercommerce_checkout.test365CommerceCheckoutTestProcess->testCommerceCheckoutProcessAnonymousExistingUser()
Undefined index: ajaxNoticedrupal_web_test_case.php2189DrupalWebTestCase->drupalPostAJAX()
simplexml_import_dom(): Invalid Nodetype to importWarningdrupal_web_test_case.php1915DrupalWebTestCase->parse()
Parsed page successfully.Browsercommerce_checkout.test365CommerceCheckoutTestProcess->testCommerceCheckoutProcessAnonymousExistingUser()
Invalid argument supplied for foreach()Warningdrupal_web_test_case.php2199DrupalWebTestCase->drupalPostAJAX()
simplexml_import_dom(): Invalid Nodetype to importWarningdrupal_web_test_case.php1915DrupalWebTestCase->parse()
Parsed page successfully.Browsercommerce_checkout.test365CommerceCheckoutTestProcess->testCommerceCheckoutProcessAnonymousExistingUser()
Ajax response header found.Othercommerce_checkout.test365CommerceCheckoutTestProcess->testCommerceCheckoutProcessAnonymousExistingUser()
simplexml_import_dom(): Invalid Nodetype to importWarningdrupal_web_test_case.php1915DrupalWebTestCase->parse()
Parsed page successfully.Browsercommerce_checkout.test382CommerceCheckoutTestProcess->testCommerceCheckoutProcessAnonymousExistingUser()
simplexml_import_dom(): Invalid Nodetype to importWarningdrupal_web_test_case.php1915DrupalWebTestCase->parse()
Parsed page successfully.Browsercommerce_checkout.test385CommerceCheckoutTestProcess->testCommerceCheckoutProcessAnonymousExistingUser()
The order has been correctly assigned to the user owner of the mail addressOthercommerce_checkout.test391CommerceCheckoutTestProcess->testCommerceCheckoutProcessAnonymousExistingUser()
simplexml_import_dom(): Invalid Nodetype to importWarningdrupal_web_test_case.php1915DrupalWebTestCase->parse()
Parsed page successfully.Browsercommerce_checkout.test410CommerceCheckoutTestProcess->testCommerceCheckoutProcessAnonymousNonExistingUser()
simplexml_import_dom(): Invalid Nodetype to importWarningdrupal_web_test_case.php1915DrupalWebTestCase->parse()
Parsed page successfully.Browsercommerce_checkout.test411CommerceCheckoutTestProcess->testCommerceCheckoutProcessAnonymousNonExistingUser()
Undefined index: ajaxNoticedrupal_web_test_case.php2189DrupalWebTestCase->drupalPostAJAX()
simplexml_import_dom(): Invalid Nodetype to importWarningdrupal_web_test_case.php1915DrupalWebTestCase->parse()
Parsed page successfully.Browsercommerce_checkout.test411CommerceCheckoutTestProcess->testCommerceCheckoutProcessAnonymousNonExistingUser()
Invalid argument supplied for foreach()Warningdrupal_web_test_case.php2199DrupalWebTestCase->drupalPostAJAX()
simplexml_import_dom(): Invalid Nodetype to importWarningdrupal_web_test_case.php1915DrupalWebTestCase->parse()
Parsed page successfully.Browsercommerce_checkout.test411CommerceCheckoutTestProcess->testCommerceCheckoutProcessAnonymousNonExistingUser()
Ajax response header found.Othercommerce_checkout.test411CommerceCheckoutTestProcess->testCommerceCheckoutProcessAnonymousNonExistingUser()
simplexml_import_dom(): Invalid Nodetype to importWarningdrupal_web_test_case.php1915DrupalWebTestCase->parse()
Parsed page successfully.Browsercommerce_checkout.test428CommerceCheckoutTestProcess->testCommerceCheckoutProcessAnonymousNonExistingUser()
simplexml_import_dom(): Invalid Nodetype to importWarningdrupal_web_test_case.php1915DrupalWebTestCase->parse()
Parsed page successfully.Browsercommerce_checkout.test431CommerceCheckoutTestProcess->testCommerceCheckoutProcessAnonymousNonExistingUser()
The e-mail address of the owner of the order matches the one in the checkout inputOthercommerce_checkout.test438CommerceCheckoutTestProcess->testCommerceCheckoutProcessAnonymousNonExistingUser()
User id of the new user is higher than the last user created then it is a new accountOthercommerce_checkout.test439CommerceCheckoutTestProcess->testCommerceCheckoutProcessAnonymousNonExistingUser()
simplexml_import_dom(): Invalid Nodetype to importWarningdrupal_web_test_case.php1915DrupalWebTestCase->parse()
Parsed page successfully.Browsercommerce_checkout.test493CommerceCheckoutTestProcess->testCommerceCheckoutAccessPages()
simplexml_import_dom(): Invalid Nodetype to importWarningdrupal_web_test_case.php1915DrupalWebTestCase->parse()
Parsed page successfully.Browsercommerce_checkout.test494CommerceCheckoutTestProcess->testCommerceCheckoutAccessPages()
Undefined index: ajaxNoticedrupal_web_test_case.php2189DrupalWebTestCase->drupalPostAJAX()
simplexml_import_dom(): Invalid Nodetype to importWarningdrupal_web_test_case.php1915DrupalWebTestCase->parse()
Parsed page successfully.Browsercommerce_checkout.test494CommerceCheckoutTestProcess->testCommerceCheckoutAccessPages()
Invalid argument supplied for foreach()Warningdrupal_web_test_case.php2199DrupalWebTestCase->drupalPostAJAX()
simplexml_import_dom(): Invalid Nodetype to importWarningdrupal_web_test_case.php1915DrupalWebTestCase->parse()
Parsed page successfully.Browsercommerce_checkout.test494CommerceCheckoutTestProcess->testCommerceCheckoutAccessPages()
Ajax response header found.Othercommerce_checkout.test494CommerceCheckoutTestProcess->testCommerceCheckoutAccessPages()
simplexml_import_dom(): Invalid Nodetype to importWarningdrupal_web_test_case.php1915DrupalWebTestCase->parse()
Parsed page successfully.Browsercommerce_checkout.test498CommerceCheckoutTestProcess->testCommerceCheckoutAccessPages()
Country selectedOthercommerce_checkout.test498CommerceCheckoutTestProcess->testCommerceCheckoutAccessPages()
simplexml_import_dom(): Invalid Nodetype to importWarningdrupal_web_test_case.php1915DrupalWebTestCase->parse()
Parsed page successfully.Browsercommerce_checkout.test508CommerceCheckoutTestProcess->testCommerceCheckoutAccessPages()
review checkout page is accessible.Othercommerce_checkout.test513CommerceCheckoutTestProcess->testCommerceCheckoutAccessPages()
simplexml_import_dom(): Invalid Nodetype to importWarningdrupal_web_test_case.php1915DrupalWebTestCase->parse()
Parsed page successfully.Browsercommerce_checkout.test518CommerceCheckoutTestProcess->testCommerceCheckoutAccessPages()
checkout page is not accessible.Othercommerce_checkout.test521CommerceCheckoutTestProcess->testCommerceCheckoutAccessPages()
complete checkout page is accessible.Othercommerce_checkout.test524CommerceCheckoutTestProcess->testCommerceCheckoutAccessPages()
ExpandCommerce base (CommerceBaseTesterTestCase) [Drupal Commerce]21432
MessageGroupFilenameLineFunctionStatus
simplexml_import_dom(): Invalid Nodetype to importWarningdrupal_web_test_case.php1915DrupalWebTestCase->parse()
Parsed page successfully.Browsercommerce_base.test916CommerceBaseTesterTestCase->testTestCreateDummyOrder()
current() expects parameter 1 to be array, boolean givenWarningdrupal_web_test_case.php3178DrupalWebTestCase->assertTitle()
Checkout accessible for the orderOthercommerce_base.test916CommerceBaseTesterTestCase->testTestCreateDummyOrder()
Product is added to the orderOthercommerce_base.test917CommerceBaseTesterTestCase->testTestCreateDummyOrder()
ExpandCustomer user interface (CommerceCustomerUITest) [Drupal Commerce]4172430
MessageGroupFilenameLineFunctionStatus
simplexml_import_dom(): Invalid Nodetype to importWarningdrupal_web_test_case.php1915DrupalWebTestCase->parse()
Parsed page successfully.Browsercommerce_customer_ui.test398CommerceCustomerUITest->testCommerceCustomerUIAddProfileViaCheckout()
simplexml_import_dom(): Invalid Nodetype to importWarningdrupal_web_test_case.php1915DrupalWebTestCase->parse()
Parsed page successfully.Browsercommerce_customer_ui.test399CommerceCustomerUITest->testCommerceCustomerUIAddProfileViaCheckout()
Undefined index: ajaxNoticedrupal_web_test_case.php2189DrupalWebTestCase->drupalPostAJAX()
simplexml_import_dom(): Invalid Nodetype to importWarningdrupal_web_test_case.php1915DrupalWebTestCase->parse()
Parsed page successfully.Browsercommerce_customer_ui.test399CommerceCustomerUITest->testCommerceCustomerUIAddProfileViaCheckout()
Invalid argument supplied for foreach()Warningdrupal_web_test_case.php2199DrupalWebTestCase->drupalPostAJAX()
simplexml_import_dom(): Invalid Nodetype to importWarningdrupal_web_test_case.php1915DrupalWebTestCase->parse()
Parsed page successfully.Browsercommerce_customer_ui.test399CommerceCustomerUITest->testCommerceCustomerUIAddProfileViaCheckout()
Ajax response header found.Othercommerce_customer_ui.test399CommerceCustomerUITest->testCommerceCustomerUIAddProfileViaCheckout()
simplexml_import_dom(): Invalid Nodetype to importWarningdrupal_web_test_case.php1915DrupalWebTestCase->parse()
Parsed page successfully.Browsercommerce_customer_ui.test403CommerceCustomerUITest->testCommerceCustomerUIAddProfileViaCheckout()
Country selectedOthercommerce_customer_ui.test403CommerceCustomerUITest->testCommerceCustomerUIAddProfileViaCheckout()
simplexml_import_dom(): Invalid Nodetype to importWarningdrupal_web_test_case.php1915DrupalWebTestCase->parse()
Parsed page successfully.Browsercommerce_customer_ui.test413CommerceCustomerUITest->testCommerceCustomerUIAddProfileViaCheckout()
simplexml_import_dom(): Invalid Nodetype to importWarningdrupal_web_test_case.php1915DrupalWebTestCase->parse()
Parsed page successfully.Browsercommerce_customer_ui.test416CommerceCustomerUITest->testCommerceCustomerUIAddProfileViaCheckout()
EntityMetadataWrapperException: Unknown data property commerce_customer_address. in EntityStructureWrapper->getPropertyInfo() (line 335 of /var/lib/drupaltestbot/sites/default/files/checkout/sites/default/modules/entity/includes/entity.wrapper.inc).Uncaught exceptionentity.wrapper.inc335EntityStructureWrapper->getPropertyInfo()
simplexml_import_dom(): Invalid Nodetype to importWarningdrupal_web_test_case.php1915DrupalWebTestCase->parse()
Parsed page successfully.Browsercommerce_customer_ui.test630CommerceCustomerUITest->_testCommerceCustomerUIProfileCopy()
simplexml_import_dom(): Invalid Nodetype to importWarningdrupal_web_test_case.php1915DrupalWebTestCase->parse()
Parsed page successfully.Browsercommerce_customer_ui.test631CommerceCustomerUITest->_testCommerceCustomerUIProfileCopy()
Undefined index: ajaxNoticedrupal_web_test_case.php2189DrupalWebTestCase->drupalPostAJAX()
simplexml_import_dom(): Invalid Nodetype to importWarningdrupal_web_test_case.php1915DrupalWebTestCase->parse()
Parsed page successfully.Browsercommerce_customer_ui.test631CommerceCustomerUITest->_testCommerceCustomerUIProfileCopy()
Invalid argument supplied for foreach()Warningdrupal_web_test_case.php2199DrupalWebTestCase->drupalPostAJAX()
simplexml_import_dom(): Invalid Nodetype to importWarningdrupal_web_test_case.php1915DrupalWebTestCase->parse()
Parsed page successfully.Browsercommerce_customer_ui.test631CommerceCustomerUITest->_testCommerceCustomerUIProfileCopy()
Ajax response header found.Othercommerce_customer_ui.test631CommerceCustomerUITest->_testCommerceCustomerUIProfileCopy()
simplexml_import_dom(): Invalid Nodetype to importWarningdrupal_web_test_case.php1915DrupalWebTestCase->parse()
Parsed page successfully.Browsercommerce_customer_ui.test643CommerceCustomerUITest->_testCommerceCustomerUIProfileCopy()
Undefined index: ajaxNoticedrupal_web_test_case.php2189DrupalWebTestCase->drupalPostAJAX()
simplexml_import_dom(): Invalid Nodetype to importWarningdrupal_web_test_case.php1915DrupalWebTestCase->parse()
Parsed page successfully.Browsercommerce_customer_ui.test643CommerceCustomerUITest->_testCommerceCustomerUIProfileCopy()
Invalid argument supplied for foreach()Warningdrupal_web_test_case.php2199DrupalWebTestCase->drupalPostAJAX()
simplexml_import_dom(): Invalid Nodetype to importWarningdrupal_web_test_case.php1915DrupalWebTestCase->parse()
Parsed page successfully.Browsercommerce_customer_ui.test643CommerceCustomerUITest->_testCommerceCustomerUIProfileCopy()
Ajax response header found.Othercommerce_customer_ui.test643CommerceCustomerUITest->_testCommerceCustomerUIProfileCopy()
simplexml_import_dom(): Invalid Nodetype to importWarningdrupal_web_test_case.php1915DrupalWebTestCase->parse()
Parsed page successfully.Browsercommerce_customer_ui.test644CommerceCustomerUITest->_testCommerceCustomerUIProfileCopy()
EntityMetadataWrapperException: Unknown data property commerce_customer_address. in EntityStructureWrapper->getPropertyInfo() (line 335 of /var/lib/drupaltestbot/sites/default/files/checkout/sites/default/modules/entity/includes/entity.wrapper.inc).Uncaught exceptionentity.wrapper.inc335EntityStructureWrapper->getPropertyInfo()
simplexml_import_dom(): Invalid Nodetype to importWarningdrupal_web_test_case.php1915DrupalWebTestCase->parse()
Parsed page successfully.Browsercommerce_customer_ui.test643CommerceCustomerUITest->_testCommerceCustomerUIProfileCopy()
Undefined index: ajaxNoticedrupal_web_test_case.php2189DrupalWebTestCase->drupalPostAJAX()
simplexml_import_dom(): Invalid Nodetype to importWarningdrupal_web_test_case.php1915DrupalWebTestCase->parse()
Parsed page successfully.Browsercommerce_customer_ui.test643CommerceCustomerUITest->_testCommerceCustomerUIProfileCopy()
Invalid argument supplied for foreach()Warningdrupal_web_test_case.php2199DrupalWebTestCase->drupalPostAJAX()
simplexml_import_dom(): Invalid Nodetype to importWarningdrupal_web_test_case.php1915DrupalWebTestCase->parse()
Parsed page successfully.Browsercommerce_customer_ui.test643CommerceCustomerUITest->_testCommerceCustomerUIProfileCopy()
Ajax response header found.Othercommerce_customer_ui.test643CommerceCustomerUITest->_testCommerceCustomerUIProfileCopy()
simplexml_import_dom(): Invalid Nodetype to importWarningdrupal_web_test_case.php1915DrupalWebTestCase->parse()
Parsed page successfully.Browsercommerce_customer_ui.test644CommerceCustomerUITest->_testCommerceCustomerUIProfileCopy()
EntityMetadataWrapperException: Unknown data property commerce_customer_address. in EntityStructureWrapper->getPropertyInfo() (line 335 of /var/lib/drupaltestbot/sites/default/files/checkout/sites/default/modules/entity/includes/entity.wrapper.inc).Uncaught exceptionentity.wrapper.inc335EntityStructureWrapper->getPropertyInfo()
ExpandPayment Offsite (CommercePaymentOffsiteTest) [Drupal Commerce]3398
MessageGroupFilenameLineFunctionStatus
simplexml_import_dom(): Invalid Nodetype to importWarningdrupal_web_test_case.php1915DrupalWebTestCase->parse()
Parsed page successfully.Browsercommerce_payment_ui.test317CommercePaymentOffsiteTest->testCommercePaymentOffsitePayment()
Offsite example payment method is listed in the checkout process formOthercommerce_payment_ui.test318CommercePaymentOffsiteTest->testCommercePaymentOffsitePayment()
simplexml_import_dom(): Invalid Nodetype to importWarningdrupal_web_test_case.php1915DrupalWebTestCase->parse()
Parsed page successfully.Browsercommerce_payment_ui.test319CommercePaymentOffsiteTest->testCommercePaymentOffsitePayment()
Undefined index: ajaxNoticedrupal_web_test_case.php2189DrupalWebTestCase->drupalPostAJAX()
simplexml_import_dom(): Invalid Nodetype to importWarningdrupal_web_test_case.php1915DrupalWebTestCase->parse()
Parsed page successfully.Browsercommerce_payment_ui.test319CommercePaymentOffsiteTest->testCommercePaymentOffsitePayment()
Invalid argument supplied for foreach()Warningdrupal_web_test_case.php2199DrupalWebTestCase->drupalPostAJAX()
simplexml_import_dom(): Invalid Nodetype to importWarningdrupal_web_test_case.php1915DrupalWebTestCase->parse()
Parsed page successfully.Browsercommerce_payment_ui.test319CommercePaymentOffsiteTest->testCommercePaymentOffsitePayment()
Ajax response header found.Othercommerce_payment_ui.test319CommercePaymentOffsiteTest->testCommercePaymentOffsitePayment()
simplexml_import_dom(): Invalid Nodetype to importWarningdrupal_web_test_case.php1915DrupalWebTestCase->parse()
Parsed page successfully.Browsercommerce_payment_ui.test320CommercePaymentOffsiteTest->testCommercePaymentOffsitePayment()
simplexml_import_dom(): Invalid Nodetype to importWarningdrupal_web_test_case.php1915DrupalWebTestCase->parse()
Parsed page successfully.Browsercommerce_payment_ui.test322CommercePaymentOffsiteTest->testCommercePaymentOffsitePayment()
Redirection button to offsite payment platform is presentBrowsercommerce_payment_ui.test322CommercePaymentOffsiteTest->testCommercePaymentOffsitePayment()
ExpandPayment user interface (CommercePaymentUITest) [Drupal Commerce]1784540
MessageGroupFilenameLineFunctionStatus
Store customer user is able to access the checkout pageBrowsercommerce_payment_ui.test64CommercePaymentUITest->createOrderAndGoToPayment()
simplexml_import_dom(): Invalid Nodetype to importWarningdrupal_web_test_case.php1915DrupalWebTestCase->parse()
Parsed page successfully.Browsercommerce_payment_ui.test65CommercePaymentUITest->createOrderAndGoToPayment()
current() expects parameter 1 to be array, boolean givenWarningdrupal_web_test_case.php3178DrupalWebTestCase->assertTitle()
Checkout page successfully loadedOthercommerce_payment_ui.test65CommercePaymentUITest->createOrderAndGoToPayment()
simplexml_import_dom(): Invalid Nodetype to importWarningdrupal_web_test_case.php1915DrupalWebTestCase->parse()
Parsed page successfully.Browsercommerce_payment_ui.test71CommercePaymentUITest->createOrderAndGoToPayment()
simplexml_import_dom(): Invalid Nodetype to importWarningdrupal_web_test_case.php1915DrupalWebTestCase->parse()
Parsed page successfully.Browsercommerce_payment_ui.test72CommercePaymentUITest->createOrderAndGoToPayment()
Undefined index: ajaxNoticedrupal_web_test_case.php2189DrupalWebTestCase->drupalPostAJAX()
simplexml_import_dom(): Invalid Nodetype to importWarningdrupal_web_test_case.php1915DrupalWebTestCase->parse()
Parsed page successfully.Browsercommerce_payment_ui.test72CommercePaymentUITest->createOrderAndGoToPayment()
Invalid argument supplied for foreach()Warningdrupal_web_test_case.php2199DrupalWebTestCase->drupalPostAJAX()
simplexml_import_dom(): Invalid Nodetype to importWarningdrupal_web_test_case.php1915DrupalWebTestCase->parse()
Parsed page successfully.Browsercommerce_payment_ui.test72CommercePaymentUITest->createOrderAndGoToPayment()
Ajax response header found.Othercommerce_payment_ui.test72CommercePaymentUITest->createOrderAndGoToPayment()
simplexml_import_dom(): Invalid Nodetype to importWarningdrupal_web_test_case.php1915DrupalWebTestCase->parse()
Parsed page successfully.Browsercommerce_payment_ui.test76CommercePaymentUITest->createOrderAndGoToPayment()
Country selectedOthercommerce_payment_ui.test76CommercePaymentUITest->createOrderAndGoToPayment()
simplexml_import_dom(): Invalid Nodetype to importWarningdrupal_web_test_case.php1915DrupalWebTestCase->parse()
Parsed page successfully.Browsercommerce_payment_ui.test86CommercePaymentUITest->createOrderAndGoToPayment()
simplexml_import_dom(): Invalid Nodetype to importWarningdrupal_web_test_case.php1915DrupalWebTestCase->parse()
Parsed page successfully.Browsercommerce_payment_ui.test89CommercePaymentUITest->createOrderAndGoToPayment()
current() expects parameter 1 to be array, boolean givenWarningdrupal_web_test_case.php3178DrupalWebTestCase->assertTitle()
Review order page successfully loadedOthercommerce_payment_ui.test89CommercePaymentUITest->createOrderAndGoToPayment()
Example payment method pane is presentOthercommerce_payment_ui.test98CommercePaymentUITest->testCommercePaymentCheckout()
simplexml_import_dom(): Invalid Nodetype to importWarningdrupal_web_test_case.php1915DrupalWebTestCase->parse()
Parsed page successfully.Browsercommerce_payment_ui.test101CommercePaymentUITest->testCommercePaymentCheckout()
Trying to get property of non-objectNoticecommerce_payment_ui.test107CommercePaymentUITest->testCommercePaymentCheckout()
Payment was successfully processedOthercommerce_payment_ui.test107CommercePaymentUITest->testCommercePaymentCheckout()
simplexml_import_dom(): Invalid Nodetype to importWarningdrupal_web_test_case.php1915DrupalWebTestCase->parse()
Parsed page successfully.Browsercommerce_payment_ui.test110CommercePaymentUITest->testCommercePaymentCheckout()
current() expects parameter 1 to be array, boolean givenWarningdrupal_web_test_case.php3178DrupalWebTestCase->assertTitle()
Checkout process completed successfullyOthercommerce_payment_ui.test110CommercePaymentUITest->testCommercePaymentCheckout()
Store customer user is able to access the checkout pageBrowsercommerce_payment_ui.test64CommercePaymentUITest->createOrderAndGoToPayment()
simplexml_import_dom(): Invalid Nodetype to importWarningdrupal_web_test_case.php1915DrupalWebTestCase->parse()
Parsed page successfully.Browsercommerce_payment_ui.test65CommercePaymentUITest->createOrderAndGoToPayment()
current() expects parameter 1 to be array, boolean givenWarningdrupal_web_test_case.php3178DrupalWebTestCase->assertTitle()
Checkout page successfully loadedOthercommerce_payment_ui.test65CommercePaymentUITest->createOrderAndGoToPayment()
simplexml_import_dom(): Invalid Nodetype to importWarningdrupal_web_test_case.php1915DrupalWebTestCase->parse()
Parsed page successfully.Browsercommerce_payment_ui.test71CommercePaymentUITest->createOrderAndGoToPayment()
simplexml_import_dom(): Invalid Nodetype to importWarningdrupal_web_test_case.php1915DrupalWebTestCase->parse()
Parsed page successfully.Browsercommerce_payment_ui.test72CommercePaymentUITest->createOrderAndGoToPayment()
Undefined index: ajaxNoticedrupal_web_test_case.php2189DrupalWebTestCase->drupalPostAJAX()
simplexml_import_dom(): Invalid Nodetype to importWarningdrupal_web_test_case.php1915DrupalWebTestCase->parse()
Parsed page successfully.Browsercommerce_payment_ui.test72CommercePaymentUITest->createOrderAndGoToPayment()
Invalid argument supplied for foreach()Warningdrupal_web_test_case.php2199DrupalWebTestCase->drupalPostAJAX()
simplexml_import_dom(): Invalid Nodetype to importWarningdrupal_web_test_case.php1915DrupalWebTestCase->parse()
Parsed page successfully.Browsercommerce_payment_ui.test72CommercePaymentUITest->createOrderAndGoToPayment()
Ajax response header found.Othercommerce_payment_ui.test72CommercePaymentUITest->createOrderAndGoToPayment()
simplexml_import_dom(): Invalid Nodetype to importWarningdrupal_web_test_case.php1915DrupalWebTestCase->parse()
Parsed page successfully.Browsercommerce_payment_ui.test76CommercePaymentUITest->createOrderAndGoToPayment()
Country selectedOthercommerce_payment_ui.test76CommercePaymentUITest->createOrderAndGoToPayment()
simplexml_import_dom(): Invalid Nodetype to importWarningdrupal_web_test_case.php1915DrupalWebTestCase->parse()
Parsed page successfully.Browsercommerce_payment_ui.test86CommercePaymentUITest->createOrderAndGoToPayment()
simplexml_import_dom(): Invalid Nodetype to importWarningdrupal_web_test_case.php1915DrupalWebTestCase->parse()
Parsed page successfully.Browsercommerce_payment_ui.test89CommercePaymentUITest->createOrderAndGoToPayment()
current() expects parameter 1 to be array, boolean givenWarningdrupal_web_test_case.php3178DrupalWebTestCase->assertTitle()
Review order page successfully loadedOthercommerce_payment_ui.test89CommercePaymentUITest->createOrderAndGoToPayment()
Store customer user is able to access the checkout pageBrowsercommerce_payment_ui.test64CommercePaymentUITest->createOrderAndGoToPayment()
simplexml_import_dom(): Invalid Nodetype to importWarningdrupal_web_test_case.php1915DrupalWebTestCase->parse()
Parsed page successfully.Browsercommerce_payment_ui.test65CommercePaymentUITest->createOrderAndGoToPayment()
current() expects parameter 1 to be array, boolean givenWarningdrupal_web_test_case.php3178DrupalWebTestCase->assertTitle()
Checkout page successfully loadedOthercommerce_payment_ui.test65CommercePaymentUITest->createOrderAndGoToPayment()
simplexml_import_dom(): Invalid Nodetype to importWarningdrupal_web_test_case.php1915DrupalWebTestCase->parse()
Parsed page successfully.Browsercommerce_payment_ui.test71CommercePaymentUITest->createOrderAndGoToPayment()
simplexml_import_dom(): Invalid Nodetype to importWarningdrupal_web_test_case.php1915DrupalWebTestCase->parse()
Parsed page successfully.Browsercommerce_payment_ui.test72CommercePaymentUITest->createOrderAndGoToPayment()
Undefined index: ajaxNoticedrupal_web_test_case.php2189DrupalWebTestCase->drupalPostAJAX()
simplexml_import_dom(): Invalid Nodetype to importWarningdrupal_web_test_case.php1915DrupalWebTestCase->parse()
Parsed page successfully.Browsercommerce_payment_ui.test72CommercePaymentUITest->createOrderAndGoToPayment()
Invalid argument supplied for foreach()Warningdrupal_web_test_case.php2199DrupalWebTestCase->drupalPostAJAX()
simplexml_import_dom(): Invalid Nodetype to importWarningdrupal_web_test_case.php1915DrupalWebTestCase->parse()
Parsed page successfully.Browsercommerce_payment_ui.test72CommercePaymentUITest->createOrderAndGoToPayment()
Ajax response header found.Othercommerce_payment_ui.test72CommercePaymentUITest->createOrderAndGoToPayment()
simplexml_import_dom(): Invalid Nodetype to importWarningdrupal_web_test_case.php1915DrupalWebTestCase->parse()
Parsed page successfully.Browsercommerce_payment_ui.test76CommercePaymentUITest->createOrderAndGoToPayment()
Country selectedOthercommerce_payment_ui.test76CommercePaymentUITest->createOrderAndGoToPayment()
simplexml_import_dom(): Invalid Nodetype to importWarningdrupal_web_test_case.php1915DrupalWebTestCase->parse()
Parsed page successfully.Browsercommerce_payment_ui.test86CommercePaymentUITest->createOrderAndGoToPayment()
simplexml_import_dom(): Invalid Nodetype to importWarningdrupal_web_test_case.php1915DrupalWebTestCase->parse()
Parsed page successfully.Browsercommerce_payment_ui.test89CommercePaymentUITest->createOrderAndGoToPayment()
current() expects parameter 1 to be array, boolean givenWarningdrupal_web_test_case.php3178DrupalWebTestCase->assertTitle()
Review order page successfully loadedOthercommerce_payment_ui.test89CommercePaymentUITest->createOrderAndGoToPayment()
Example payment method panel is presentOthercommerce_payment_ui.test221CommercePaymentUITest->testCommercePaymentMethodsAdministration()
ExpandTax administration (CommerceTaxUIAdminTest) [Drupal Commerce]5881816
MessageGroupFilenameLineFunctionStatus
Tax appears in the order summaryOthercommerce_tax_ui.test589CommerceTaxUIAdminTest->testCommerceTaxUIApplySalesTax()
Tax amount applied appears in the order summaryOthercommerce_tax_ui.test590CommerceTaxUIAdminTest->testCommerceTaxUIApplySalesTax()
simplexml_import_dom(): Invalid Nodetype to importWarningdrupal_web_test_case.php1915DrupalWebTestCase->parse()
Parsed page successfully.Browsercommerce_tax_ui.test64CommerceTaxUIAdminTest->commerceTaxHelperCompleteCheckout()
simplexml_import_dom(): Invalid Nodetype to importWarningdrupal_web_test_case.php1915DrupalWebTestCase->parse()
Parsed page successfully.Browsercommerce_tax_ui.test65CommerceTaxUIAdminTest->commerceTaxHelperCompleteCheckout()
Undefined index: ajaxNoticedrupal_web_test_case.php2189DrupalWebTestCase->drupalPostAJAX()
simplexml_import_dom(): Invalid Nodetype to importWarningdrupal_web_test_case.php1915DrupalWebTestCase->parse()
Parsed page successfully.Browsercommerce_tax_ui.test65CommerceTaxUIAdminTest->commerceTaxHelperCompleteCheckout()
Invalid argument supplied for foreach()Warningdrupal_web_test_case.php2199DrupalWebTestCase->drupalPostAJAX()
simplexml_import_dom(): Invalid Nodetype to importWarningdrupal_web_test_case.php1915DrupalWebTestCase->parse()
Parsed page successfully.Browsercommerce_tax_ui.test65CommerceTaxUIAdminTest->commerceTaxHelperCompleteCheckout()
Ajax response header found.Othercommerce_tax_ui.test65CommerceTaxUIAdminTest->commerceTaxHelperCompleteCheckout()
simplexml_import_dom(): Invalid Nodetype to importWarningdrupal_web_test_case.php1915DrupalWebTestCase->parse()
Parsed page successfully.Browsercommerce_tax_ui.test73CommerceTaxUIAdminTest->commerceTaxHelperCompleteCheckout()
simplexml_import_dom(): Invalid Nodetype to importWarningdrupal_web_test_case.php1915DrupalWebTestCase->parse()
Parsed page successfully.Browsercommerce_tax_ui.test74CommerceTaxUIAdminTest->commerceTaxHelperCompleteCheckout()
Tax display title is displayed in the user view of an order.Othercommerce_tax_ui.test724CommerceTaxUIAdminTest->testCommerceTaxUIUserOrderView()
Tax amount is displayed in the user view of an order.Othercommerce_tax_ui.test725CommerceTaxUIAdminTest->testCommerceTaxUIUserOrderView()
simplexml_import_dom(): Invalid Nodetype to importWarningdrupal_web_test_case.php1915DrupalWebTestCase->parse()
Parsed page successfully.Browsercommerce_tax_ui.test64CommerceTaxUIAdminTest->commerceTaxHelperCompleteCheckout()
simplexml_import_dom(): Invalid Nodetype to importWarningdrupal_web_test_case.php1915DrupalWebTestCase->parse()
Parsed page successfully.Browsercommerce_tax_ui.test65CommerceTaxUIAdminTest->commerceTaxHelperCompleteCheckout()
Undefined index: ajaxNoticedrupal_web_test_case.php2189DrupalWebTestCase->drupalPostAJAX()
simplexml_import_dom(): Invalid Nodetype to importWarningdrupal_web_test_case.php1915DrupalWebTestCase->parse()
Parsed page successfully.Browsercommerce_tax_ui.test65CommerceTaxUIAdminTest->commerceTaxHelperCompleteCheckout()
Invalid argument supplied for foreach()Warningdrupal_web_test_case.php2199DrupalWebTestCase->drupalPostAJAX()
simplexml_import_dom(): Invalid Nodetype to importWarningdrupal_web_test_case.php1915DrupalWebTestCase->parse()
Parsed page successfully.Browsercommerce_tax_ui.test65CommerceTaxUIAdminTest->commerceTaxHelperCompleteCheckout()
Ajax response header found.Othercommerce_tax_ui.test65CommerceTaxUIAdminTest->commerceTaxHelperCompleteCheckout()
simplexml_import_dom(): Invalid Nodetype to importWarningdrupal_web_test_case.php1915DrupalWebTestCase->parse()
Parsed page successfully.Browsercommerce_tax_ui.test73CommerceTaxUIAdminTest->commerceTaxHelperCompleteCheckout()
simplexml_import_dom(): Invalid Nodetype to importWarningdrupal_web_test_case.php1915DrupalWebTestCase->parse()
Parsed page successfully.Browsercommerce_tax_ui.test74CommerceTaxUIAdminTest->commerceTaxHelperCompleteCheckout()

All

Test namePassFailException
ExpandCheckout process (CommerceCheckoutTestProcess) [Drupal Commerce]28310471
MessageGroupFilenameLineFunctionStatus
The owner of the order can access to the checkout pageBrowsercommerce_checkout.test124CommerceCheckoutTestProcess->testCommerceCheckoutProcessAuthenticatedUser()
simplexml_import_dom(): Invalid Nodetype to importWarningdrupal_web_test_case.php1915DrupalWebTestCase->parse()
Parsed page successfully.Browsercommerce_checkout.test125CommerceCheckoutTestProcess->testCommerceCheckoutProcessAuthenticatedUser()
current() expects parameter 1 to be array, boolean givenWarningdrupal_web_test_case.php3178DrupalWebTestCase->assertTitle()
Title of the checkout phase is correctOthercommerce_checkout.test125CommerceCheckoutTestProcess->testCommerceCheckoutProcessAuthenticatedUser()
Shopping cart contents pane is presentOthercommerce_checkout.test126CommerceCheckoutTestProcess->testCommerceCheckoutProcessAuthenticatedUser()
Billing information pane is presentOthercommerce_checkout.test127CommerceCheckoutTestProcess->testCommerceCheckoutProcessAuthenticatedUser()
simplexml_import_dom(): Invalid Nodetype to importWarningdrupal_web_test_case.php1915DrupalWebTestCase->parse()
Parsed page successfully.Browsercommerce_checkout.test137CommerceCheckoutTestProcess->testCommerceCheckoutProcessAuthenticatedUser()
simplexml_import_dom(): Invalid Nodetype to importWarningdrupal_web_test_case.php1915DrupalWebTestCase->parse()
Parsed page successfully.Browsercommerce_checkout.test138CommerceCheckoutTestProcess->testCommerceCheckoutProcessAuthenticatedUser()
Undefined index: ajaxNoticedrupal_web_test_case.php2189DrupalWebTestCase->drupalPostAJAX()
simplexml_import_dom(): Invalid Nodetype to importWarningdrupal_web_test_case.php1915DrupalWebTestCase->parse()
Parsed page successfully.Browsercommerce_checkout.test138CommerceCheckoutTestProcess->testCommerceCheckoutProcessAuthenticatedUser()
Invalid argument supplied for foreach()Warningdrupal_web_test_case.php2199DrupalWebTestCase->drupalPostAJAX()
simplexml_import_dom(): Invalid Nodetype to importWarningdrupal_web_test_case.php1915DrupalWebTestCase->parse()
Parsed page successfully.Browsercommerce_checkout.test138CommerceCheckoutTestProcess->testCommerceCheckoutProcessAuthenticatedUser()
Ajax response header found.Othercommerce_checkout.test138CommerceCheckoutTestProcess->testCommerceCheckoutProcessAuthenticatedUser()
simplexml_import_dom(): Invalid Nodetype to importWarningdrupal_web_test_case.php1915DrupalWebTestCase->parse()
Parsed page successfully.Browsercommerce_checkout.test142CommerceCheckoutTestProcess->testCommerceCheckoutProcessAuthenticatedUser()
Country selectedOthercommerce_checkout.test142CommerceCheckoutTestProcess->testCommerceCheckoutProcessAuthenticatedUser()
simplexml_import_dom(): Invalid Nodetype to importWarningdrupal_web_test_case.php1915DrupalWebTestCase->parse()
Parsed page successfully.Browsercommerce_checkout.test152CommerceCheckoutTestProcess->testCommerceCheckoutProcessAuthenticatedUser()
simplexml_import_dom(): Invalid Nodetype to importWarningdrupal_web_test_case.php1915DrupalWebTestCase->parse()
Parsed page successfully.Browsercommerce_checkout.test156CommerceCheckoutTestProcess->testCommerceCheckoutProcessAuthenticatedUser()
current() expects parameter 1 to be array, boolean givenWarningdrupal_web_test_case.php3178DrupalWebTestCase->assertTitle()
Title of the checkout phase 'Review order' is correctOthercommerce_checkout.test156CommerceCheckoutTestProcess->testCommerceCheckoutProcessAuthenticatedUser()
Billing information for 'name_line' is correctOthercommerce_checkout.test157CommerceCheckoutTestProcess->testCommerceCheckoutProcessAuthenticatedUser()
Billing information for 'thoroughfare' is correctOthercommerce_checkout.test158CommerceCheckoutTestProcess->testCommerceCheckoutProcessAuthenticatedUser()
Billing information for 'locality' is correctOthercommerce_checkout.test159CommerceCheckoutTestProcess->testCommerceCheckoutProcessAuthenticatedUser()
Billing information for 'postal_code' is correctOthercommerce_checkout.test160CommerceCheckoutTestProcess->testCommerceCheckoutProcessAuthenticatedUser()
Billing information country is correctOthercommerce_checkout.test161CommerceCheckoutTestProcess->testCommerceCheckoutProcessAuthenticatedUser()
Example payment method pane is presentOthercommerce_checkout.test162CommerceCheckoutTestProcess->testCommerceCheckoutProcessAuthenticatedUser()
Order status is 'Checkout Review' in the review phase.Othercommerce_checkout.test170CommerceCheckoutTestProcess->testCommerceCheckoutProcessAuthenticatedUser()
simplexml_import_dom(): Invalid Nodetype to importWarningdrupal_web_test_case.php1915DrupalWebTestCase->parse()
Parsed page successfully.Browsercommerce_checkout.test173CommerceCheckoutTestProcess->testCommerceCheckoutProcessAuthenticatedUser()
simplexml_import_dom(): Invalid Nodetype to importWarningdrupal_web_test_case.php1915DrupalWebTestCase->parse()
Parsed page successfully.Browsercommerce_checkout.test174CommerceCheckoutTestProcess->testCommerceCheckoutProcessAuthenticatedUser()
current() expects parameter 1 to be array, boolean givenWarningdrupal_web_test_case.php3178DrupalWebTestCase->assertTitle()
When clicking in the 'Back' button, the title displayed corresponds with the current checkout phase: 'Checkout'Othercommerce_checkout.test174CommerceCheckoutTestProcess->testCommerceCheckoutProcessAuthenticatedUser()
simplexml_import_dom(): Invalid Nodetype to importWarningdrupal_web_test_case.php1915DrupalWebTestCase->parse()
Parsed page successfully.Browsercommerce_checkout.test175CommerceCheckoutTestProcess->testCommerceCheckoutProcessAuthenticatedUser()
simplexml_import_dom(): Invalid Nodetype to importWarningdrupal_web_test_case.php1915DrupalWebTestCase->parse()
Parsed page successfully.Browsercommerce_checkout.test176CommerceCheckoutTestProcess->testCommerceCheckoutProcessAuthenticatedUser()
current() expects parameter 1 to be array, boolean givenWarningdrupal_web_test_case.php3178DrupalWebTestCase->assertTitle()
When clicking in the 'Continue' button, the title displayed corresponds with the current checkout phase: 'Review order'Othercommerce_checkout.test176CommerceCheckoutTestProcess->testCommerceCheckoutProcessAuthenticatedUser()
simplexml_import_dom(): Invalid Nodetype to importWarningdrupal_web_test_case.php1915DrupalWebTestCase->parse()
Parsed page successfully.Browsercommerce_checkout.test179CommerceCheckoutTestProcess->testCommerceCheckoutProcessAuthenticatedUser()
Order status is 'Pending' after completing checkoutOthercommerce_checkout.test185CommerceCheckoutTestProcess->testCommerceCheckoutProcessAuthenticatedUser()
simplexml_import_dom(): Invalid Nodetype to importWarningdrupal_web_test_case.php1915DrupalWebTestCase->parse()
Parsed page successfully.Browsercommerce_checkout.test187CommerceCheckoutTestProcess->testCommerceCheckoutProcessAuthenticatedUser()
current() expects parameter 1 to be array, boolean givenWarningdrupal_web_test_case.php3178DrupalWebTestCase->assertTitle()
Title of the page is 'Checkout complete' when finishing the checkout processOthercommerce_checkout.test187CommerceCheckoutTestProcess->testCommerceCheckoutProcessAuthenticatedUser()
Completion message for the checkout is correctly displayedOthercommerce_checkout.test188CommerceCheckoutTestProcess->testCommerceCheckoutProcessAuthenticatedUser()
Billing information pane is present in the checkout pageOthercommerce_checkout.test201CommerceCheckoutTestProcess->testCommerceCheckoutValidatePanesAnonymousUser()
Account information pane is present in the checkout pageOthercommerce_checkout.test202CommerceCheckoutTestProcess->testCommerceCheckoutValidatePanesAnonymousUser()
simplexml_import_dom(): Invalid Nodetype to importWarningdrupal_web_test_case.php1915DrupalWebTestCase->parse()
Parsed page successfully.Browsercommerce_checkout.test205CommerceCheckoutTestProcess->testCommerceCheckoutValidatePanesAnonymousUser()
Check required account pane message.Othercommerce_checkout.test225CommerceCheckoutTestProcess->testCommerceCheckoutValidatePanesAnonymousUser()
simplexml_import_dom(): Invalid Nodetype to importWarningdrupal_web_test_case.php1915DrupalWebTestCase->parse()
Parsed page successfully.Browsercommerce_checkout.test236CommerceCheckoutTestProcess->testCommerceCheckoutValidatePanesAnonymousUser()
simplexml_import_dom(): Invalid Nodetype to importWarningdrupal_web_test_case.php1915DrupalWebTestCase->parse()
Parsed page successfully.Browsercommerce_checkout.test237CommerceCheckoutTestProcess->testCommerceCheckoutValidatePanesAnonymousUser()
Undefined index: ajaxNoticedrupal_web_test_case.php2189DrupalWebTestCase->drupalPostAJAX()
simplexml_import_dom(): Invalid Nodetype to importWarningdrupal_web_test_case.php1915DrupalWebTestCase->parse()
Parsed page successfully.Browsercommerce_checkout.test237CommerceCheckoutTestProcess->testCommerceCheckoutValidatePanesAnonymousUser()
Invalid argument supplied for foreach()Warningdrupal_web_test_case.php2199DrupalWebTestCase->drupalPostAJAX()
simplexml_import_dom(): Invalid Nodetype to importWarningdrupal_web_test_case.php1915DrupalWebTestCase->parse()
Parsed page successfully.Browsercommerce_checkout.test237CommerceCheckoutTestProcess->testCommerceCheckoutValidatePanesAnonymousUser()
Ajax response header found.Othercommerce_checkout.test237CommerceCheckoutTestProcess->testCommerceCheckoutValidatePanesAnonymousUser()
simplexml_import_dom(): Invalid Nodetype to importWarningdrupal_web_test_case.php1915DrupalWebTestCase->parse()
Parsed page successfully.Browsercommerce_checkout.test254CommerceCheckoutTestProcess->testCommerceCheckoutValidatePanesAnonymousUser()
A warning message is displayed when the e-mail address for the anonymous user is not validOthercommerce_checkout.test257CommerceCheckoutTestProcess->testCommerceCheckoutValidatePanesAnonymousUser()
simplexml_import_dom(): Invalid Nodetype to importWarningdrupal_web_test_case.php1915DrupalWebTestCase->parse()
Parsed page successfully.Browsercommerce_checkout.test262CommerceCheckoutTestProcess->testCommerceCheckoutValidatePanesAnonymousUser()
simplexml_import_dom(): Invalid Nodetype to importWarningdrupal_web_test_case.php1915DrupalWebTestCase->parse()
Parsed page successfully.Browsercommerce_checkout.test267CommerceCheckoutTestProcess->testCommerceCheckoutValidatePanesAnonymousUser()
Anonymous user can access to the checkout page for the order.Browsercommerce_checkout.test280CommerceCheckoutTestProcess->testCommerceCheckoutProcessAnonymousUser()
simplexml_import_dom(): Invalid Nodetype to importWarningdrupal_web_test_case.php1915DrupalWebTestCase->parse()
Parsed page successfully.Browsercommerce_checkout.test281CommerceCheckoutTestProcess->testCommerceCheckoutProcessAnonymousUser()
current() expects parameter 1 to be array, boolean givenWarningdrupal_web_test_case.php3178DrupalWebTestCase->assertTitle()
Title of the checkout phase is correctOthercommerce_checkout.test281CommerceCheckoutTestProcess->testCommerceCheckoutProcessAnonymousUser()
Shopping cart contents pane is presentOthercommerce_checkout.test282CommerceCheckoutTestProcess->testCommerceCheckoutProcessAnonymousUser()
Billing information pane is presentOthercommerce_checkout.test283CommerceCheckoutTestProcess->testCommerceCheckoutProcessAnonymousUser()
Account information pane is presentOthercommerce_checkout.test284CommerceCheckoutTestProcess->testCommerceCheckoutProcessAnonymousUser()
simplexml_import_dom(): Invalid Nodetype to importWarningdrupal_web_test_case.php1915DrupalWebTestCase->parse()
Parsed page successfully.Browsercommerce_checkout.test291CommerceCheckoutTestProcess->testCommerceCheckoutProcessAnonymousUser()
simplexml_import_dom(): Invalid Nodetype to importWarningdrupal_web_test_case.php1915DrupalWebTestCase->parse()
Parsed page successfully.Browsercommerce_checkout.test292CommerceCheckoutTestProcess->testCommerceCheckoutProcessAnonymousUser()
Undefined index: ajaxNoticedrupal_web_test_case.php2189DrupalWebTestCase->drupalPostAJAX()
simplexml_import_dom(): Invalid Nodetype to importWarningdrupal_web_test_case.php1915DrupalWebTestCase->parse()
Parsed page successfully.Browsercommerce_checkout.test292CommerceCheckoutTestProcess->testCommerceCheckoutProcessAnonymousUser()
Invalid argument supplied for foreach()Warningdrupal_web_test_case.php2199DrupalWebTestCase->drupalPostAJAX()
simplexml_import_dom(): Invalid Nodetype to importWarningdrupal_web_test_case.php1915DrupalWebTestCase->parse()
Parsed page successfully.Browsercommerce_checkout.test292CommerceCheckoutTestProcess->testCommerceCheckoutProcessAnonymousUser()
Ajax response header found.Othercommerce_checkout.test292CommerceCheckoutTestProcess->testCommerceCheckoutProcessAnonymousUser()
simplexml_import_dom(): Invalid Nodetype to importWarningdrupal_web_test_case.php1915DrupalWebTestCase->parse()
Parsed page successfully.Browsercommerce_checkout.test296CommerceCheckoutTestProcess->testCommerceCheckoutProcessAnonymousUser()
Country selectedOthercommerce_checkout.test296CommerceCheckoutTestProcess->testCommerceCheckoutProcessAnonymousUser()
simplexml_import_dom(): Invalid Nodetype to importWarningdrupal_web_test_case.php1915DrupalWebTestCase->parse()
Parsed page successfully.Browsercommerce_checkout.test313CommerceCheckoutTestProcess->testCommerceCheckoutProcessAnonymousUser()
simplexml_import_dom(): Invalid Nodetype to importWarningdrupal_web_test_case.php1915DrupalWebTestCase->parse()
Parsed page successfully.Browsercommerce_checkout.test317CommerceCheckoutTestProcess->testCommerceCheckoutProcessAnonymousUser()
current() expects parameter 1 to be array, boolean givenWarningdrupal_web_test_case.php3178DrupalWebTestCase->assertTitle()
Title of the checkout phase 'Review order' is correctOthercommerce_checkout.test317CommerceCheckoutTestProcess->testCommerceCheckoutProcessAnonymousUser()
Billing information for 'name_line' is correctOthercommerce_checkout.test318CommerceCheckoutTestProcess->testCommerceCheckoutProcessAnonymousUser()
Billing information for 'thoroughfare' is correctOthercommerce_checkout.test319CommerceCheckoutTestProcess->testCommerceCheckoutProcessAnonymousUser()
Billing information for 'locality' is correctOthercommerce_checkout.test320CommerceCheckoutTestProcess->testCommerceCheckoutProcessAnonymousUser()
Billing information for 'postal_code' is correctOthercommerce_checkout.test321CommerceCheckoutTestProcess->testCommerceCheckoutProcessAnonymousUser()
Billing information country is correctOthercommerce_checkout.test322CommerceCheckoutTestProcess->testCommerceCheckoutProcessAnonymousUser()
Example payment method pane is presentOthercommerce_checkout.test323CommerceCheckoutTestProcess->testCommerceCheckoutProcessAnonymousUser()
Account information is correctOthercommerce_checkout.test324CommerceCheckoutTestProcess->testCommerceCheckoutProcessAnonymousUser()
Order status is 'Checkout Review' in the review phase.Othercommerce_checkout.test332CommerceCheckoutTestProcess->testCommerceCheckoutProcessAnonymousUser()
simplexml_import_dom(): Invalid Nodetype to importWarningdrupal_web_test_case.php1915DrupalWebTestCase->parse()
Parsed page successfully.Browsercommerce_checkout.test335CommerceCheckoutTestProcess->testCommerceCheckoutProcessAnonymousUser()
Order status is 'Pending' after completing checkout.Othercommerce_checkout.test341CommerceCheckoutTestProcess->testCommerceCheckoutProcessAnonymousUser()
simplexml_import_dom(): Invalid Nodetype to importWarningdrupal_web_test_case.php1915DrupalWebTestCase->parse()
Parsed page successfully.Browsercommerce_checkout.test344CommerceCheckoutTestProcess->testCommerceCheckoutProcessAnonymousUser()
current() expects parameter 1 to be array, boolean givenWarningdrupal_web_test_case.php3178DrupalWebTestCase->assertTitle()
Title of the page is 'Checkout complete' when finishing the checkout processOthercommerce_checkout.test344CommerceCheckoutTestProcess->testCommerceCheckoutProcessAnonymousUser()
Completion message for the checkout is correctly displayedOthercommerce_checkout.test346CommerceCheckoutTestProcess->testCommerceCheckoutProcessAnonymousUser()
simplexml_import_dom(): Invalid Nodetype to importWarningdrupal_web_test_case.php1915DrupalWebTestCase->parse()
Parsed page successfully.Browsercommerce_checkout.test364CommerceCheckoutTestProcess->testCommerceCheckoutProcessAnonymousExistingUser()
simplexml_import_dom(): Invalid Nodetype to importWarningdrupal_web_test_case.php1915DrupalWebTestCase->parse()
Parsed page successfully.Browsercommerce_checkout.test365CommerceCheckoutTestProcess->testCommerceCheckoutProcessAnonymousExistingUser()
Undefined index: ajaxNoticedrupal_web_test_case.php2189DrupalWebTestCase->drupalPostAJAX()
simplexml_import_dom(): Invalid Nodetype to importWarningdrupal_web_test_case.php1915DrupalWebTestCase->parse()
Parsed page successfully.Browsercommerce_checkout.test365CommerceCheckoutTestProcess->testCommerceCheckoutProcessAnonymousExistingUser()
Invalid argument supplied for foreach()Warningdrupal_web_test_case.php2199DrupalWebTestCase->drupalPostAJAX()
simplexml_import_dom(): Invalid Nodetype to importWarningdrupal_web_test_case.php1915DrupalWebTestCase->parse()
Parsed page successfully.Browsercommerce_checkout.test365CommerceCheckoutTestProcess->testCommerceCheckoutProcessAnonymousExistingUser()
Ajax response header found.Othercommerce_checkout.test365CommerceCheckoutTestProcess->testCommerceCheckoutProcessAnonymousExistingUser()
simplexml_import_dom(): Invalid Nodetype to importWarningdrupal_web_test_case.php1915DrupalWebTestCase->parse()
Parsed page successfully.Browsercommerce_checkout.test382CommerceCheckoutTestProcess->testCommerceCheckoutProcessAnonymousExistingUser()
simplexml_import_dom(): Invalid Nodetype to importWarningdrupal_web_test_case.php1915DrupalWebTestCase->parse()
Parsed page successfully.Browsercommerce_checkout.test385CommerceCheckoutTestProcess->testCommerceCheckoutProcessAnonymousExistingUser()
The order has been correctly assigned to the user owner of the mail addressOthercommerce_checkout.test391CommerceCheckoutTestProcess->testCommerceCheckoutProcessAnonymousExistingUser()
simplexml_import_dom(): Invalid Nodetype to importWarningdrupal_web_test_case.php1915DrupalWebTestCase->parse()
Parsed page successfully.Browsercommerce_checkout.test410CommerceCheckoutTestProcess->testCommerceCheckoutProcessAnonymousNonExistingUser()
simplexml_import_dom(): Invalid Nodetype to importWarningdrupal_web_test_case.php1915DrupalWebTestCase->parse()
Parsed page successfully.Browsercommerce_checkout.test411CommerceCheckoutTestProcess->testCommerceCheckoutProcessAnonymousNonExistingUser()
Undefined index: ajaxNoticedrupal_web_test_case.php2189DrupalWebTestCase->drupalPostAJAX()
simplexml_import_dom(): Invalid Nodetype to importWarningdrupal_web_test_case.php1915DrupalWebTestCase->parse()
Parsed page successfully.Browsercommerce_checkout.test411CommerceCheckoutTestProcess->testCommerceCheckoutProcessAnonymousNonExistingUser()
Invalid argument supplied for foreach()Warningdrupal_web_test_case.php2199DrupalWebTestCase->drupalPostAJAX()
simplexml_import_dom(): Invalid Nodetype to importWarningdrupal_web_test_case.php1915DrupalWebTestCase->parse()
Parsed page successfully.Browsercommerce_checkout.test411CommerceCheckoutTestProcess->testCommerceCheckoutProcessAnonymousNonExistingUser()
Ajax response header found.Othercommerce_checkout.test411CommerceCheckoutTestProcess->testCommerceCheckoutProcessAnonymousNonExistingUser()
simplexml_import_dom(): Invalid Nodetype to importWarningdrupal_web_test_case.php1915DrupalWebTestCase->parse()
Parsed page successfully.Browsercommerce_checkout.test428CommerceCheckoutTestProcess->testCommerceCheckoutProcessAnonymousNonExistingUser()
simplexml_import_dom(): Invalid Nodetype to importWarningdrupal_web_test_case.php1915DrupalWebTestCase->parse()
Parsed page successfully.Browsercommerce_checkout.test431CommerceCheckoutTestProcess->testCommerceCheckoutProcessAnonymousNonExistingUser()
The e-mail address of the owner of the order matches the one in the checkout inputOthercommerce_checkout.test438CommerceCheckoutTestProcess->testCommerceCheckoutProcessAnonymousNonExistingUser()
User id of the new user is higher than the last user created then it is a new accountOthercommerce_checkout.test439CommerceCheckoutTestProcess->testCommerceCheckoutProcessAnonymousNonExistingUser()
simplexml_import_dom(): Invalid Nodetype to importWarningdrupal_web_test_case.php1915DrupalWebTestCase->parse()
Parsed page successfully.Browsercommerce_checkout.test493CommerceCheckoutTestProcess->testCommerceCheckoutAccessPages()
simplexml_import_dom(): Invalid Nodetype to importWarningdrupal_web_test_case.php1915DrupalWebTestCase->parse()
Parsed page successfully.Browsercommerce_checkout.test494CommerceCheckoutTestProcess->testCommerceCheckoutAccessPages()
Undefined index: ajaxNoticedrupal_web_test_case.php2189DrupalWebTestCase->drupalPostAJAX()
simplexml_import_dom(): Invalid Nodetype to importWarningdrupal_web_test_case.php1915DrupalWebTestCase->parse()
Parsed page successfully.Browsercommerce_checkout.test494CommerceCheckoutTestProcess->testCommerceCheckoutAccessPages()
Invalid argument supplied for foreach()Warningdrupal_web_test_case.php2199DrupalWebTestCase->drupalPostAJAX()
simplexml_import_dom(): Invalid Nodetype to importWarningdrupal_web_test_case.php1915DrupalWebTestCase->parse()
Parsed page successfully.Browsercommerce_checkout.test494CommerceCheckoutTestProcess->testCommerceCheckoutAccessPages()
Ajax response header found.Othercommerce_checkout.test494CommerceCheckoutTestProcess->testCommerceCheckoutAccessPages()
simplexml_import_dom(): Invalid Nodetype to importWarningdrupal_web_test_case.php1915DrupalWebTestCase->parse()
Parsed page successfully.Browsercommerce_checkout.test498CommerceCheckoutTestProcess->testCommerceCheckoutAccessPages()
Country selectedOthercommerce_checkout.test498CommerceCheckoutTestProcess->testCommerceCheckoutAccessPages()
simplexml_import_dom(): Invalid Nodetype to importWarningdrupal_web_test_case.php1915DrupalWebTestCase->parse()
Parsed page successfully.Browsercommerce_checkout.test508CommerceCheckoutTestProcess->testCommerceCheckoutAccessPages()
review checkout page is accessible.Othercommerce_checkout.test513CommerceCheckoutTestProcess->testCommerceCheckoutAccessPages()
simplexml_import_dom(): Invalid Nodetype to importWarningdrupal_web_test_case.php1915DrupalWebTestCase->parse()
Parsed page successfully.Browsercommerce_checkout.test518CommerceCheckoutTestProcess->testCommerceCheckoutAccessPages()
checkout page is not accessible.Othercommerce_checkout.test521CommerceCheckoutTestProcess->testCommerceCheckoutAccessPages()
complete checkout page is accessible.Othercommerce_checkout.test524CommerceCheckoutTestProcess->testCommerceCheckoutAccessPages()
ExpandCommerce base (CommerceBaseTesterTestCase) [Drupal Commerce]21432
MessageGroupFilenameLineFunctionStatus
simplexml_import_dom(): Invalid Nodetype to importWarningdrupal_web_test_case.php1915DrupalWebTestCase->parse()
Parsed page successfully.Browsercommerce_base.test916CommerceBaseTesterTestCase->testTestCreateDummyOrder()
current() expects parameter 1 to be array, boolean givenWarningdrupal_web_test_case.php3178DrupalWebTestCase->assertTitle()
Checkout accessible for the orderOthercommerce_base.test916CommerceBaseTesterTestCase->testTestCreateDummyOrder()
Product is added to the orderOthercommerce_base.test917CommerceBaseTesterTestCase->testTestCreateDummyOrder()
ExpandCustomer user interface (CommerceCustomerUITest) [Drupal Commerce]4172430
MessageGroupFilenameLineFunctionStatus
simplexml_import_dom(): Invalid Nodetype to importWarningdrupal_web_test_case.php1915DrupalWebTestCase->parse()
Parsed page successfully.Browsercommerce_customer_ui.test398CommerceCustomerUITest->testCommerceCustomerUIAddProfileViaCheckout()
simplexml_import_dom(): Invalid Nodetype to importWarningdrupal_web_test_case.php1915DrupalWebTestCase->parse()
Parsed page successfully.Browsercommerce_customer_ui.test399CommerceCustomerUITest->testCommerceCustomerUIAddProfileViaCheckout()
Undefined index: ajaxNoticedrupal_web_test_case.php2189DrupalWebTestCase->drupalPostAJAX()
simplexml_import_dom(): Invalid Nodetype to importWarningdrupal_web_test_case.php1915DrupalWebTestCase->parse()
Parsed page successfully.Browsercommerce_customer_ui.test399CommerceCustomerUITest->testCommerceCustomerUIAddProfileViaCheckout()
Invalid argument supplied for foreach()Warningdrupal_web_test_case.php2199DrupalWebTestCase->drupalPostAJAX()
simplexml_import_dom(): Invalid Nodetype to importWarningdrupal_web_test_case.php1915DrupalWebTestCase->parse()
Parsed page successfully.Browsercommerce_customer_ui.test399CommerceCustomerUITest->testCommerceCustomerUIAddProfileViaCheckout()
Ajax response header found.Othercommerce_customer_ui.test399CommerceCustomerUITest->testCommerceCustomerUIAddProfileViaCheckout()
simplexml_import_dom(): Invalid Nodetype to importWarningdrupal_web_test_case.php1915DrupalWebTestCase->parse()
Parsed page successfully.Browsercommerce_customer_ui.test403CommerceCustomerUITest->testCommerceCustomerUIAddProfileViaCheckout()
Country selectedOthercommerce_customer_ui.test403CommerceCustomerUITest->testCommerceCustomerUIAddProfileViaCheckout()
simplexml_import_dom(): Invalid Nodetype to importWarningdrupal_web_test_case.php1915DrupalWebTestCase->parse()
Parsed page successfully.Browsercommerce_customer_ui.test413CommerceCustomerUITest->testCommerceCustomerUIAddProfileViaCheckout()
simplexml_import_dom(): Invalid Nodetype to importWarningdrupal_web_test_case.php1915DrupalWebTestCase->parse()
Parsed page successfully.Browsercommerce_customer_ui.test416CommerceCustomerUITest->testCommerceCustomerUIAddProfileViaCheckout()
EntityMetadataWrapperException: Unknown data property commerce_customer_address. in EntityStructureWrapper->getPropertyInfo() (line 335 of /var/lib/drupaltestbot/sites/default/files/checkout/sites/default/modules/entity/includes/entity.wrapper.inc).Uncaught exceptionentity.wrapper.inc335EntityStructureWrapper->getPropertyInfo()
simplexml_import_dom(): Invalid Nodetype to importWarningdrupal_web_test_case.php1915DrupalWebTestCase->parse()
Parsed page successfully.Browsercommerce_customer_ui.test630CommerceCustomerUITest->_testCommerceCustomerUIProfileCopy()
simplexml_import_dom(): Invalid Nodetype to importWarningdrupal_web_test_case.php1915DrupalWebTestCase->parse()
Parsed page successfully.Browsercommerce_customer_ui.test631CommerceCustomerUITest->_testCommerceCustomerUIProfileCopy()
Undefined index: ajaxNoticedrupal_web_test_case.php2189DrupalWebTestCase->drupalPostAJAX()
simplexml_import_dom(): Invalid Nodetype to importWarningdrupal_web_test_case.php1915DrupalWebTestCase->parse()
Parsed page successfully.Browsercommerce_customer_ui.test631CommerceCustomerUITest->_testCommerceCustomerUIProfileCopy()
Invalid argument supplied for foreach()Warningdrupal_web_test_case.php2199DrupalWebTestCase->drupalPostAJAX()
simplexml_import_dom(): Invalid Nodetype to importWarningdrupal_web_test_case.php1915DrupalWebTestCase->parse()
Parsed page successfully.Browsercommerce_customer_ui.test631CommerceCustomerUITest->_testCommerceCustomerUIProfileCopy()
Ajax response header found.Othercommerce_customer_ui.test631CommerceCustomerUITest->_testCommerceCustomerUIProfileCopy()
simplexml_import_dom(): Invalid Nodetype to importWarningdrupal_web_test_case.php1915DrupalWebTestCase->parse()
Parsed page successfully.Browsercommerce_customer_ui.test643CommerceCustomerUITest->_testCommerceCustomerUIProfileCopy()
Undefined index: ajaxNoticedrupal_web_test_case.php2189DrupalWebTestCase->drupalPostAJAX()
simplexml_import_dom(): Invalid Nodetype to importWarningdrupal_web_test_case.php1915DrupalWebTestCase->parse()
Parsed page successfully.Browsercommerce_customer_ui.test643CommerceCustomerUITest->_testCommerceCustomerUIProfileCopy()
Invalid argument supplied for foreach()Warningdrupal_web_test_case.php2199DrupalWebTestCase->drupalPostAJAX()
simplexml_import_dom(): Invalid Nodetype to importWarningdrupal_web_test_case.php1915DrupalWebTestCase->parse()
Parsed page successfully.Browsercommerce_customer_ui.test643CommerceCustomerUITest->_testCommerceCustomerUIProfileCopy()
Ajax response header found.Othercommerce_customer_ui.test643CommerceCustomerUITest->_testCommerceCustomerUIProfileCopy()
simplexml_import_dom(): Invalid Nodetype to importWarningdrupal_web_test_case.php1915DrupalWebTestCase->parse()
Parsed page successfully.Browsercommerce_customer_ui.test644CommerceCustomerUITest->_testCommerceCustomerUIProfileCopy()
EntityMetadataWrapperException: Unknown data property commerce_customer_address. in EntityStructureWrapper->getPropertyInfo() (line 335 of /var/lib/drupaltestbot/sites/default/files/checkout/sites/default/modules/entity/includes/entity.wrapper.inc).Uncaught exceptionentity.wrapper.inc335EntityStructureWrapper->getPropertyInfo()
simplexml_import_dom(): Invalid Nodetype to importWarningdrupal_web_test_case.php1915DrupalWebTestCase->parse()
Parsed page successfully.Browsercommerce_customer_ui.test643CommerceCustomerUITest->_testCommerceCustomerUIProfileCopy()
Undefined index: ajaxNoticedrupal_web_test_case.php2189DrupalWebTestCase->drupalPostAJAX()
simplexml_import_dom(): Invalid Nodetype to importWarningdrupal_web_test_case.php1915DrupalWebTestCase->parse()
Parsed page successfully.Browsercommerce_customer_ui.test643CommerceCustomerUITest->_testCommerceCustomerUIProfileCopy()
Invalid argument supplied for foreach()Warningdrupal_web_test_case.php2199DrupalWebTestCase->drupalPostAJAX()
simplexml_import_dom(): Invalid Nodetype to importWarningdrupal_web_test_case.php1915DrupalWebTestCase->parse()
Parsed page successfully.Browsercommerce_customer_ui.test643CommerceCustomerUITest->_testCommerceCustomerUIProfileCopy()
Ajax response header found.Othercommerce_customer_ui.test643CommerceCustomerUITest->_testCommerceCustomerUIProfileCopy()
simplexml_import_dom(): Invalid Nodetype to importWarningdrupal_web_test_case.php1915DrupalWebTestCase->parse()
Parsed page successfully.Browsercommerce_customer_ui.test644CommerceCustomerUITest->_testCommerceCustomerUIProfileCopy()
EntityMetadataWrapperException: Unknown data property commerce_customer_address. in EntityStructureWrapper->getPropertyInfo() (line 335 of /var/lib/drupaltestbot/sites/default/files/checkout/sites/default/modules/entity/includes/entity.wrapper.inc).Uncaught exceptionentity.wrapper.inc335EntityStructureWrapper->getPropertyInfo()
LeafOrder administration (CommerceOrderUIAdminTest) [Drupal Commerce]51500
LeafOrder CRUD (CommerceOrderCRUDTestCase) [Drupal Commerce]3900
LeafOrder Rules (CommerceOrderRulesTest) [Drupal Commerce]3100
ExpandPayment Offsite (CommercePaymentOffsiteTest) [Drupal Commerce]3398
MessageGroupFilenameLineFunctionStatus
simplexml_import_dom(): Invalid Nodetype to importWarningdrupal_web_test_case.php1915DrupalWebTestCase->parse()
Parsed page successfully.Browsercommerce_payment_ui.test317CommercePaymentOffsiteTest->testCommercePaymentOffsitePayment()
Offsite example payment method is listed in the checkout process formOthercommerce_payment_ui.test318CommercePaymentOffsiteTest->testCommercePaymentOffsitePayment()
simplexml_import_dom(): Invalid Nodetype to importWarningdrupal_web_test_case.php1915DrupalWebTestCase->parse()
Parsed page successfully.Browsercommerce_payment_ui.test319CommercePaymentOffsiteTest->testCommercePaymentOffsitePayment()
Undefined index: ajaxNoticedrupal_web_test_case.php2189DrupalWebTestCase->drupalPostAJAX()
simplexml_import_dom(): Invalid Nodetype to importWarningdrupal_web_test_case.php1915DrupalWebTestCase->parse()
Parsed page successfully.Browsercommerce_payment_ui.test319CommercePaymentOffsiteTest->testCommercePaymentOffsitePayment()
Invalid argument supplied for foreach()Warningdrupal_web_test_case.php2199DrupalWebTestCase->drupalPostAJAX()
simplexml_import_dom(): Invalid Nodetype to importWarningdrupal_web_test_case.php1915DrupalWebTestCase->parse()
Parsed page successfully.Browsercommerce_payment_ui.test319CommercePaymentOffsiteTest->testCommercePaymentOffsitePayment()
Ajax response header found.Othercommerce_payment_ui.test319CommercePaymentOffsiteTest->testCommercePaymentOffsitePayment()
simplexml_import_dom(): Invalid Nodetype to importWarningdrupal_web_test_case.php1915DrupalWebTestCase->parse()
Parsed page successfully.Browsercommerce_payment_ui.test320CommercePaymentOffsiteTest->testCommercePaymentOffsitePayment()
simplexml_import_dom(): Invalid Nodetype to importWarningdrupal_web_test_case.php1915DrupalWebTestCase->parse()
Parsed page successfully.Browsercommerce_payment_ui.test322CommercePaymentOffsiteTest->testCommercePaymentOffsitePayment()
Redirection button to offsite payment platform is presentBrowsercommerce_payment_ui.test322CommercePaymentOffsiteTest->testCommercePaymentOffsitePayment()
LeafPayment Rules (CommercePaymentRulesTest) [Drupal Commerce]1200
ExpandPayment user interface (CommercePaymentUITest) [Drupal Commerce]1784540
MessageGroupFilenameLineFunctionStatus
Store customer user is able to access the checkout pageBrowsercommerce_payment_ui.test64CommercePaymentUITest->createOrderAndGoToPayment()
simplexml_import_dom(): Invalid Nodetype to importWarningdrupal_web_test_case.php1915DrupalWebTestCase->parse()
Parsed page successfully.Browsercommerce_payment_ui.test65CommercePaymentUITest->createOrderAndGoToPayment()
current() expects parameter 1 to be array, boolean givenWarningdrupal_web_test_case.php3178DrupalWebTestCase->assertTitle()
Checkout page successfully loadedOthercommerce_payment_ui.test65CommercePaymentUITest->createOrderAndGoToPayment()
simplexml_import_dom(): Invalid Nodetype to importWarningdrupal_web_test_case.php1915DrupalWebTestCase->parse()
Parsed page successfully.Browsercommerce_payment_ui.test71CommercePaymentUITest->createOrderAndGoToPayment()
simplexml_import_dom(): Invalid Nodetype to importWarningdrupal_web_test_case.php1915DrupalWebTestCase->parse()
Parsed page successfully.Browsercommerce_payment_ui.test72CommercePaymentUITest->createOrderAndGoToPayment()
Undefined index: ajaxNoticedrupal_web_test_case.php2189DrupalWebTestCase->drupalPostAJAX()
simplexml_import_dom(): Invalid Nodetype to importWarningdrupal_web_test_case.php1915DrupalWebTestCase->parse()
Parsed page successfully.Browsercommerce_payment_ui.test72CommercePaymentUITest->createOrderAndGoToPayment()
Invalid argument supplied for foreach()Warningdrupal_web_test_case.php2199DrupalWebTestCase->drupalPostAJAX()
simplexml_import_dom(): Invalid Nodetype to importWarningdrupal_web_test_case.php1915DrupalWebTestCase->parse()
Parsed page successfully.Browsercommerce_payment_ui.test72CommercePaymentUITest->createOrderAndGoToPayment()
Ajax response header found.Othercommerce_payment_ui.test72CommercePaymentUITest->createOrderAndGoToPayment()
simplexml_import_dom(): Invalid Nodetype to importWarningdrupal_web_test_case.php1915DrupalWebTestCase->parse()
Parsed page successfully.Browsercommerce_payment_ui.test76CommercePaymentUITest->createOrderAndGoToPayment()
Country selectedOthercommerce_payment_ui.test76CommercePaymentUITest->createOrderAndGoToPayment()
simplexml_import_dom(): Invalid Nodetype to importWarningdrupal_web_test_case.php1915DrupalWebTestCase->parse()
Parsed page successfully.Browsercommerce_payment_ui.test86CommercePaymentUITest->createOrderAndGoToPayment()
simplexml_import_dom(): Invalid Nodetype to importWarningdrupal_web_test_case.php1915DrupalWebTestCase->parse()
Parsed page successfully.Browsercommerce_payment_ui.test89CommercePaymentUITest->createOrderAndGoToPayment()
current() expects parameter 1 to be array, boolean givenWarningdrupal_web_test_case.php3178DrupalWebTestCase->assertTitle()
Review order page successfully loadedOthercommerce_payment_ui.test89CommercePaymentUITest->createOrderAndGoToPayment()
Example payment method pane is presentOthercommerce_payment_ui.test98CommercePaymentUITest->testCommercePaymentCheckout()
simplexml_import_dom(): Invalid Nodetype to importWarningdrupal_web_test_case.php1915DrupalWebTestCase->parse()
Parsed page successfully.Browsercommerce_payment_ui.test101CommercePaymentUITest->testCommercePaymentCheckout()
Trying to get property of non-objectNoticecommerce_payment_ui.test107CommercePaymentUITest->testCommercePaymentCheckout()
Payment was successfully processedOthercommerce_payment_ui.test107CommercePaymentUITest->testCommercePaymentCheckout()
simplexml_import_dom(): Invalid Nodetype to importWarningdrupal_web_test_case.php1915DrupalWebTestCase->parse()
Parsed page successfully.Browsercommerce_payment_ui.test110CommercePaymentUITest->testCommercePaymentCheckout()
current() expects parameter 1 to be array, boolean givenWarningdrupal_web_test_case.php3178DrupalWebTestCase->assertTitle()
Checkout process completed successfullyOthercommerce_payment_ui.test110CommercePaymentUITest->testCommercePaymentCheckout()
Store customer user is able to access the checkout pageBrowsercommerce_payment_ui.test64CommercePaymentUITest->createOrderAndGoToPayment()
simplexml_import_dom(): Invalid Nodetype to importWarningdrupal_web_test_case.php1915DrupalWebTestCase->parse()
Parsed page successfully.Browsercommerce_payment_ui.test65CommercePaymentUITest->createOrderAndGoToPayment()
current() expects parameter 1 to be array, boolean givenWarningdrupal_web_test_case.php3178DrupalWebTestCase->assertTitle()
Checkout page successfully loadedOthercommerce_payment_ui.test65CommercePaymentUITest->createOrderAndGoToPayment()
simplexml_import_dom(): Invalid Nodetype to importWarningdrupal_web_test_case.php1915DrupalWebTestCase->parse()
Parsed page successfully.Browsercommerce_payment_ui.test71CommercePaymentUITest->createOrderAndGoToPayment()
simplexml_import_dom(): Invalid Nodetype to importWarningdrupal_web_test_case.php1915DrupalWebTestCase->parse()
Parsed page successfully.Browsercommerce_payment_ui.test72CommercePaymentUITest->createOrderAndGoToPayment()
Undefined index: ajaxNoticedrupal_web_test_case.php2189DrupalWebTestCase->drupalPostAJAX()
simplexml_import_dom(): Invalid Nodetype to importWarningdrupal_web_test_case.php1915DrupalWebTestCase->parse()
Parsed page successfully.Browsercommerce_payment_ui.test72CommercePaymentUITest->createOrderAndGoToPayment()
Invalid argument supplied for foreach()Warningdrupal_web_test_case.php2199DrupalWebTestCase->drupalPostAJAX()
simplexml_import_dom(): Invalid Nodetype to importWarningdrupal_web_test_case.php1915DrupalWebTestCase->parse()
Parsed page successfully.Browsercommerce_payment_ui.test72CommercePaymentUITest->createOrderAndGoToPayment()
Ajax response header found.Othercommerce_payment_ui.test72CommercePaymentUITest->createOrderAndGoToPayment()
simplexml_import_dom(): Invalid Nodetype to importWarningdrupal_web_test_case.php1915DrupalWebTestCase->parse()
Parsed page successfully.Browsercommerce_payment_ui.test76CommercePaymentUITest->createOrderAndGoToPayment()
Country selectedOthercommerce_payment_ui.test76CommercePaymentUITest->createOrderAndGoToPayment()
simplexml_import_dom(): Invalid Nodetype to importWarningdrupal_web_test_case.php1915DrupalWebTestCase->parse()
Parsed page successfully.Browsercommerce_payment_ui.test86CommercePaymentUITest->createOrderAndGoToPayment()
simplexml_import_dom(): Invalid Nodetype to importWarningdrupal_web_test_case.php1915DrupalWebTestCase->parse()
Parsed page successfully.Browsercommerce_payment_ui.test89CommercePaymentUITest->createOrderAndGoToPayment()
current() expects parameter 1 to be array, boolean givenWarningdrupal_web_test_case.php3178DrupalWebTestCase->assertTitle()
Review order page successfully loadedOthercommerce_payment_ui.test89CommercePaymentUITest->createOrderAndGoToPayment()
Store customer user is able to access the checkout pageBrowsercommerce_payment_ui.test64CommercePaymentUITest->createOrderAndGoToPayment()
simplexml_import_dom(): Invalid Nodetype to importWarningdrupal_web_test_case.php1915DrupalWebTestCase->parse()
Parsed page successfully.Browsercommerce_payment_ui.test65CommercePaymentUITest->createOrderAndGoToPayment()
current() expects parameter 1 to be array, boolean givenWarningdrupal_web_test_case.php3178DrupalWebTestCase->assertTitle()
Checkout page successfully loadedOthercommerce_payment_ui.test65CommercePaymentUITest->createOrderAndGoToPayment()
simplexml_import_dom(): Invalid Nodetype to importWarningdrupal_web_test_case.php1915DrupalWebTestCase->parse()
Parsed page successfully.Browsercommerce_payment_ui.test71CommercePaymentUITest->createOrderAndGoToPayment()
simplexml_import_dom(): Invalid Nodetype to importWarningdrupal_web_test_case.php1915DrupalWebTestCase->parse()
Parsed page successfully.Browsercommerce_payment_ui.test72CommercePaymentUITest->createOrderAndGoToPayment()
Undefined index: ajaxNoticedrupal_web_test_case.php2189DrupalWebTestCase->drupalPostAJAX()
simplexml_import_dom(): Invalid Nodetype to importWarningdrupal_web_test_case.php1915DrupalWebTestCase->parse()
Parsed page successfully.Browsercommerce_payment_ui.test72CommercePaymentUITest->createOrderAndGoToPayment()
Invalid argument supplied for foreach()Warningdrupal_web_test_case.php2199DrupalWebTestCase->drupalPostAJAX()
simplexml_import_dom(): Invalid Nodetype to importWarningdrupal_web_test_case.php1915DrupalWebTestCase->parse()
Parsed page successfully.Browsercommerce_payment_ui.test72CommercePaymentUITest->createOrderAndGoToPayment()
Ajax response header found.Othercommerce_payment_ui.test72CommercePaymentUITest->createOrderAndGoToPayment()
simplexml_import_dom(): Invalid Nodetype to importWarningdrupal_web_test_case.php1915DrupalWebTestCase->parse()
Parsed page successfully.Browsercommerce_payment_ui.test76CommercePaymentUITest->createOrderAndGoToPayment()
Country selectedOthercommerce_payment_ui.test76CommercePaymentUITest->createOrderAndGoToPayment()
simplexml_import_dom(): Invalid Nodetype to importWarningdrupal_web_test_case.php1915DrupalWebTestCase->parse()
Parsed page successfully.Browsercommerce_payment_ui.test86CommercePaymentUITest->createOrderAndGoToPayment()
simplexml_import_dom(): Invalid Nodetype to importWarningdrupal_web_test_case.php1915DrupalWebTestCase->parse()
Parsed page successfully.Browsercommerce_payment_ui.test89CommercePaymentUITest->createOrderAndGoToPayment()
current() expects parameter 1 to be array, boolean givenWarningdrupal_web_test_case.php3178DrupalWebTestCase->assertTitle()
Review order page successfully loadedOthercommerce_payment_ui.test89CommercePaymentUITest->createOrderAndGoToPayment()
Example payment method panel is presentOthercommerce_payment_ui.test221CommercePaymentUITest->testCommercePaymentMethodsAdministration()
LeafProduct administration (CommerceProductUIAdminTest) [Drupal Commerce]47600
LeafProduct CRUD (CommerceProductCRUDTestCase) [Drupal Commerce]7100
LeafProduct reference (CommerceProductReferenceAdminTest) [Drupal Commerce]29300
LeafShopping cart (CommerceCartTestCaseSimpleProduct) [Drupal Commerce]14400
LeafShopping cart anonymous to authenticated (CommerceCartTestCaseAnonymousToAuthenticated) [Drupal Commerce]3400
LeafShopping cart attributes (CommerceCartTestCaseAttributes) [Drupal Commerce]5000
LeafShopping cart multiple (CommerceCartTestCaseMultiProducts) [Drupal Commerce]9400
ExpandTax administration (CommerceTaxUIAdminTest) [Drupal Commerce]5881816
MessageGroupFilenameLineFunctionStatus
Tax appears in the order summaryOthercommerce_tax_ui.test589CommerceTaxUIAdminTest->testCommerceTaxUIApplySalesTax()
Tax amount applied appears in the order summaryOthercommerce_tax_ui.test590CommerceTaxUIAdminTest->testCommerceTaxUIApplySalesTax()
simplexml_import_dom(): Invalid Nodetype to importWarningdrupal_web_test_case.php1915DrupalWebTestCase->parse()
Parsed page successfully.Browsercommerce_tax_ui.test64CommerceTaxUIAdminTest->commerceTaxHelperCompleteCheckout()
simplexml_import_dom(): Invalid Nodetype to importWarningdrupal_web_test_case.php1915DrupalWebTestCase->parse()
Parsed page successfully.Browsercommerce_tax_ui.test65CommerceTaxUIAdminTest->commerceTaxHelperCompleteCheckout()
Undefined index: ajaxNoticedrupal_web_test_case.php2189DrupalWebTestCase->drupalPostAJAX()
simplexml_import_dom(): Invalid Nodetype to importWarningdrupal_web_test_case.php1915DrupalWebTestCase->parse()
Parsed page successfully.Browsercommerce_tax_ui.test65CommerceTaxUIAdminTest->commerceTaxHelperCompleteCheckout()
Invalid argument supplied for foreach()Warningdrupal_web_test_case.php2199DrupalWebTestCase->drupalPostAJAX()
simplexml_import_dom(): Invalid Nodetype to importWarningdrupal_web_test_case.php1915DrupalWebTestCase->parse()
Parsed page successfully.Browsercommerce_tax_ui.test65CommerceTaxUIAdminTest->commerceTaxHelperCompleteCheckout()
Ajax response header found.Othercommerce_tax_ui.test65CommerceTaxUIAdminTest->commerceTaxHelperCompleteCheckout()
simplexml_import_dom(): Invalid Nodetype to importWarningdrupal_web_test_case.php1915DrupalWebTestCase->parse()
Parsed page successfully.Browsercommerce_tax_ui.test73CommerceTaxUIAdminTest->commerceTaxHelperCompleteCheckout()
simplexml_import_dom(): Invalid Nodetype to importWarningdrupal_web_test_case.php1915DrupalWebTestCase->parse()
Parsed page successfully.Browsercommerce_tax_ui.test74CommerceTaxUIAdminTest->commerceTaxHelperCompleteCheckout()
Tax display title is displayed in the user view of an order.Othercommerce_tax_ui.test724CommerceTaxUIAdminTest->testCommerceTaxUIUserOrderView()
Tax amount is displayed in the user view of an order.Othercommerce_tax_ui.test725CommerceTaxUIAdminTest->testCommerceTaxUIUserOrderView()
simplexml_import_dom(): Invalid Nodetype to importWarningdrupal_web_test_case.php1915DrupalWebTestCase->parse()
Parsed page successfully.Browsercommerce_tax_ui.test64CommerceTaxUIAdminTest->commerceTaxHelperCompleteCheckout()
simplexml_import_dom(): Invalid Nodetype to importWarningdrupal_web_test_case.php1915DrupalWebTestCase->parse()
Parsed page successfully.Browsercommerce_tax_ui.test65CommerceTaxUIAdminTest->commerceTaxHelperCompleteCheckout()
Undefined index: ajaxNoticedrupal_web_test_case.php2189DrupalWebTestCase->drupalPostAJAX()
simplexml_import_dom(): Invalid Nodetype to importWarningdrupal_web_test_case.php1915DrupalWebTestCase->parse()
Parsed page successfully.Browsercommerce_tax_ui.test65CommerceTaxUIAdminTest->commerceTaxHelperCompleteCheckout()
Invalid argument supplied for foreach()Warningdrupal_web_test_case.php2199DrupalWebTestCase->drupalPostAJAX()
simplexml_import_dom(): Invalid Nodetype to importWarningdrupal_web_test_case.php1915DrupalWebTestCase->parse()
Parsed page successfully.Browsercommerce_tax_ui.test65CommerceTaxUIAdminTest->commerceTaxHelperCompleteCheckout()
Ajax response header found.Othercommerce_tax_ui.test65CommerceTaxUIAdminTest->commerceTaxHelperCompleteCheckout()
simplexml_import_dom(): Invalid Nodetype to importWarningdrupal_web_test_case.php1915DrupalWebTestCase->parse()
Parsed page successfully.Browsercommerce_tax_ui.test73CommerceTaxUIAdminTest->commerceTaxHelperCompleteCheckout()
simplexml_import_dom(): Invalid Nodetype to importWarningdrupal_web_test_case.php1915DrupalWebTestCase->parse()
Parsed page successfully.Browsercommerce_tax_ui.test74CommerceTaxUIAdminTest->commerceTaxHelperCompleteCheckout()