Add_sort_job_items-2573101-7.patch

Test status
StatusResult
Last receivedThu, 10/08/2015 - 13:46:00
Last requestedThu, 10/08/2015 - 13:46:01
Last testedThu, 10/08/2015 - 13:49:15
Test count1
Environment status
PHP 5.5 MySQLfail
File information
FileAdd_sort_job_items-2573101-7.patch
BranchTranslation Management Tool - 8.x-1.x
LinkIssue Link
SummaryFAILED: [[SimpleTest]]: [PHP 5.5 MySQL] 2,779 pass(es), 14 fail(s), and 4 exception(s).
Details

PHP 5.5 MySQL

  1. Setup environment
  2. Detect an invalid patch URL
  3. Detect invalid repository information
  4. Detect invalid patch format
  5. Detect a non-applicable patch
  6. Detect invalid PHP syntax
  7. Detect a Drupal installation failure
  8. Detect a test run failure
  9. Detect a failing test
    Review the test failures below then if necessary run them locally until the problem has been fixed.
  10. Complete test suite with all tests passing
2,779 pass(es), 14 fail(s), and 4 exception(s)

Non-pass

Test namePassFailException
ExpandDrupal\tmgmt\Tests\TMGMTUiTest666144
MessageGroupFilenameLineFunctionStatus
Ajax response header found. Value false is identical to value '1'.OtherTMGMTUiTest.php249Drupal\tmgmt\Tests\TMGMTUiTest->testCheckoutForm()
[09-Oct-2015 00:46:43 Australia/Sydney] Uncaught PHP Exception Symfony\Component\HttpKernel\Exception\HttpException: "The specified #ajax callback is empty or not callable." at /var/lib/drupaltestbot/sites/default/files/checkout/core/lib/Drupal/Core/Form/FormAjaxResponseBuilder.php line 72 Fatal errorUnknown0Unknown
Ajax response header found. Value false is identical to value '1'.OtherTMGMTUiTest.php553Drupal\tmgmt\Tests\TMGMTUiTest->testSuggestions()
Found 5 commands in AJAX-Request. Value 1 is equal to value 5.OtherTMGMTUiTest.php554Drupal\tmgmt\Tests\TMGMTUiTest->testSuggestions()
Illegal string offset 'command'Drupal\tmgmt\Tests\TMGMTUiTest->testSuggestions() Drupal\simpletest\TestBase->run(Array) simpletest_script_run_one_test('13', 'Drupal\tmgmt\Tests\TMGMTUiTest') WarningTMGMTUiTest.php559Drupal\tmgmt\Tests\TMGMTUiTest->testSuggestions()
Illegal string offset 'command'Drupal\tmgmt\Tests\TMGMTUiTest->testSuggestions() Drupal\simpletest\TestBase->run(Array) simpletest_script_run_one_test('13', 'Drupal\tmgmt\Tests\TMGMTUiTest') WarningTMGMTUiTest.php559Drupal\tmgmt\Tests\TMGMTUiTest->testSuggestions()
Illegal string offset 'data'Drupal\tmgmt\Tests\TMGMTUiTest->testSuggestions() Drupal\simpletest\TestBase->run(Array) simpletest_script_run_one_test('13', 'Drupal\tmgmt\Tests\TMGMTUiTest') WarningTMGMTUiTest.php559Drupal\tmgmt\Tests\TMGMTUiTest->testSuggestions()
Illegal string offset 'command'Drupal\tmgmt\Tests\TMGMTUiTest->testSuggestions() Drupal\simpletest\TestBase->run(Array) simpletest_script_run_one_test('13', 'Drupal\tmgmt\Tests\TMGMTUiTest') WarningTMGMTUiTest.php562Drupal\tmgmt\Tests\TMGMTUiTest->testSuggestions()
Unknown command.OtherTMGMTUiTest.php583Drupal\tmgmt\Tests\TMGMTUiTest->testSuggestions()
"test_source:test_suggestion:1" foundOtherTMGMTUiTest.php587Drupal\tmgmt\Tests\TMGMTUiTest->testSuggestions()
"test_source:test_suggestion:7" foundOtherTMGMTUiTest.php588Drupal\tmgmt\Tests\TMGMTUiTest->testSuggestions()
"Test suggestion for test source 1" foundOtherTMGMTUiTest.php589Drupal\tmgmt\Tests\TMGMTUiTest->testSuggestions()
"Test suggestion for test source 7" foundOtherTMGMTUiTest.php590Drupal\tmgmt\Tests\TMGMTUiTest->testSuggestions()
Failed to set field suggestions_table[2] to 1OtherTMGMTUiTest.php594Drupal\tmgmt\Tests\TMGMTUiTest->testSuggestions()
Found the Add suggestions buttonOtherTMGMTUiTest.php594Drupal\tmgmt\Tests\TMGMTUiTest->testSuggestions()
Found the requested form fields at OtherTMGMTUiTest.php594Drupal\tmgmt\Tests\TMGMTUiTest->testSuggestions()
"test_source:test_suggestion_suggestion:7" foundOtherTMGMTUiTest.php601Drupal\tmgmt\Tests\TMGMTUiTest->testSuggestions()
[09-Oct-2015 00:47:47 Australia/Sydney] Uncaught PHP Exception Symfony\Component\HttpKernel\Exception\HttpException: "The specified #ajax callback is empty or not callable." at /var/lib/drupaltestbot/sites/default/files/checkout/core/lib/Drupal/Core/Form/FormAjaxResponseBuilder.php line 72 Fatal errorUnknown0Unknown

All

Test namePassFailException
LeafDrupal\tmgmt\Tests\CrudTest19900
LeafDrupal\tmgmt\Tests\HelperTest4300
LeafDrupal\tmgmt\Tests\LocalTasksTests3100
LeafDrupal\tmgmt\Tests\PluginsTest5000
LeafDrupal\tmgmt\Tests\TMGMTCartTest5200
ExpandDrupal\tmgmt\Tests\TMGMTUiTest666144
MessageGroupFilenameLineFunctionStatus
Ajax response header found. Value false is identical to value '1'.OtherTMGMTUiTest.php249Drupal\tmgmt\Tests\TMGMTUiTest->testCheckoutForm()
[09-Oct-2015 00:46:43 Australia/Sydney] Uncaught PHP Exception Symfony\Component\HttpKernel\Exception\HttpException: "The specified #ajax callback is empty or not callable." at /var/lib/drupaltestbot/sites/default/files/checkout/core/lib/Drupal/Core/Form/FormAjaxResponseBuilder.php line 72 Fatal errorUnknown0Unknown
Ajax response header found. Value false is identical to value '1'.OtherTMGMTUiTest.php553Drupal\tmgmt\Tests\TMGMTUiTest->testSuggestions()
Found 5 commands in AJAX-Request. Value 1 is equal to value 5.OtherTMGMTUiTest.php554Drupal\tmgmt\Tests\TMGMTUiTest->testSuggestions()
Illegal string offset 'command'Drupal\tmgmt\Tests\TMGMTUiTest->testSuggestions() Drupal\simpletest\TestBase->run(Array) simpletest_script_run_one_test('13', 'Drupal\tmgmt\Tests\TMGMTUiTest') WarningTMGMTUiTest.php559Drupal\tmgmt\Tests\TMGMTUiTest->testSuggestions()
Illegal string offset 'command'Drupal\tmgmt\Tests\TMGMTUiTest->testSuggestions() Drupal\simpletest\TestBase->run(Array) simpletest_script_run_one_test('13', 'Drupal\tmgmt\Tests\TMGMTUiTest') WarningTMGMTUiTest.php559Drupal\tmgmt\Tests\TMGMTUiTest->testSuggestions()
Illegal string offset 'data'Drupal\tmgmt\Tests\TMGMTUiTest->testSuggestions() Drupal\simpletest\TestBase->run(Array) simpletest_script_run_one_test('13', 'Drupal\tmgmt\Tests\TMGMTUiTest') WarningTMGMTUiTest.php559Drupal\tmgmt\Tests\TMGMTUiTest->testSuggestions()
Illegal string offset 'command'Drupal\tmgmt\Tests\TMGMTUiTest->testSuggestions() Drupal\simpletest\TestBase->run(Array) simpletest_script_run_one_test('13', 'Drupal\tmgmt\Tests\TMGMTUiTest') WarningTMGMTUiTest.php562Drupal\tmgmt\Tests\TMGMTUiTest->testSuggestions()
Unknown command.OtherTMGMTUiTest.php583Drupal\tmgmt\Tests\TMGMTUiTest->testSuggestions()
"test_source:test_suggestion:1" foundOtherTMGMTUiTest.php587Drupal\tmgmt\Tests\TMGMTUiTest->testSuggestions()
"test_source:test_suggestion:7" foundOtherTMGMTUiTest.php588Drupal\tmgmt\Tests\TMGMTUiTest->testSuggestions()
"Test suggestion for test source 1" foundOtherTMGMTUiTest.php589Drupal\tmgmt\Tests\TMGMTUiTest->testSuggestions()
"Test suggestion for test source 7" foundOtherTMGMTUiTest.php590Drupal\tmgmt\Tests\TMGMTUiTest->testSuggestions()
Failed to set field suggestions_table[2] to 1OtherTMGMTUiTest.php594Drupal\tmgmt\Tests\TMGMTUiTest->testSuggestions()
Found the Add suggestions buttonOtherTMGMTUiTest.php594Drupal\tmgmt\Tests\TMGMTUiTest->testSuggestions()
Found the requested form fields at OtherTMGMTUiTest.php594Drupal\tmgmt\Tests\TMGMTUiTest->testSuggestions()
"test_source:test_suggestion_suggestion:7" foundOtherTMGMTUiTest.php601Drupal\tmgmt\Tests\TMGMTUiTest->testSuggestions()
[09-Oct-2015 00:47:47 Australia/Sydney] Uncaught PHP Exception Symfony\Component\HttpKernel\Exception\HttpException: "The specified #ajax callback is empty or not callable." at /var/lib/drupaltestbot/sites/default/files/checkout/core/lib/Drupal/Core/Form/FormAjaxResponseBuilder.php line 72 Fatal errorUnknown0Unknown
LeafDrupal\tmgmt\Tests\TranslatorTest8500
LeafDrupal\tmgmt\Tests\TranslatorUITest3000
LeafDrupal\tmgmt_config\Tests\ConfigSourceListTest27900
LeafDrupal\tmgmt_config\Tests\ConfigSourceUiTest30100
LeafDrupal\tmgmt_config\Tests\ConfigSourceUnitTest8900
LeafDrupal\tmgmt_content\Tests\ContentEntitySourceListTest16100
LeafDrupal\tmgmt_content\Tests\ContentEntitySourceUiTest29000
LeafDrupal\tmgmt_content\Tests\ContentEntitySourceUnitTest14600
LeafDrupal\tmgmt_content\Tests\ContentEntitySuggestionsTest2400
LeafDrupal\tmgmt_demo\Tests\TMGMTDemoTest4800
LeafDrupal\tmgmt_file\Tests\FileTranslatorTest17200
LeafDrupal\tmgmt_locale\Tests\LocaleSourceTest6300
LeafDrupal\tmgmt_locale\Tests\LocaleSourceUiTest5000