criteria_aggregator-2376007-13.patch

Test status
StatusResult
Last receivedThu, 10/08/2015 - 11:53:01
Last requestedThu, 10/08/2015 - 11:53:02
Last testedThu, 10/08/2015 - 11:56:52
Test count1
Environment status
MySQLfail
File information
Filecriteria_aggregator-2376007-13.patch
BranchMonitoring - 7.x-1.x
LinkIssue Link
SummaryFAILED: [[SimpleTest]]: [MySQL] 1,106 pass(es), 249 fail(s), and 132 exception(s).
Details

MySQL

  1. Setup environment
  2. Detect an invalid patch URL
  3. Detect invalid repository information
  4. Detect invalid patch format
  5. Detect a non-applicable patch
  6. Detect invalid PHP syntax
  7. Detect a Drupal installation failure
  8. Detect a test run failure
  9. Detect a failing test
    Review the test failures below then if necessary run them locally until the problem has been fixed.
  10. Complete test suite with all tests passing
1,106 pass(es), 249 fail(s), and 132 exception(s)

Non-pass

Test namePassFailException
ExpandMonitoring commerce (MonitoringCommerceTest) [Monitoring]020
MessageGroupFilenameLineFunctionStatus
The test did not complete due to a fatal error.Completion checkmonitoring.commerce.test31MonitoringCommerceTest->testTurnoverSensors()
Enabled modules: monitoring, monitoring_test, commerce_orderOthermonitoring.base.test35MonitoringTestBase->setUp()
ExpandMonitoring services (MonitoringServicesTest) [Monitoring]5161974
MessageGroupFilenameLineFunctionStatus
Argument 2 passed to Drupal\monitoring\Sensor\Sensors\SensorDatabaseAggregator::getFieldName() must be an array, string given, called in /var/lib/drupaltestbot/sites/default/files/checkout/sites/default/modules/monitoring/lib/Drupal/monitoring/Sensor/Sensors/SensorDatabaseAggregator.php on line 135 and definedRecoverable fatal errorSensorDatabaseAggregator.php162Drupal\monitoring\Sensor\Sensors\SensorDatabaseAggregator->getFieldName()
HTTP response expected 200, actual 500Browsermonitoring.services.test96MonitoringServicesTest->testSensorResult()
Value false is TRUE.Othermonitoring.services.test98MonitoringServicesTest->testSensorResult()
Value NULL is equal to value 'core_cron_safe_threshold'.Othermonitoring.services.test99MonitoringServicesTest->testSensorResult()
Value NULL is equal to value 'http://ec2-54-148-9-230.us-west-2.compute.amazonaws.com/checkout/?q=monitoring/v1/sensor-result/core_cron_safe_threshold'.Othermonitoring.services.test99MonitoringServicesTest->testSensorResult()
Value false is TRUE.Othermonitoring.services.test98MonitoringServicesTest->testSensorResult()
Value NULL is equal to value 'core_cron_last_run_age'.Othermonitoring.services.test99MonitoringServicesTest->testSensorResult()
Value NULL is equal to value 'http://ec2-54-148-9-230.us-west-2.compute.amazonaws.com/checkout/?q=monitoring/v1/sensor-result/core_cron_last_run_age'.Othermonitoring.services.test99MonitoringServicesTest->testSensorResult()
Value false is TRUE.Othermonitoring.services.test98MonitoringServicesTest->testSensorResult()
Value NULL is equal to value 'core_maintenance_mode'.Othermonitoring.services.test99MonitoringServicesTest->testSensorResult()
Value NULL is equal to value 'http://ec2-54-148-9-230.us-west-2.compute.amazonaws.com/checkout/?q=monitoring/v1/sensor-result/core_maintenance_mode'.Othermonitoring.services.test99MonitoringServicesTest->testSensorResult()
Value false is TRUE.Othermonitoring.services.test98MonitoringServicesTest->testSensorResult()
Value NULL is equal to value 'core_queue_monitoring_test'.Othermonitoring.services.test99MonitoringServicesTest->testSensorResult()
Value NULL is equal to value 'http://ec2-54-148-9-230.us-west-2.compute.amazonaws.com/checkout/?q=monitoring/v1/sensor-result/core_queue_monitoring_test'.Othermonitoring.services.test99MonitoringServicesTest->testSensorResult()
Value false is TRUE.Othermonitoring.services.test98MonitoringServicesTest->testSensorResult()
Value NULL is equal to value 'core_requirements_ctools'.Othermonitoring.services.test99MonitoringServicesTest->testSensorResult()
Value NULL is equal to value 'http://ec2-54-148-9-230.us-west-2.compute.amazonaws.com/checkout/?q=monitoring/v1/sensor-result/core_requirements_ctools'.Othermonitoring.services.test99MonitoringServicesTest->testSensorResult()
Value NULL is equal to value 'OK'.Othermonitoring.services.test99MonitoringServicesTest->testSensorResult()
Value NULL is equal to value 'CTools CSS Cache, Exists'.Othermonitoring.services.test99MonitoringServicesTest->testSensorResult()
Value NULL is equal to value 1444305382.Othermonitoring.services.test99MonitoringServicesTest->testSensorResult()
Value NULL is equal to value 0.17.Othermonitoring.services.test99MonitoringServicesTest->testSensorResult()
Value false is TRUE.Othermonitoring.services.test98MonitoringServicesTest->testSensorResult()
Value NULL is equal to value 'core_requirements_monitoring_test'.Othermonitoring.services.test99MonitoringServicesTest->testSensorResult()
Value NULL is equal to value 'http://ec2-54-148-9-230.us-west-2.compute.amazonaws.com/checkout/?q=monitoring/v1/sensor-result/core_requirements_monitoring_test'.Othermonitoring.services.test99MonitoringServicesTest->testSensorResult()
Value NULL is equal to value 'OK'.Othermonitoring.services.test99MonitoringServicesTest->testSensorResult()
Value NULL is equal to value 'Requirements check OK'.Othermonitoring.services.test99MonitoringServicesTest->testSensorResult()
Value NULL is equal to value 1444305382.Othermonitoring.services.test99MonitoringServicesTest->testSensorResult()
Value NULL is equal to value 0.06.Othermonitoring.services.test99MonitoringServicesTest->testSensorResult()
Value false is TRUE.Othermonitoring.services.test98MonitoringServicesTest->testSensorResult()
Value NULL is equal to value 'core_requirements_node'.Othermonitoring.services.test99MonitoringServicesTest->testSensorResult()
Value NULL is equal to value 'http://ec2-54-148-9-230.us-west-2.compute.amazonaws.com/checkout/?q=monitoring/v1/sensor-result/core_requirements_node'.Othermonitoring.services.test99MonitoringServicesTest->testSensorResult()
Value NULL is equal to value 'OK'.Othermonitoring.services.test99MonitoringServicesTest->testSensorResult()
Value NULL is equal to value 'No value'.Othermonitoring.services.test99MonitoringServicesTest->testSensorResult()
Value NULL is equal to value 1444305382.Othermonitoring.services.test99MonitoringServicesTest->testSensorResult()
Value NULL is equal to value 0.76.Othermonitoring.services.test99MonitoringServicesTest->testSensorResult()
Value false is TRUE.Othermonitoring.services.test98MonitoringServicesTest->testSensorResult()
Value NULL is equal to value 'core_requirements_rest_server'.Othermonitoring.services.test99MonitoringServicesTest->testSensorResult()
Value NULL is equal to value 'http://ec2-54-148-9-230.us-west-2.compute.amazonaws.com/checkout/?q=monitoring/v1/sensor-result/core_requirements_rest_server'.Othermonitoring.services.test99MonitoringServicesTest->testSensorResult()
Value NULL is equal to value 'WARNING'.Othermonitoring.services.test99MonitoringServicesTest->testSensorResult()
Value NULL is equal to value 'Spyc, The <em class="placeholder">Spyc</em> library could not be found.'.Othermonitoring.services.test99MonitoringServicesTest->testSensorResult()
Value NULL is equal to value 1444305382.Othermonitoring.services.test99MonitoringServicesTest->testSensorResult()
Value NULL is equal to value 1.85.Othermonitoring.services.test99MonitoringServicesTest->testSensorResult()
Value false is TRUE.Othermonitoring.services.test98MonitoringServicesTest->testSensorResult()
Value NULL is equal to value 'core_requirements_services'.Othermonitoring.services.test99MonitoringServicesTest->testSensorResult()
Value NULL is equal to value 'http://ec2-54-148-9-230.us-west-2.compute.amazonaws.com/checkout/?q=monitoring/v1/sensor-result/core_requirements_services'.Othermonitoring.services.test99MonitoringServicesTest->testSensorResult()
Value NULL is equal to value 'OK'.Othermonitoring.services.test99MonitoringServicesTest->testSensorResult()
Value NULL is equal to value 'Services Authentication Mechanism, Enabled for all Endpoints'.Othermonitoring.services.test99MonitoringServicesTest->testSensorResult()
Value NULL is equal to value 1444305382.Othermonitoring.services.test99MonitoringServicesTest->testSensorResult()
Value NULL is equal to value 0.25.Othermonitoring.services.test99MonitoringServicesTest->testSensorResult()
Value false is TRUE.Othermonitoring.services.test98MonitoringServicesTest->testSensorResult()
Value NULL is equal to value 'core_requirements_system'.Othermonitoring.services.test99MonitoringServicesTest->testSensorResult()
Value NULL is equal to value 'http://ec2-54-148-9-230.us-west-2.compute.amazonaws.com/checkout/?q=monitoring/v1/sensor-result/core_requirements_system'.Othermonitoring.services.test99MonitoringServicesTest->testSensorResult()
Value NULL is equal to value 'WARNING'.Othermonitoring.services.test99MonitoringServicesTest->testSensorResult()
Value NULL is equal to value 'Update notifications, Update notifications are not enabled. It is <strong>highly recommended</strong> that you enable the update manager module from the <a href="/checkout/?q=admin/modules">module administration page</a> in order to stay up-to-date on new releases. For more information, <a href="http://drupal.org/documentation/modules/update">Update status handbook page</a>., Not enabled'.Othermonitoring.services.test99MonitoringServicesTest->testSensorResult()
Value NULL is equal to value 1444305382.Othermonitoring.services.test99MonitoringServicesTest->testSensorResult()
Value NULL is equal to value 83.26.Othermonitoring.services.test99MonitoringServicesTest->testSensorResult()
Value false is TRUE.Othermonitoring.services.test98MonitoringServicesTest->testSensorResult()
Value NULL is equal to value 'monitoring_disappeared_sensors'.Othermonitoring.services.test99MonitoringServicesTest->testSensorResult()
Value NULL is equal to value 'http://ec2-54-148-9-230.us-west-2.compute.amazonaws.com/checkout/?q=monitoring/v1/sensor-result/monitoring_disappeared_sensors'.Othermonitoring.services.test99MonitoringServicesTest->testSensorResult()
Value false is TRUE.Othermonitoring.services.test98MonitoringServicesTest->testSensorResult()
Value NULL is equal to value 'db_aggregate_test'.Othermonitoring.services.test99MonitoringServicesTest->testSensorResult()
Value NULL is equal to value 'http://ec2-54-148-9-230.us-west-2.compute.amazonaws.com/checkout/?q=monitoring/v1/sensor-result/db_aggregate_test'.Othermonitoring.services.test99MonitoringServicesTest->testSensorResult()
Value NULL is equal to value 'CRITICAL'.Othermonitoring.services.test99MonitoringServicesTest->testSensorResult()
Value NULL is equal to value '0'.Othermonitoring.services.test99MonitoringServicesTest->testSensorResult()
Value NULL is equal to value '0'.Othermonitoring.services.test99MonitoringServicesTest->testSensorResult()
Value NULL is equal to value '0 druplicons in 1 day, falls below 1'.Othermonitoring.services.test99MonitoringServicesTest->testSensorResult()
Value NULL is equal to value 1444305382.Othermonitoring.services.test99MonitoringServicesTest->testSensorResult()
Value NULL is equal to value 0.4.Othermonitoring.services.test99MonitoringServicesTest->testSensorResult()
Value false is TRUE.Othermonitoring.services.test98MonitoringServicesTest->testSensorResult()
Value NULL is equal to value 'test_sensor_integration'.Othermonitoring.services.test99MonitoringServicesTest->testSensorResult()
Value NULL is equal to value 'http://ec2-54-148-9-230.us-west-2.compute.amazonaws.com/checkout/?q=monitoring/v1/sensor-result/test_sensor_integration'.Othermonitoring.services.test99MonitoringServicesTest->testSensorResult()
Value false is TRUE.Othermonitoring.services.test98MonitoringServicesTest->testSensorResult()
Value NULL is equal to value 'test_sensor'.Othermonitoring.services.test99MonitoringServicesTest->testSensorResult()
Value NULL is equal to value 'http://ec2-54-148-9-230.us-west-2.compute.amazonaws.com/checkout/?q=monitoring/v1/sensor-result/test_sensor'.Othermonitoring.services.test99MonitoringServicesTest->testSensorResult()
Value NULL is equal to value 'OK'.Othermonitoring.services.test99MonitoringServicesTest->testSensorResult()
Value NULL is equal to value 'No value'.Othermonitoring.services.test99MonitoringServicesTest->testSensorResult()
Value NULL is equal to value 1444305382.Othermonitoring.services.test99MonitoringServicesTest->testSensorResult()
Value NULL is equal to value 0.19.Othermonitoring.services.test99MonitoringServicesTest->testSensorResult()
Value false is TRUE.Othermonitoring.services.test98MonitoringServicesTest->testSensorResult()
Value NULL is equal to value 'test_sensor_exceeds'.Othermonitoring.services.test99MonitoringServicesTest->testSensorResult()
Value NULL is equal to value 'http://ec2-54-148-9-230.us-west-2.compute.amazonaws.com/checkout/?q=monitoring/v1/sensor-result/test_sensor_exceeds'.Othermonitoring.services.test99MonitoringServicesTest->testSensorResult()
Value false is TRUE.Othermonitoring.services.test98MonitoringServicesTest->testSensorResult()
Value NULL is equal to value 'test_sensor_falls'.Othermonitoring.services.test99MonitoringServicesTest->testSensorResult()
Value NULL is equal to value 'http://ec2-54-148-9-230.us-west-2.compute.amazonaws.com/checkout/?q=monitoring/v1/sensor-result/test_sensor_falls'.Othermonitoring.services.test99MonitoringServicesTest->testSensorResult()
Value false is TRUE.Othermonitoring.services.test98MonitoringServicesTest->testSensorResult()
Value NULL is equal to value 'test_sensor_inner'.Othermonitoring.services.test99MonitoringServicesTest->testSensorResult()
Value NULL is equal to value 'http://ec2-54-148-9-230.us-west-2.compute.amazonaws.com/checkout/?q=monitoring/v1/sensor-result/test_sensor_inner'.Othermonitoring.services.test99MonitoringServicesTest->testSensorResult()
Value false is TRUE.Othermonitoring.services.test98MonitoringServicesTest->testSensorResult()
Value NULL is equal to value 'test_sensor_outer'.Othermonitoring.services.test99MonitoringServicesTest->testSensorResult()
Value NULL is equal to value 'http://ec2-54-148-9-230.us-west-2.compute.amazonaws.com/checkout/?q=monitoring/v1/sensor-result/test_sensor_outer'.Othermonitoring.services.test99MonitoringServicesTest->testSensorResult()
Value false is TRUE.Othermonitoring.services.test98MonitoringServicesTest->testSensorResult()
Value NULL is equal to value 'watchdog_aggregate_test'.Othermonitoring.services.test99MonitoringServicesTest->testSensorResult()
Value NULL is equal to value 'http://ec2-54-148-9-230.us-west-2.compute.amazonaws.com/checkout/?q=monitoring/v1/sensor-result/watchdog_aggregate_test'.Othermonitoring.services.test99MonitoringServicesTest->testSensorResult()
Value false is TRUE.Othermonitoring.services.test98MonitoringServicesTest->testSensorResult()
Value NULL is equal to value 'user_sessions_all'.Othermonitoring.services.test99MonitoringServicesTest->testSensorResult()
Value NULL is equal to value 'http://ec2-54-148-9-230.us-west-2.compute.amazonaws.com/checkout/?q=monitoring/v1/sensor-result/user_sessions_all'.Othermonitoring.services.test99MonitoringServicesTest->testSensorResult()
Value false is TRUE.Othermonitoring.services.test98MonitoringServicesTest->testSensorResult()
Value NULL is equal to value 'user_sessions_authenticated'.Othermonitoring.services.test99MonitoringServicesTest->testSensorResult()
Value NULL is equal to value 'http://ec2-54-148-9-230.us-west-2.compute.amazonaws.com/checkout/?q=monitoring/v1/sensor-result/user_sessions_authenticated'.Othermonitoring.services.test99MonitoringServicesTest->testSensorResult()
Value false is TRUE.Othermonitoring.services.test98MonitoringServicesTest->testSensorResult()
Value NULL is equal to value 'user_failed_logins'.Othermonitoring.services.test99MonitoringServicesTest->testSensorResult()
Value NULL is equal to value 'http://ec2-54-148-9-230.us-west-2.compute.amazonaws.com/checkout/?q=monitoring/v1/sensor-result/user_failed_logins'.Othermonitoring.services.test99MonitoringServicesTest->testSensorResult()
Value NULL is equal to value 'OK'.Othermonitoring.services.test99MonitoringServicesTest->testSensorResult()
Value NULL is equal to value '0 login attempts in 1 day'.Othermonitoring.services.test99MonitoringServicesTest->testSensorResult()
Value NULL is equal to value 1444305382.Othermonitoring.services.test99MonitoringServicesTest->testSensorResult()
Value NULL is equal to value 0.64.Othermonitoring.services.test99MonitoringServicesTest->testSensorResult()
Value false is TRUE.Othermonitoring.services.test98MonitoringServicesTest->testSensorResult()
Value NULL is equal to value 'user_new'.Othermonitoring.services.test99MonitoringServicesTest->testSensorResult()
Value NULL is equal to value 'http://ec2-54-148-9-230.us-west-2.compute.amazonaws.com/checkout/?q=monitoring/v1/sensor-result/user_new'.Othermonitoring.services.test99MonitoringServicesTest->testSensorResult()
Value NULL is equal to value 'OK'.Othermonitoring.services.test99MonitoringServicesTest->testSensorResult()
Value NULL is equal to value '2'.Othermonitoring.services.test99MonitoringServicesTest->testSensorResult()
Value NULL is equal to value '2'.Othermonitoring.services.test99MonitoringServicesTest->testSensorResult()
Value NULL is equal to value '2 users in 1 day'.Othermonitoring.services.test99MonitoringServicesTest->testSensorResult()
Value NULL is equal to value 1444305382.Othermonitoring.services.test99MonitoringServicesTest->testSensorResult()
Value NULL is equal to value 0.36.Othermonitoring.services.test99MonitoringServicesTest->testSensorResult()
Value false is TRUE.Othermonitoring.services.test98MonitoringServicesTest->testSensorResult()
Value NULL is equal to value 'user_successful_logins'.Othermonitoring.services.test99MonitoringServicesTest->testSensorResult()
Value NULL is equal to value 'http://ec2-54-148-9-230.us-west-2.compute.amazonaws.com/checkout/?q=monitoring/v1/sensor-result/user_successful_logins'.Othermonitoring.services.test99MonitoringServicesTest->testSensorResult()
Value NULL is equal to value 'OK'.Othermonitoring.services.test99MonitoringServicesTest->testSensorResult()
Value NULL is equal to value '1'.Othermonitoring.services.test99MonitoringServicesTest->testSensorResult()
Value NULL is equal to value '1'.Othermonitoring.services.test99MonitoringServicesTest->testSensorResult()
Value NULL is equal to value '1 login attempts in 1 day'.Othermonitoring.services.test99MonitoringServicesTest->testSensorResult()
Value NULL is equal to value 1444305382.Othermonitoring.services.test99MonitoringServicesTest->testSensorResult()
Value NULL is equal to value 0.44.Othermonitoring.services.test99MonitoringServicesTest->testSensorResult()
Value false is TRUE.Othermonitoring.services.test98MonitoringServicesTest->testSensorResult()
Value NULL is equal to value 'user_session_logouts'.Othermonitoring.services.test99MonitoringServicesTest->testSensorResult()
Value NULL is equal to value 'http://ec2-54-148-9-230.us-west-2.compute.amazonaws.com/checkout/?q=monitoring/v1/sensor-result/user_session_logouts'.Othermonitoring.services.test99MonitoringServicesTest->testSensorResult()
Value false is TRUE.Othermonitoring.services.test98MonitoringServicesTest->testSensorResult()
Value NULL is equal to value 'dblog_404'.Othermonitoring.services.test99MonitoringServicesTest->testSensorResult()
Value NULL is equal to value 'http://ec2-54-148-9-230.us-west-2.compute.amazonaws.com/checkout/?q=monitoring/v1/sensor-result/dblog_404'.Othermonitoring.services.test99MonitoringServicesTest->testSensorResult()
Value NULL is equal to value 'OK'.Othermonitoring.services.test99MonitoringServicesTest->testSensorResult()
Value NULL is equal to value '0 watchdog events in 1 day'.Othermonitoring.services.test99MonitoringServicesTest->testSensorResult()
Value NULL is equal to value 1444305382.Othermonitoring.services.test99MonitoringServicesTest->testSensorResult()
Value NULL is equal to value 0.64.Othermonitoring.services.test99MonitoringServicesTest->testSensorResult()
Value false is TRUE.Othermonitoring.services.test98MonitoringServicesTest->testSensorResult()
Value NULL is equal to value 'dblog_event_severity_alert'.Othermonitoring.services.test99MonitoringServicesTest->testSensorResult()
Value NULL is equal to value 'http://ec2-54-148-9-230.us-west-2.compute.amazonaws.com/checkout/?q=monitoring/v1/sensor-result/dblog_event_severity_alert'.Othermonitoring.services.test99MonitoringServicesTest->testSensorResult()
Value NULL is equal to value 'OK'.Othermonitoring.services.test99MonitoringServicesTest->testSensorResult()
Value NULL is equal to value '0'.Othermonitoring.services.test99MonitoringServicesTest->testSensorResult()
Value NULL is equal to value '0'.Othermonitoring.services.test99MonitoringServicesTest->testSensorResult()
Value NULL is equal to value '0 events in 1 day'.Othermonitoring.services.test99MonitoringServicesTest->testSensorResult()
Value NULL is equal to value 1444305382.Othermonitoring.services.test99MonitoringServicesTest->testSensorResult()
Value NULL is equal to value 0.38.Othermonitoring.services.test99MonitoringServicesTest->testSensorResult()
Value false is TRUE.Othermonitoring.services.test98MonitoringServicesTest->testSensorResult()
Value NULL is equal to value 'dblog_event_severity_critical'.Othermonitoring.services.test99MonitoringServicesTest->testSensorResult()
Value NULL is equal to value 'http://ec2-54-148-9-230.us-west-2.compute.amazonaws.com/checkout/?q=monitoring/v1/sensor-result/dblog_event_severity_critical'.Othermonitoring.services.test99MonitoringServicesTest->testSensorResult()
Value NULL is equal to value 'OK'.Othermonitoring.services.test99MonitoringServicesTest->testSensorResult()
Value NULL is equal to value '0'.Othermonitoring.services.test99MonitoringServicesTest->testSensorResult()
Value NULL is equal to value '0'.Othermonitoring.services.test99MonitoringServicesTest->testSensorResult()
Value NULL is equal to value '0 events in 1 day'.Othermonitoring.services.test99MonitoringServicesTest->testSensorResult()
Value NULL is equal to value 1444305382.Othermonitoring.services.test99MonitoringServicesTest->testSensorResult()
Value NULL is equal to value 0.35.Othermonitoring.services.test99MonitoringServicesTest->testSensorResult()
Value false is TRUE.Othermonitoring.services.test98MonitoringServicesTest->testSensorResult()
Value NULL is equal to value 'dblog_event_severity_debug'.Othermonitoring.services.test99MonitoringServicesTest->testSensorResult()
Value NULL is equal to value 'http://ec2-54-148-9-230.us-west-2.compute.amazonaws.com/checkout/?q=monitoring/v1/sensor-result/dblog_event_severity_debug'.Othermonitoring.services.test99MonitoringServicesTest->testSensorResult()
Value NULL is equal to value 'OK'.Othermonitoring.services.test99MonitoringServicesTest->testSensorResult()
Value NULL is equal to value '0'.Othermonitoring.services.test99MonitoringServicesTest->testSensorResult()
Value NULL is equal to value '0'.Othermonitoring.services.test99MonitoringServicesTest->testSensorResult()
Value NULL is equal to value '0 events in 1 day'.Othermonitoring.services.test99MonitoringServicesTest->testSensorResult()
Value NULL is equal to value 1444305382.Othermonitoring.services.test99MonitoringServicesTest->testSensorResult()
Value NULL is equal to value 0.76.Othermonitoring.services.test99MonitoringServicesTest->testSensorResult()
Value false is TRUE.Othermonitoring.services.test98MonitoringServicesTest->testSensorResult()
Value NULL is equal to value 'dblog_event_severity_emergency'.Othermonitoring.services.test99MonitoringServicesTest->testSensorResult()
Value NULL is equal to value 'http://ec2-54-148-9-230.us-west-2.compute.amazonaws.com/checkout/?q=monitoring/v1/sensor-result/dblog_event_severity_emergency'.Othermonitoring.services.test99MonitoringServicesTest->testSensorResult()
Value NULL is equal to value 'OK'.Othermonitoring.services.test99MonitoringServicesTest->testSensorResult()
Value NULL is equal to value '0'.Othermonitoring.services.test99MonitoringServicesTest->testSensorResult()
Value NULL is equal to value '0'.Othermonitoring.services.test99MonitoringServicesTest->testSensorResult()
Value NULL is equal to value '0 events in 1 day'.Othermonitoring.services.test99MonitoringServicesTest->testSensorResult()
Value NULL is equal to value 1444305382.Othermonitoring.services.test99MonitoringServicesTest->testSensorResult()
Value NULL is equal to value 0.32.Othermonitoring.services.test99MonitoringServicesTest->testSensorResult()
Value false is TRUE.Othermonitoring.services.test98MonitoringServicesTest->testSensorResult()
Value NULL is equal to value 'dblog_event_severity_error'.Othermonitoring.services.test99MonitoringServicesTest->testSensorResult()
Value NULL is equal to value 'http://ec2-54-148-9-230.us-west-2.compute.amazonaws.com/checkout/?q=monitoring/v1/sensor-result/dblog_event_severity_error'.Othermonitoring.services.test99MonitoringServicesTest->testSensorResult()
Argument 2 passed to Drupal\monitoring\Sensor\Sensors\SensorDatabaseAggregator::getFieldName() must be an array, string given, called in /var/lib/drupaltestbot/sites/default/files/checkout/sites/default/modules/monitoring/lib/Drupal/monitoring/Sensor/Sensors/SensorDatabaseAggregator.php on line 135 and definedRecoverable errorSensorDatabaseAggregator.php162Drupal\monitoring\Sensor\Sensors\SensorDatabaseAggregator->getFieldName()
Argument 2 passed to Drupal\monitoring\Sensor\Sensors\SensorDatabaseAggregator::getFieldName() must be an array, string given, called in /var/lib/drupaltestbot/sites/default/files/checkout/sites/default/modules/monitoring/lib/Drupal/monitoring/Sensor/Sensors/SensorDatabaseAggregator.php on line 135 and definedRecoverable errorSensorDatabaseAggregator.php162Drupal\monitoring\Sensor\Sensors\SensorDatabaseAggregator->getFieldName()
Argument 2 passed to Drupal\monitoring\Sensor\Sensors\SensorDatabaseAggregator::getFieldName() must be an array, string given, called in /var/lib/drupaltestbot/sites/default/files/checkout/sites/default/modules/monitoring/lib/Drupal/monitoring/Sensor/Sensors/SensorDatabaseAggregator.php on line 135 and definedRecoverable errorSensorDatabaseAggregator.php162Drupal\monitoring\Sensor\Sensors\SensorDatabaseAggregator->getFieldName()
Value NULL is equal to value 'CRITICAL'.Othermonitoring.services.test99MonitoringServicesTest->testSensorResult()
Value NULL is equal to value 'PDOException: SQLSTATE[42000]: Syntax error or access violation: 1064 You have an error in your SQL syntax; check the manual that corresponds to your MariaDB server version for the right syntax to use near \'T \'t\') AND (f F \'f\') AND ( < \'<\') AND (timestamp > \'1444218982\')\' at line 1'.Othermonitoring.services.test99MonitoringServicesTest->testSensorResult()
Value NULL is equal to value 1444305382.Othermonitoring.services.test99MonitoringServicesTest->testSensorResult()
Value NULL is equal to value 1.7.Othermonitoring.services.test99MonitoringServicesTest->testSensorResult()
Value false is TRUE.Othermonitoring.services.test98MonitoringServicesTest->testSensorResult()
Value NULL is equal to value 'dblog_event_severity_info'.Othermonitoring.services.test99MonitoringServicesTest->testSensorResult()
Value NULL is equal to value 'http://ec2-54-148-9-230.us-west-2.compute.amazonaws.com/checkout/?q=monitoring/v1/sensor-result/dblog_event_severity_info'.Othermonitoring.services.test99MonitoringServicesTest->testSensorResult()
Value NULL is equal to value 'OK'.Othermonitoring.services.test99MonitoringServicesTest->testSensorResult()
Value NULL is equal to value '22'.Othermonitoring.services.test99MonitoringServicesTest->testSensorResult()
Value NULL is equal to value '22'.Othermonitoring.services.test99MonitoringServicesTest->testSensorResult()
Value NULL is equal to value '22 events in 1 day'.Othermonitoring.services.test99MonitoringServicesTest->testSensorResult()
Value NULL is equal to value 1444305382.Othermonitoring.services.test99MonitoringServicesTest->testSensorResult()
Value NULL is equal to value 0.44.Othermonitoring.services.test99MonitoringServicesTest->testSensorResult()
Value false is TRUE.Othermonitoring.services.test98MonitoringServicesTest->testSensorResult()
Value NULL is equal to value 'dblog_event_severity_notice'.Othermonitoring.services.test99MonitoringServicesTest->testSensorResult()
Value NULL is equal to value 'http://ec2-54-148-9-230.us-west-2.compute.amazonaws.com/checkout/?q=monitoring/v1/sensor-result/dblog_event_severity_notice'.Othermonitoring.services.test99MonitoringServicesTest->testSensorResult()
Value NULL is equal to value 'OK'.Othermonitoring.services.test99MonitoringServicesTest->testSensorResult()
Value NULL is equal to value '12'.Othermonitoring.services.test99MonitoringServicesTest->testSensorResult()
Value NULL is equal to value '12'.Othermonitoring.services.test99MonitoringServicesTest->testSensorResult()
Value NULL is equal to value '12 events in 1 day'.Othermonitoring.services.test99MonitoringServicesTest->testSensorResult()
Value NULL is equal to value 1444305382.Othermonitoring.services.test99MonitoringServicesTest->testSensorResult()
Value NULL is equal to value 0.52.Othermonitoring.services.test99MonitoringServicesTest->testSensorResult()
Value false is TRUE.Othermonitoring.services.test98MonitoringServicesTest->testSensorResult()
Value NULL is equal to value 'test_sensor_cat_watchdog'.Othermonitoring.services.test99MonitoringServicesTest->testSensorResult()
Value NULL is equal to value 'http://ec2-54-148-9-230.us-west-2.compute.amazonaws.com/checkout/?q=monitoring/v1/sensor-result/test_sensor_cat_watchdog'.Othermonitoring.services.test99MonitoringServicesTest->testSensorResult()
ExpandMonitoring UI (MonitoringUITest) [Monitoring]29750128
MessageGroupFilenameLineFunctionStatus
Argument 2 passed to Drupal\monitoring\Sensor\Sensors\SensorDatabaseAggregator::getFieldName() must be an array, string given, called in /var/lib/drupaltestbot/sites/default/files/checkout/sites/default/modules/monitoring/lib/Drupal/monitoring/Sensor/Sensors/SensorDatabaseAggregator.php on line 135 and definedRecoverable fatal errorSensorDatabaseAggregator.php162Drupal\monitoring\Sensor\Sensors\SensorDatabaseAggregator->getFieldName()
"0 druplicons in 1 day" foundOthermonitoring.ui.test58MonitoringUITest->testAggregateSensorTimeIntervalConfig()
Argument 2 passed to Drupal\monitoring\Sensor\Sensors\SensorDatabaseAggregator::getFieldName() must be an array, string given, called in /var/lib/drupaltestbot/sites/default/files/checkout/sites/default/modules/monitoring/lib/Drupal/monitoring/Sensor/Sensors/SensorDatabaseAggregator.php on line 135 and definedRecoverable fatal errorSensorDatabaseAggregator.php162Drupal\monitoring\Sensor\Sensors\SensorDatabaseAggregator->getFieldName()
"0 druplicons in 3 hours" foundOthermonitoring.ui.test79MonitoringUITest->testAggregateSensorTimeIntervalConfig()
Argument 2 passed to Drupal\monitoring\Sensor\Sensors\SensorDatabaseAggregator::getFieldName() must be an array, string given, called in /var/lib/drupaltestbot/sites/default/files/checkout/sites/default/modules/monitoring/lib/Drupal/monitoring/Sensor/Sensors/SensorDatabaseAggregator.php on line 135 and definedRecoverable fatal errorSensorDatabaseAggregator.php162Drupal\monitoring\Sensor\Sensors\SensorDatabaseAggregator->getFieldName()
"0 druplicons" foundOthermonitoring.ui.test93MonitoringUITest->testAggregateSensorTimeIntervalConfig()
Argument 2 passed to Drupal\monitoring\Sensor\Sensors\SensorDatabaseAggregator::getFieldName() must be an array, string given, called in /var/lib/drupaltestbot/sites/default/files/checkout/sites/default/modules/monitoring/lib/Drupal/monitoring/Sensor/Sensors/SensorDatabaseAggregator.php on line 135 and definedRecoverable fatal errorSensorDatabaseAggregator.php162Drupal\monitoring\Sensor\Sensors\SensorDatabaseAggregator->getFieldName()
Raw "Sensor <em class="placeholder">Test sensor</em> (<em class="placeholder">Test</em>) cached before" foundOthermonitoring.ui.test115MonitoringUITest->testSensorOverviewPage()
Undefined offset: 0Noticemonitoring.ui.test119MonitoringUITest->testSensorOverviewPage()
Trying to get property of non-objectNoticemonitoring.ui.test123MonitoringUITest->testSensorOverviewPage()
Trying to get property of non-objectNoticemonitoring.ui.test124MonitoringUITest->testSensorOverviewPage()
Trying to get property of non-objectNoticemonitoring.ui.test124MonitoringUITest->testSensorOverviewPage()
Value 'Cron' is equal to value NULL.Othermonitoring.ui.test124MonitoringUITest->testSensorOverviewPage()
Trying to get property of non-objectNoticemonitoring.ui.test128MonitoringUITest->testSensorOverviewPage()
Trying to get property of non-objectNoticemonitoring.ui.test129MonitoringUITest->testSensorOverviewPage()
Trying to get property of non-objectNoticemonitoring.ui.test129MonitoringUITest->testSensorOverviewPage()
Value NULL is equal to value 'Cron safe threshold enabled'.Othermonitoring.ui.test129MonitoringUITest->testSensorOverviewPage()
Trying to get property of non-objectNoticemonitoring.ui.test128MonitoringUITest->testSensorOverviewPage()
Trying to get property of non-objectNoticemonitoring.ui.test129MonitoringUITest->testSensorOverviewPage()
Trying to get property of non-objectNoticemonitoring.ui.test129MonitoringUITest->testSensorOverviewPage()
Value NULL is equal to value 'Last cron run age'.Othermonitoring.ui.test129MonitoringUITest->testSensorOverviewPage()
Trying to get property of non-objectNoticemonitoring.ui.test123MonitoringUITest->testSensorOverviewPage()
Trying to get property of non-objectNoticemonitoring.ui.test124MonitoringUITest->testSensorOverviewPage()
Trying to get property of non-objectNoticemonitoring.ui.test124MonitoringUITest->testSensorOverviewPage()
Value 'Other' is equal to value NULL.Othermonitoring.ui.test124MonitoringUITest->testSensorOverviewPage()
Trying to get property of non-objectNoticemonitoring.ui.test128MonitoringUITest->testSensorOverviewPage()
Trying to get property of non-objectNoticemonitoring.ui.test129MonitoringUITest->testSensorOverviewPage()
Trying to get property of non-objectNoticemonitoring.ui.test129MonitoringUITest->testSensorOverviewPage()
Value NULL is equal to value 'Maintenance mode'.Othermonitoring.ui.test129MonitoringUITest->testSensorOverviewPage()
Trying to get property of non-objectNoticemonitoring.ui.test123MonitoringUITest->testSensorOverviewPage()
Trying to get property of non-objectNoticemonitoring.ui.test124MonitoringUITest->testSensorOverviewPage()
Trying to get property of non-objectNoticemonitoring.ui.test124MonitoringUITest->testSensorOverviewPage()
Value 'Queue' is equal to value NULL.Othermonitoring.ui.test124MonitoringUITest->testSensorOverviewPage()
Trying to get property of non-objectNoticemonitoring.ui.test128MonitoringUITest->testSensorOverviewPage()
Trying to get property of non-objectNoticemonitoring.ui.test129MonitoringUITest->testSensorOverviewPage()
Trying to get property of non-objectNoticemonitoring.ui.test129MonitoringUITest->testSensorOverviewPage()
Value NULL is equal to value 'monitoring_test'.Othermonitoring.ui.test129MonitoringUITest->testSensorOverviewPage()
Trying to get property of non-objectNoticemonitoring.ui.test123MonitoringUITest->testSensorOverviewPage()
Trying to get property of non-objectNoticemonitoring.ui.test124MonitoringUITest->testSensorOverviewPage()
Trying to get property of non-objectNoticemonitoring.ui.test124MonitoringUITest->testSensorOverviewPage()
Value 'Requirements' is equal to value NULL.Othermonitoring.ui.test124MonitoringUITest->testSensorOverviewPage()
Trying to get property of non-objectNoticemonitoring.ui.test128MonitoringUITest->testSensorOverviewPage()
Trying to get property of non-objectNoticemonitoring.ui.test129MonitoringUITest->testSensorOverviewPage()
Trying to get property of non-objectNoticemonitoring.ui.test129MonitoringUITest->testSensorOverviewPage()
Value NULL is equal to value 'Module ctools'.Othermonitoring.ui.test129MonitoringUITest->testSensorOverviewPage()
Trying to get property of non-objectNoticemonitoring.ui.test128MonitoringUITest->testSensorOverviewPage()
Trying to get property of non-objectNoticemonitoring.ui.test129MonitoringUITest->testSensorOverviewPage()
Trying to get property of non-objectNoticemonitoring.ui.test129MonitoringUITest->testSensorOverviewPage()
Value NULL is equal to value 'Module monitoring_test'.Othermonitoring.ui.test129MonitoringUITest->testSensorOverviewPage()
Trying to get property of non-objectNoticemonitoring.ui.test128MonitoringUITest->testSensorOverviewPage()
Trying to get property of non-objectNoticemonitoring.ui.test129MonitoringUITest->testSensorOverviewPage()
Trying to get property of non-objectNoticemonitoring.ui.test129MonitoringUITest->testSensorOverviewPage()
Value NULL is equal to value 'Module node'.Othermonitoring.ui.test129MonitoringUITest->testSensorOverviewPage()
Trying to get property of non-objectNoticemonitoring.ui.test128MonitoringUITest->testSensorOverviewPage()
Trying to get property of non-objectNoticemonitoring.ui.test129MonitoringUITest->testSensorOverviewPage()
Trying to get property of non-objectNoticemonitoring.ui.test129MonitoringUITest->testSensorOverviewPage()
Value NULL is equal to value 'Module system'.Othermonitoring.ui.test129MonitoringUITest->testSensorOverviewPage()
Trying to get property of non-objectNoticemonitoring.ui.test123MonitoringUITest->testSensorOverviewPage()
Trying to get property of non-objectNoticemonitoring.ui.test124MonitoringUITest->testSensorOverviewPage()
Trying to get property of non-objectNoticemonitoring.ui.test124MonitoringUITest->testSensorOverviewPage()
Value 'System' is equal to value NULL.Othermonitoring.ui.test124MonitoringUITest->testSensorOverviewPage()
Trying to get property of non-objectNoticemonitoring.ui.test128MonitoringUITest->testSensorOverviewPage()
Trying to get property of non-objectNoticemonitoring.ui.test129MonitoringUITest->testSensorOverviewPage()
Trying to get property of non-objectNoticemonitoring.ui.test129MonitoringUITest->testSensorOverviewPage()
Value NULL is equal to value 'Disappeared sensors'.Othermonitoring.ui.test129MonitoringUITest->testSensorOverviewPage()
Trying to get property of non-objectNoticemonitoring.ui.test123MonitoringUITest->testSensorOverviewPage()
Trying to get property of non-objectNoticemonitoring.ui.test124MonitoringUITest->testSensorOverviewPage()
Trying to get property of non-objectNoticemonitoring.ui.test124MonitoringUITest->testSensorOverviewPage()
Value 'Test' is equal to value NULL.Othermonitoring.ui.test124MonitoringUITest->testSensorOverviewPage()
Trying to get property of non-objectNoticemonitoring.ui.test128MonitoringUITest->testSensorOverviewPage()
Trying to get property of non-objectNoticemonitoring.ui.test129MonitoringUITest->testSensorOverviewPage()
Trying to get property of non-objectNoticemonitoring.ui.test129MonitoringUITest->testSensorOverviewPage()
Value NULL is equal to value 'DB Aggregate test'.Othermonitoring.ui.test129MonitoringUITest->testSensorOverviewPage()
Trying to get property of non-objectNoticemonitoring.ui.test128MonitoringUITest->testSensorOverviewPage()
Trying to get property of non-objectNoticemonitoring.ui.test129MonitoringUITest->testSensorOverviewPage()
Trying to get property of non-objectNoticemonitoring.ui.test129MonitoringUITest->testSensorOverviewPage()
Value NULL is equal to value 'Test from integration hook'.Othermonitoring.ui.test129MonitoringUITest->testSensorOverviewPage()
Trying to get property of non-objectNoticemonitoring.ui.test128MonitoringUITest->testSensorOverviewPage()
Trying to get property of non-objectNoticemonitoring.ui.test129MonitoringUITest->testSensorOverviewPage()
Trying to get property of non-objectNoticemonitoring.ui.test129MonitoringUITest->testSensorOverviewPage()
Value NULL is equal to value 'Test sensor'.Othermonitoring.ui.test129MonitoringUITest->testSensorOverviewPage()
Trying to get property of non-objectNoticemonitoring.ui.test128MonitoringUITest->testSensorOverviewPage()
Trying to get property of non-objectNoticemonitoring.ui.test129MonitoringUITest->testSensorOverviewPage()
Trying to get property of non-objectNoticemonitoring.ui.test129MonitoringUITest->testSensorOverviewPage()
Value NULL is equal to value 'Test sensor exceeds'.Othermonitoring.ui.test129MonitoringUITest->testSensorOverviewPage()
Trying to get property of non-objectNoticemonitoring.ui.test128MonitoringUITest->testSensorOverviewPage()
Trying to get property of non-objectNoticemonitoring.ui.test129MonitoringUITest->testSensorOverviewPage()
Trying to get property of non-objectNoticemonitoring.ui.test129MonitoringUITest->testSensorOverviewPage()
Value NULL is equal to value 'Test sensor falls'.Othermonitoring.ui.test129MonitoringUITest->testSensorOverviewPage()
Trying to get property of non-objectNoticemonitoring.ui.test128MonitoringUITest->testSensorOverviewPage()
Trying to get property of non-objectNoticemonitoring.ui.test129MonitoringUITest->testSensorOverviewPage()
Trying to get property of non-objectNoticemonitoring.ui.test129MonitoringUITest->testSensorOverviewPage()
Value NULL is equal to value 'Test sensor inner'.Othermonitoring.ui.test129MonitoringUITest->testSensorOverviewPage()
Trying to get property of non-objectNoticemonitoring.ui.test128MonitoringUITest->testSensorOverviewPage()
Trying to get property of non-objectNoticemonitoring.ui.test129MonitoringUITest->testSensorOverviewPage()
Trying to get property of non-objectNoticemonitoring.ui.test129MonitoringUITest->testSensorOverviewPage()
Value NULL is equal to value 'Test sensor outer'.Othermonitoring.ui.test129MonitoringUITest->testSensorOverviewPage()
Trying to get property of non-objectNoticemonitoring.ui.test128MonitoringUITest->testSensorOverviewPage()
Trying to get property of non-objectNoticemonitoring.ui.test129MonitoringUITest->testSensorOverviewPage()
Trying to get property of non-objectNoticemonitoring.ui.test129MonitoringUITest->testSensorOverviewPage()
Value NULL is equal to value 'Watchdog aggregate test'.Othermonitoring.ui.test129MonitoringUITest->testSensorOverviewPage()
Trying to get property of non-objectNoticemonitoring.ui.test123MonitoringUITest->testSensorOverviewPage()
Trying to get property of non-objectNoticemonitoring.ui.test124MonitoringUITest->testSensorOverviewPage()
Trying to get property of non-objectNoticemonitoring.ui.test124MonitoringUITest->testSensorOverviewPage()
Value 'User activity' is equal to value NULL.Othermonitoring.ui.test124MonitoringUITest->testSensorOverviewPage()
Trying to get property of non-objectNoticemonitoring.ui.test128MonitoringUITest->testSensorOverviewPage()
Trying to get property of non-objectNoticemonitoring.ui.test129MonitoringUITest->testSensorOverviewPage()
Trying to get property of non-objectNoticemonitoring.ui.test129MonitoringUITest->testSensorOverviewPage()
Value NULL is equal to value 'All active sessions'.Othermonitoring.ui.test129MonitoringUITest->testSensorOverviewPage()
Trying to get property of non-objectNoticemonitoring.ui.test128MonitoringUITest->testSensorOverviewPage()
Trying to get property of non-objectNoticemonitoring.ui.test129MonitoringUITest->testSensorOverviewPage()
Trying to get property of non-objectNoticemonitoring.ui.test129MonitoringUITest->testSensorOverviewPage()
Value NULL is equal to value 'Authenticated user sessions'.Othermonitoring.ui.test129MonitoringUITest->testSensorOverviewPage()
Trying to get property of non-objectNoticemonitoring.ui.test128MonitoringUITest->testSensorOverviewPage()
Trying to get property of non-objectNoticemonitoring.ui.test129MonitoringUITest->testSensorOverviewPage()
Trying to get property of non-objectNoticemonitoring.ui.test129MonitoringUITest->testSensorOverviewPage()
Value NULL is equal to value 'Failed user logins'.Othermonitoring.ui.test129MonitoringUITest->testSensorOverviewPage()
Trying to get property of non-objectNoticemonitoring.ui.test128MonitoringUITest->testSensorOverviewPage()
Trying to get property of non-objectNoticemonitoring.ui.test129MonitoringUITest->testSensorOverviewPage()
Trying to get property of non-objectNoticemonitoring.ui.test129MonitoringUITest->testSensorOverviewPage()
Value NULL is equal to value 'New users'.Othermonitoring.ui.test129MonitoringUITest->testSensorOverviewPage()
Trying to get property of non-objectNoticemonitoring.ui.test128MonitoringUITest->testSensorOverviewPage()
Trying to get property of non-objectNoticemonitoring.ui.test129MonitoringUITest->testSensorOverviewPage()
Trying to get property of non-objectNoticemonitoring.ui.test129MonitoringUITest->testSensorOverviewPage()
Value NULL is equal to value 'Successful user logins'.Othermonitoring.ui.test129MonitoringUITest->testSensorOverviewPage()
Trying to get property of non-objectNoticemonitoring.ui.test128MonitoringUITest->testSensorOverviewPage()
Trying to get property of non-objectNoticemonitoring.ui.test129MonitoringUITest->testSensorOverviewPage()
Trying to get property of non-objectNoticemonitoring.ui.test129MonitoringUITest->testSensorOverviewPage()
Value NULL is equal to value 'User session logouts'.Othermonitoring.ui.test129MonitoringUITest->testSensorOverviewPage()
Trying to get property of non-objectNoticemonitoring.ui.test123MonitoringUITest->testSensorOverviewPage()
Trying to get property of non-objectNoticemonitoring.ui.test124MonitoringUITest->testSensorOverviewPage()
Trying to get property of non-objectNoticemonitoring.ui.test124MonitoringUITest->testSensorOverviewPage()
Value 'Watchdog' is equal to value NULL.Othermonitoring.ui.test124MonitoringUITest->testSensorOverviewPage()
Trying to get property of non-objectNoticemonitoring.ui.test128MonitoringUITest->testSensorOverviewPage()
Trying to get property of non-objectNoticemonitoring.ui.test129MonitoringUITest->testSensorOverviewPage()
Trying to get property of non-objectNoticemonitoring.ui.test129MonitoringUITest->testSensorOverviewPage()
Value NULL is equal to value 'Page not found errors'.Othermonitoring.ui.test129MonitoringUITest->testSensorOverviewPage()
Trying to get property of non-objectNoticemonitoring.ui.test128MonitoringUITest->testSensorOverviewPage()
Trying to get property of non-objectNoticemonitoring.ui.test129MonitoringUITest->testSensorOverviewPage()
Trying to get property of non-objectNoticemonitoring.ui.test129MonitoringUITest->testSensorOverviewPage()
Value NULL is equal to value 'Severity alert'.Othermonitoring.ui.test129MonitoringUITest->testSensorOverviewPage()
Trying to get property of non-objectNoticemonitoring.ui.test128MonitoringUITest->testSensorOverviewPage()
Trying to get property of non-objectNoticemonitoring.ui.test129MonitoringUITest->testSensorOverviewPage()
Trying to get property of non-objectNoticemonitoring.ui.test129MonitoringUITest->testSensorOverviewPage()
Value NULL is equal to value 'Severity critical'.Othermonitoring.ui.test129MonitoringUITest->testSensorOverviewPage()
Trying to get property of non-objectNoticemonitoring.ui.test128MonitoringUITest->testSensorOverviewPage()
Trying to get property of non-objectNoticemonitoring.ui.test129MonitoringUITest->testSensorOverviewPage()
Trying to get property of non-objectNoticemonitoring.ui.test129MonitoringUITest->testSensorOverviewPage()
Value NULL is equal to value 'Severity debug'.Othermonitoring.ui.test129MonitoringUITest->testSensorOverviewPage()
Trying to get property of non-objectNoticemonitoring.ui.test128MonitoringUITest->testSensorOverviewPage()
Trying to get property of non-objectNoticemonitoring.ui.test129MonitoringUITest->testSensorOverviewPage()
Trying to get property of non-objectNoticemonitoring.ui.test129MonitoringUITest->testSensorOverviewPage()
Value NULL is equal to value 'Severity emergency'.Othermonitoring.ui.test129MonitoringUITest->testSensorOverviewPage()
Trying to get property of non-objectNoticemonitoring.ui.test128MonitoringUITest->testSensorOverviewPage()
Trying to get property of non-objectNoticemonitoring.ui.test129MonitoringUITest->testSensorOverviewPage()
Trying to get property of non-objectNoticemonitoring.ui.test129MonitoringUITest->testSensorOverviewPage()
Value NULL is equal to value 'Severity error'.Othermonitoring.ui.test129MonitoringUITest->testSensorOverviewPage()
Trying to get property of non-objectNoticemonitoring.ui.test128MonitoringUITest->testSensorOverviewPage()
Trying to get property of non-objectNoticemonitoring.ui.test129MonitoringUITest->testSensorOverviewPage()
Trying to get property of non-objectNoticemonitoring.ui.test129MonitoringUITest->testSensorOverviewPage()
Value NULL is equal to value 'Severity info'.Othermonitoring.ui.test129MonitoringUITest->testSensorOverviewPage()
Trying to get property of non-objectNoticemonitoring.ui.test128MonitoringUITest->testSensorOverviewPage()
Trying to get property of non-objectNoticemonitoring.ui.test129MonitoringUITest->testSensorOverviewPage()
Trying to get property of non-objectNoticemonitoring.ui.test129MonitoringUITest->testSensorOverviewPage()
Value NULL is equal to value 'Severity notice'.Othermonitoring.ui.test129MonitoringUITest->testSensorOverviewPage()
Trying to get property of non-objectNoticemonitoring.ui.test128MonitoringUITest->testSensorOverviewPage()
Trying to get property of non-objectNoticemonitoring.ui.test129MonitoringUITest->testSensorOverviewPage()
Trying to get property of non-objectNoticemonitoring.ui.test129MonitoringUITest->testSensorOverviewPage()
Value NULL is equal to value 'Test sensor category Watchdog'.Othermonitoring.ui.test129MonitoringUITest->testSensorOverviewPage()
Argument 2 passed to Drupal\monitoring\Sensor\Sensors\SensorDatabaseAggregator::getFieldName() must be an array, string given, called in /var/lib/drupaltestbot/sites/default/files/checkout/sites/default/modules/monitoring/lib/Drupal/monitoring/Sensor/Sensors/SensorDatabaseAggregator.php on line 135 and definedRecoverable fatal errorSensorDatabaseAggregator.php162Drupal\monitoring\Sensor\Sensors\SensorDatabaseAggregator->getFieldName()
"First message" foundOthermonitoring.ui.test228MonitoringUITest->testForceExecute()
Argument 2 passed to Drupal\monitoring\Sensor\Sensors\SensorDatabaseAggregator::getFieldName() must be an array, string given, called in /var/lib/drupaltestbot/sites/default/files/checkout/sites/default/modules/monitoring/lib/Drupal/monitoring/Sensor/Sensors/SensorDatabaseAggregator.php on line 135 and definedRecoverable fatal errorSensorDatabaseAggregator.php162Drupal\monitoring\Sensor\Sensors\SensorDatabaseAggregator->getFieldName()
"First message" foundOthermonitoring.ui.test237MonitoringUITest->testForceExecute()
Link Force execute all does not exist on http://ec2-54-148-9-230.us-west-2.compute.amazonaws.com/checkout/?q=admin/reports/monitoringBrowsermonitoring.ui.test240MonitoringUITest->testForceExecute()
"Second message" foundOthermonitoring.ui.test242MonitoringUITest->testForceExecute()
Link with label Force execution found.Othermonitoring.ui.test250MonitoringUITest->testForceExecute()
Argument 2 passed to Drupal\monitoring\Sensor\Sensors\SensorDatabaseAggregator::getFieldName() must be an array, string given, called in /var/lib/drupaltestbot/sites/default/files/checkout/sites/default/modules/monitoring/lib/Drupal/monitoring/Sensor/Sensors/SensorDatabaseAggregator.php on line 135 and definedRecoverable fatal errorSensorDatabaseAggregator.php162Drupal\monitoring\Sensor\Sensors\SensorDatabaseAggregator->getFieldName()
"Third message" foundOthermonitoring.ui.test253MonitoringUITest->testForceExecute()

All

Test namePassFailException
LeafMonitoring API (MonitoringApiTest) [Monitoring]7500
ExpandMonitoring commerce (MonitoringCommerceTest) [Monitoring]020
MessageGroupFilenameLineFunctionStatus
The test did not complete due to a fatal error.Completion checkmonitoring.commerce.test31MonitoringCommerceTest->testTurnoverSensors()
Enabled modules: monitoring, monitoring_test, commerce_orderOthermonitoring.base.test35MonitoringTestBase->setUp()
ExpandMonitoring Drupal core (MonitoringCoreTest) [Monitoring]17100
MessageGroupFilenameLineFunctionStatus
array ( 'ahead' => array ( '#type' => 'fieldset', '#title' => 'Ahead', '#attributes' => array ( ), 'cmd' => array ( '#type' => 'item', '#title' => 'Command', '#markup' => 'cd \'/var/lib/drupaltestbot/sites/default/files/checkout/\' true 2>&1', ), 'output' => array ( '#type' => 'item', '#title' => 'Output', '#markup' => '<pre></pre>', '#description' => 'Shows local commits that have not been pushed.', '#description_display' => 'after', ), ), 'status' => array ( '#type' => 'fieldset', '#title' => 'Status', '#attributes' => array ( ), 'cmd' => array ( '#type' => 'item', '#title' => 'Command', '#markup' => 'cd \'/var/lib/drupaltestbot/sites/default/files/checkout/\' true 2>&1', ), 'output' => array ( '#type' => 'item', '#title' => 'Output', '#markup' => '<pre></pre>', '#description' => 'Shows uncommitted, changed and deleted files.', '#description_display' => 'after', ), ), 'submodules' => array ( '#type' => 'fieldset', '#title' => 'Submodules', '#attributes' => array ( ), 'cmd' => array ( '#type' => 'item', '#title' => 'Command', '#markup' => 'cd \'/var/lib/drupaltestbot/sites/default/files/checkout/\' printf -- "-a5066d1778b9ec7c86631234ff2795e777bdff12 test" 2>&1', ), 'output' => array ( '#type' => 'item', '#title' => 'Output', '#markup' => '<pre>-a5066d1778b9ec7c86631234ff2795e777bdff12 test</pre>', '#description' => 'Run "git submodule init" to initialize missing submodules ("-" prefix) or "git submodule update" to update submodules to the correct commit ("+" prefix).', '#description_display' => 'after', ), ), )Debugmonitoring.core.test279MonitoringCoreTest->testSensors()
array ( 'ahead' => array ( '#type' => 'fieldset', '#title' => 'Ahead', '#attributes' => array ( ), 'cmd' => array ( '#type' => 'item', '#title' => 'Command', '#markup' => 'cd \'/var/lib/drupaltestbot/sites/default/files/checkout/\' true 2>&1', ), 'output' => array ( '#type' => 'item', '#title' => 'Output', '#markup' => '<pre></pre>', '#description' => 'Shows local commits that have not been pushed.', '#description_display' => 'after', ), ), 'status' => array ( '#type' => 'fieldset', '#title' => 'Status', '#attributes' => array ( ), 'cmd' => array ( '#type' => 'item', '#title' => 'Command', '#markup' => 'cd \'/var/lib/drupaltestbot/sites/default/files/checkout/\' true 2>&1', ), 'output' => array ( '#type' => 'item', '#title' => 'Output', '#markup' => '<pre></pre>', '#description' => 'Shows uncommitted, changed and deleted files.', '#description_display' => 'after', ), ), 'submodules' => array ( '#type' => 'fieldset', '#title' => 'Submodules', '#attributes' => array ( ), 'cmd' => array ( '#type' => 'item', '#title' => 'Command', '#markup' => 'cd \'/var/lib/drupaltestbot/sites/default/files/checkout/\' printf "+156fff6ee58497fa22b57c32e22e3f13377b4120 test (8.x-1.0-240-g156fff6)" 2>&1', ), 'output' => array ( '#type' => 'item', '#title' => 'Output', '#markup' => '<pre>+156fff6ee58497fa22b57c32e22e3f13377b4120 test (8.x-1.0-240-g156fff6)</pre>', '#description' => 'Run "git submodule init" to initialize missing submodules ("-" prefix) or "git submodule update" to update submodules to the correct commit ("+" prefix).', '#description_display' => 'after', ), ), )Debugmonitoring.core.test292MonitoringCoreTest->testSensors()
LeafMonitoring Elysia (MonitoringElysiaTest) [Monitoring]300
LeafMonitoring Munin (MonitoringMuninTest) [Monitoring]3600
LeafMonitoring search API (MonitoringSearchAPITest) [Monitoring]500
ExpandMonitoring services (MonitoringServicesTest) [Monitoring]5161974
MessageGroupFilenameLineFunctionStatus
Argument 2 passed to Drupal\monitoring\Sensor\Sensors\SensorDatabaseAggregator::getFieldName() must be an array, string given, called in /var/lib/drupaltestbot/sites/default/files/checkout/sites/default/modules/monitoring/lib/Drupal/monitoring/Sensor/Sensors/SensorDatabaseAggregator.php on line 135 and definedRecoverable fatal errorSensorDatabaseAggregator.php162Drupal\monitoring\Sensor\Sensors\SensorDatabaseAggregator->getFieldName()
HTTP response expected 200, actual 500Browsermonitoring.services.test96MonitoringServicesTest->testSensorResult()
Value false is TRUE.Othermonitoring.services.test98MonitoringServicesTest->testSensorResult()
Value NULL is equal to value 'core_cron_safe_threshold'.Othermonitoring.services.test99MonitoringServicesTest->testSensorResult()
Value NULL is equal to value 'http://ec2-54-148-9-230.us-west-2.compute.amazonaws.com/checkout/?q=monitoring/v1/sensor-result/core_cron_safe_threshold'.Othermonitoring.services.test99MonitoringServicesTest->testSensorResult()
Value false is TRUE.Othermonitoring.services.test98MonitoringServicesTest->testSensorResult()
Value NULL is equal to value 'core_cron_last_run_age'.Othermonitoring.services.test99MonitoringServicesTest->testSensorResult()
Value NULL is equal to value 'http://ec2-54-148-9-230.us-west-2.compute.amazonaws.com/checkout/?q=monitoring/v1/sensor-result/core_cron_last_run_age'.Othermonitoring.services.test99MonitoringServicesTest->testSensorResult()
Value false is TRUE.Othermonitoring.services.test98MonitoringServicesTest->testSensorResult()
Value NULL is equal to value 'core_maintenance_mode'.Othermonitoring.services.test99MonitoringServicesTest->testSensorResult()
Value NULL is equal to value 'http://ec2-54-148-9-230.us-west-2.compute.amazonaws.com/checkout/?q=monitoring/v1/sensor-result/core_maintenance_mode'.Othermonitoring.services.test99MonitoringServicesTest->testSensorResult()
Value false is TRUE.Othermonitoring.services.test98MonitoringServicesTest->testSensorResult()
Value NULL is equal to value 'core_queue_monitoring_test'.Othermonitoring.services.test99MonitoringServicesTest->testSensorResult()
Value NULL is equal to value 'http://ec2-54-148-9-230.us-west-2.compute.amazonaws.com/checkout/?q=monitoring/v1/sensor-result/core_queue_monitoring_test'.Othermonitoring.services.test99MonitoringServicesTest->testSensorResult()
Value false is TRUE.Othermonitoring.services.test98MonitoringServicesTest->testSensorResult()
Value NULL is equal to value 'core_requirements_ctools'.Othermonitoring.services.test99MonitoringServicesTest->testSensorResult()
Value NULL is equal to value 'http://ec2-54-148-9-230.us-west-2.compute.amazonaws.com/checkout/?q=monitoring/v1/sensor-result/core_requirements_ctools'.Othermonitoring.services.test99MonitoringServicesTest->testSensorResult()
Value NULL is equal to value 'OK'.Othermonitoring.services.test99MonitoringServicesTest->testSensorResult()
Value NULL is equal to value 'CTools CSS Cache, Exists'.Othermonitoring.services.test99MonitoringServicesTest->testSensorResult()
Value NULL is equal to value 1444305382.Othermonitoring.services.test99MonitoringServicesTest->testSensorResult()
Value NULL is equal to value 0.17.Othermonitoring.services.test99MonitoringServicesTest->testSensorResult()
Value false is TRUE.Othermonitoring.services.test98MonitoringServicesTest->testSensorResult()
Value NULL is equal to value 'core_requirements_monitoring_test'.Othermonitoring.services.test99MonitoringServicesTest->testSensorResult()
Value NULL is equal to value 'http://ec2-54-148-9-230.us-west-2.compute.amazonaws.com/checkout/?q=monitoring/v1/sensor-result/core_requirements_monitoring_test'.Othermonitoring.services.test99MonitoringServicesTest->testSensorResult()
Value NULL is equal to value 'OK'.Othermonitoring.services.test99MonitoringServicesTest->testSensorResult()
Value NULL is equal to value 'Requirements check OK'.Othermonitoring.services.test99MonitoringServicesTest->testSensorResult()
Value NULL is equal to value 1444305382.Othermonitoring.services.test99MonitoringServicesTest->testSensorResult()
Value NULL is equal to value 0.06.Othermonitoring.services.test99MonitoringServicesTest->testSensorResult()
Value false is TRUE.Othermonitoring.services.test98MonitoringServicesTest->testSensorResult()
Value NULL is equal to value 'core_requirements_node'.Othermonitoring.services.test99MonitoringServicesTest->testSensorResult()
Value NULL is equal to value 'http://ec2-54-148-9-230.us-west-2.compute.amazonaws.com/checkout/?q=monitoring/v1/sensor-result/core_requirements_node'.Othermonitoring.services.test99MonitoringServicesTest->testSensorResult()
Value NULL is equal to value 'OK'.Othermonitoring.services.test99MonitoringServicesTest->testSensorResult()
Value NULL is equal to value 'No value'.Othermonitoring.services.test99MonitoringServicesTest->testSensorResult()
Value NULL is equal to value 1444305382.Othermonitoring.services.test99MonitoringServicesTest->testSensorResult()
Value NULL is equal to value 0.76.Othermonitoring.services.test99MonitoringServicesTest->testSensorResult()
Value false is TRUE.Othermonitoring.services.test98MonitoringServicesTest->testSensorResult()
Value NULL is equal to value 'core_requirements_rest_server'.Othermonitoring.services.test99MonitoringServicesTest->testSensorResult()
Value NULL is equal to value 'http://ec2-54-148-9-230.us-west-2.compute.amazonaws.com/checkout/?q=monitoring/v1/sensor-result/core_requirements_rest_server'.Othermonitoring.services.test99MonitoringServicesTest->testSensorResult()
Value NULL is equal to value 'WARNING'.Othermonitoring.services.test99MonitoringServicesTest->testSensorResult()
Value NULL is equal to value 'Spyc, The <em class="placeholder">Spyc</em> library could not be found.'.Othermonitoring.services.test99MonitoringServicesTest->testSensorResult()
Value NULL is equal to value 1444305382.Othermonitoring.services.test99MonitoringServicesTest->testSensorResult()
Value NULL is equal to value 1.85.Othermonitoring.services.test99MonitoringServicesTest->testSensorResult()
Value false is TRUE.Othermonitoring.services.test98MonitoringServicesTest->testSensorResult()
Value NULL is equal to value 'core_requirements_services'.Othermonitoring.services.test99MonitoringServicesTest->testSensorResult()
Value NULL is equal to value 'http://ec2-54-148-9-230.us-west-2.compute.amazonaws.com/checkout/?q=monitoring/v1/sensor-result/core_requirements_services'.Othermonitoring.services.test99MonitoringServicesTest->testSensorResult()
Value NULL is equal to value 'OK'.Othermonitoring.services.test99MonitoringServicesTest->testSensorResult()
Value NULL is equal to value 'Services Authentication Mechanism, Enabled for all Endpoints'.Othermonitoring.services.test99MonitoringServicesTest->testSensorResult()
Value NULL is equal to value 1444305382.Othermonitoring.services.test99MonitoringServicesTest->testSensorResult()
Value NULL is equal to value 0.25.Othermonitoring.services.test99MonitoringServicesTest->testSensorResult()
Value false is TRUE.Othermonitoring.services.test98MonitoringServicesTest->testSensorResult()
Value NULL is equal to value 'core_requirements_system'.Othermonitoring.services.test99MonitoringServicesTest->testSensorResult()
Value NULL is equal to value 'http://ec2-54-148-9-230.us-west-2.compute.amazonaws.com/checkout/?q=monitoring/v1/sensor-result/core_requirements_system'.Othermonitoring.services.test99MonitoringServicesTest->testSensorResult()
Value NULL is equal to value 'WARNING'.Othermonitoring.services.test99MonitoringServicesTest->testSensorResult()
Value NULL is equal to value 'Update notifications, Update notifications are not enabled. It is <strong>highly recommended</strong> that you enable the update manager module from the <a href="/checkout/?q=admin/modules">module administration page</a> in order to stay up-to-date on new releases. For more information, <a href="http://drupal.org/documentation/modules/update">Update status handbook page</a>., Not enabled'.Othermonitoring.services.test99MonitoringServicesTest->testSensorResult()
Value NULL is equal to value 1444305382.Othermonitoring.services.test99MonitoringServicesTest->testSensorResult()
Value NULL is equal to value 83.26.Othermonitoring.services.test99MonitoringServicesTest->testSensorResult()
Value false is TRUE.Othermonitoring.services.test98MonitoringServicesTest->testSensorResult()
Value NULL is equal to value 'monitoring_disappeared_sensors'.Othermonitoring.services.test99MonitoringServicesTest->testSensorResult()
Value NULL is equal to value 'http://ec2-54-148-9-230.us-west-2.compute.amazonaws.com/checkout/?q=monitoring/v1/sensor-result/monitoring_disappeared_sensors'.Othermonitoring.services.test99MonitoringServicesTest->testSensorResult()
Value false is TRUE.Othermonitoring.services.test98MonitoringServicesTest->testSensorResult()
Value NULL is equal to value 'db_aggregate_test'.Othermonitoring.services.test99MonitoringServicesTest->testSensorResult()
Value NULL is equal to value 'http://ec2-54-148-9-230.us-west-2.compute.amazonaws.com/checkout/?q=monitoring/v1/sensor-result/db_aggregate_test'.Othermonitoring.services.test99MonitoringServicesTest->testSensorResult()
Value NULL is equal to value 'CRITICAL'.Othermonitoring.services.test99MonitoringServicesTest->testSensorResult()
Value NULL is equal to value '0'.Othermonitoring.services.test99MonitoringServicesTest->testSensorResult()
Value NULL is equal to value '0'.Othermonitoring.services.test99MonitoringServicesTest->testSensorResult()
Value NULL is equal to value '0 druplicons in 1 day, falls below 1'.Othermonitoring.services.test99MonitoringServicesTest->testSensorResult()
Value NULL is equal to value 1444305382.Othermonitoring.services.test99MonitoringServicesTest->testSensorResult()
Value NULL is equal to value 0.4.Othermonitoring.services.test99MonitoringServicesTest->testSensorResult()
Value false is TRUE.Othermonitoring.services.test98MonitoringServicesTest->testSensorResult()
Value NULL is equal to value 'test_sensor_integration'.Othermonitoring.services.test99MonitoringServicesTest->testSensorResult()
Value NULL is equal to value 'http://ec2-54-148-9-230.us-west-2.compute.amazonaws.com/checkout/?q=monitoring/v1/sensor-result/test_sensor_integration'.Othermonitoring.services.test99MonitoringServicesTest->testSensorResult()
Value false is TRUE.Othermonitoring.services.test98MonitoringServicesTest->testSensorResult()
Value NULL is equal to value 'test_sensor'.Othermonitoring.services.test99MonitoringServicesTest->testSensorResult()
Value NULL is equal to value 'http://ec2-54-148-9-230.us-west-2.compute.amazonaws.com/checkout/?q=monitoring/v1/sensor-result/test_sensor'.Othermonitoring.services.test99MonitoringServicesTest->testSensorResult()
Value NULL is equal to value 'OK'.Othermonitoring.services.test99MonitoringServicesTest->testSensorResult()
Value NULL is equal to value 'No value'.Othermonitoring.services.test99MonitoringServicesTest->testSensorResult()
Value NULL is equal to value 1444305382.Othermonitoring.services.test99MonitoringServicesTest->testSensorResult()
Value NULL is equal to value 0.19.Othermonitoring.services.test99MonitoringServicesTest->testSensorResult()
Value false is TRUE.Othermonitoring.services.test98MonitoringServicesTest->testSensorResult()
Value NULL is equal to value 'test_sensor_exceeds'.Othermonitoring.services.test99MonitoringServicesTest->testSensorResult()
Value NULL is equal to value 'http://ec2-54-148-9-230.us-west-2.compute.amazonaws.com/checkout/?q=monitoring/v1/sensor-result/test_sensor_exceeds'.Othermonitoring.services.test99MonitoringServicesTest->testSensorResult()
Value false is TRUE.Othermonitoring.services.test98MonitoringServicesTest->testSensorResult()
Value NULL is equal to value 'test_sensor_falls'.Othermonitoring.services.test99MonitoringServicesTest->testSensorResult()
Value NULL is equal to value 'http://ec2-54-148-9-230.us-west-2.compute.amazonaws.com/checkout/?q=monitoring/v1/sensor-result/test_sensor_falls'.Othermonitoring.services.test99MonitoringServicesTest->testSensorResult()
Value false is TRUE.Othermonitoring.services.test98MonitoringServicesTest->testSensorResult()
Value NULL is equal to value 'test_sensor_inner'.Othermonitoring.services.test99MonitoringServicesTest->testSensorResult()
Value NULL is equal to value 'http://ec2-54-148-9-230.us-west-2.compute.amazonaws.com/checkout/?q=monitoring/v1/sensor-result/test_sensor_inner'.Othermonitoring.services.test99MonitoringServicesTest->testSensorResult()
Value false is TRUE.Othermonitoring.services.test98MonitoringServicesTest->testSensorResult()
Value NULL is equal to value 'test_sensor_outer'.Othermonitoring.services.test99MonitoringServicesTest->testSensorResult()
Value NULL is equal to value 'http://ec2-54-148-9-230.us-west-2.compute.amazonaws.com/checkout/?q=monitoring/v1/sensor-result/test_sensor_outer'.Othermonitoring.services.test99MonitoringServicesTest->testSensorResult()
Value false is TRUE.Othermonitoring.services.test98MonitoringServicesTest->testSensorResult()
Value NULL is equal to value 'watchdog_aggregate_test'.Othermonitoring.services.test99MonitoringServicesTest->testSensorResult()
Value NULL is equal to value 'http://ec2-54-148-9-230.us-west-2.compute.amazonaws.com/checkout/?q=monitoring/v1/sensor-result/watchdog_aggregate_test'.Othermonitoring.services.test99MonitoringServicesTest->testSensorResult()
Value false is TRUE.Othermonitoring.services.test98MonitoringServicesTest->testSensorResult()
Value NULL is equal to value 'user_sessions_all'.Othermonitoring.services.test99MonitoringServicesTest->testSensorResult()
Value NULL is equal to value 'http://ec2-54-148-9-230.us-west-2.compute.amazonaws.com/checkout/?q=monitoring/v1/sensor-result/user_sessions_all'.Othermonitoring.services.test99MonitoringServicesTest->testSensorResult()
Value false is TRUE.Othermonitoring.services.test98MonitoringServicesTest->testSensorResult()
Value NULL is equal to value 'user_sessions_authenticated'.Othermonitoring.services.test99MonitoringServicesTest->testSensorResult()
Value NULL is equal to value 'http://ec2-54-148-9-230.us-west-2.compute.amazonaws.com/checkout/?q=monitoring/v1/sensor-result/user_sessions_authenticated'.Othermonitoring.services.test99MonitoringServicesTest->testSensorResult()
Value false is TRUE.Othermonitoring.services.test98MonitoringServicesTest->testSensorResult()
Value NULL is equal to value 'user_failed_logins'.Othermonitoring.services.test99MonitoringServicesTest->testSensorResult()
Value NULL is equal to value 'http://ec2-54-148-9-230.us-west-2.compute.amazonaws.com/checkout/?q=monitoring/v1/sensor-result/user_failed_logins'.Othermonitoring.services.test99MonitoringServicesTest->testSensorResult()
Value NULL is equal to value 'OK'.Othermonitoring.services.test99MonitoringServicesTest->testSensorResult()
Value NULL is equal to value '0 login attempts in 1 day'.Othermonitoring.services.test99MonitoringServicesTest->testSensorResult()
Value NULL is equal to value 1444305382.Othermonitoring.services.test99MonitoringServicesTest->testSensorResult()
Value NULL is equal to value 0.64.Othermonitoring.services.test99MonitoringServicesTest->testSensorResult()
Value false is TRUE.Othermonitoring.services.test98MonitoringServicesTest->testSensorResult()
Value NULL is equal to value 'user_new'.Othermonitoring.services.test99MonitoringServicesTest->testSensorResult()
Value NULL is equal to value 'http://ec2-54-148-9-230.us-west-2.compute.amazonaws.com/checkout/?q=monitoring/v1/sensor-result/user_new'.Othermonitoring.services.test99MonitoringServicesTest->testSensorResult()
Value NULL is equal to value 'OK'.Othermonitoring.services.test99MonitoringServicesTest->testSensorResult()
Value NULL is equal to value '2'.Othermonitoring.services.test99MonitoringServicesTest->testSensorResult()
Value NULL is equal to value '2'.Othermonitoring.services.test99MonitoringServicesTest->testSensorResult()
Value NULL is equal to value '2 users in 1 day'.Othermonitoring.services.test99MonitoringServicesTest->testSensorResult()
Value NULL is equal to value 1444305382.Othermonitoring.services.test99MonitoringServicesTest->testSensorResult()
Value NULL is equal to value 0.36.Othermonitoring.services.test99MonitoringServicesTest->testSensorResult()
Value false is TRUE.Othermonitoring.services.test98MonitoringServicesTest->testSensorResult()
Value NULL is equal to value 'user_successful_logins'.Othermonitoring.services.test99MonitoringServicesTest->testSensorResult()
Value NULL is equal to value 'http://ec2-54-148-9-230.us-west-2.compute.amazonaws.com/checkout/?q=monitoring/v1/sensor-result/user_successful_logins'.Othermonitoring.services.test99MonitoringServicesTest->testSensorResult()
Value NULL is equal to value 'OK'.Othermonitoring.services.test99MonitoringServicesTest->testSensorResult()
Value NULL is equal to value '1'.Othermonitoring.services.test99MonitoringServicesTest->testSensorResult()
Value NULL is equal to value '1'.Othermonitoring.services.test99MonitoringServicesTest->testSensorResult()
Value NULL is equal to value '1 login attempts in 1 day'.Othermonitoring.services.test99MonitoringServicesTest->testSensorResult()
Value NULL is equal to value 1444305382.Othermonitoring.services.test99MonitoringServicesTest->testSensorResult()
Value NULL is equal to value 0.44.Othermonitoring.services.test99MonitoringServicesTest->testSensorResult()
Value false is TRUE.Othermonitoring.services.test98MonitoringServicesTest->testSensorResult()
Value NULL is equal to value 'user_session_logouts'.Othermonitoring.services.test99MonitoringServicesTest->testSensorResult()
Value NULL is equal to value 'http://ec2-54-148-9-230.us-west-2.compute.amazonaws.com/checkout/?q=monitoring/v1/sensor-result/user_session_logouts'.Othermonitoring.services.test99MonitoringServicesTest->testSensorResult()
Value false is TRUE.Othermonitoring.services.test98MonitoringServicesTest->testSensorResult()
Value NULL is equal to value 'dblog_404'.Othermonitoring.services.test99MonitoringServicesTest->testSensorResult()
Value NULL is equal to value 'http://ec2-54-148-9-230.us-west-2.compute.amazonaws.com/checkout/?q=monitoring/v1/sensor-result/dblog_404'.Othermonitoring.services.test99MonitoringServicesTest->testSensorResult()
Value NULL is equal to value 'OK'.Othermonitoring.services.test99MonitoringServicesTest->testSensorResult()
Value NULL is equal to value '0 watchdog events in 1 day'.Othermonitoring.services.test99MonitoringServicesTest->testSensorResult()
Value NULL is equal to value 1444305382.Othermonitoring.services.test99MonitoringServicesTest->testSensorResult()
Value NULL is equal to value 0.64.Othermonitoring.services.test99MonitoringServicesTest->testSensorResult()
Value false is TRUE.Othermonitoring.services.test98MonitoringServicesTest->testSensorResult()
Value NULL is equal to value 'dblog_event_severity_alert'.Othermonitoring.services.test99MonitoringServicesTest->testSensorResult()
Value NULL is equal to value 'http://ec2-54-148-9-230.us-west-2.compute.amazonaws.com/checkout/?q=monitoring/v1/sensor-result/dblog_event_severity_alert'.Othermonitoring.services.test99MonitoringServicesTest->testSensorResult()
Value NULL is equal to value 'OK'.Othermonitoring.services.test99MonitoringServicesTest->testSensorResult()
Value NULL is equal to value '0'.Othermonitoring.services.test99MonitoringServicesTest->testSensorResult()
Value NULL is equal to value '0'.Othermonitoring.services.test99MonitoringServicesTest->testSensorResult()
Value NULL is equal to value '0 events in 1 day'.Othermonitoring.services.test99MonitoringServicesTest->testSensorResult()
Value NULL is equal to value 1444305382.Othermonitoring.services.test99MonitoringServicesTest->testSensorResult()
Value NULL is equal to value 0.38.Othermonitoring.services.test99MonitoringServicesTest->testSensorResult()
Value false is TRUE.Othermonitoring.services.test98MonitoringServicesTest->testSensorResult()
Value NULL is equal to value 'dblog_event_severity_critical'.Othermonitoring.services.test99MonitoringServicesTest->testSensorResult()
Value NULL is equal to value 'http://ec2-54-148-9-230.us-west-2.compute.amazonaws.com/checkout/?q=monitoring/v1/sensor-result/dblog_event_severity_critical'.Othermonitoring.services.test99MonitoringServicesTest->testSensorResult()
Value NULL is equal to value 'OK'.Othermonitoring.services.test99MonitoringServicesTest->testSensorResult()
Value NULL is equal to value '0'.Othermonitoring.services.test99MonitoringServicesTest->testSensorResult()
Value NULL is equal to value '0'.Othermonitoring.services.test99MonitoringServicesTest->testSensorResult()
Value NULL is equal to value '0 events in 1 day'.Othermonitoring.services.test99MonitoringServicesTest->testSensorResult()
Value NULL is equal to value 1444305382.Othermonitoring.services.test99MonitoringServicesTest->testSensorResult()
Value NULL is equal to value 0.35.Othermonitoring.services.test99MonitoringServicesTest->testSensorResult()
Value false is TRUE.Othermonitoring.services.test98MonitoringServicesTest->testSensorResult()
Value NULL is equal to value 'dblog_event_severity_debug'.Othermonitoring.services.test99MonitoringServicesTest->testSensorResult()
Value NULL is equal to value 'http://ec2-54-148-9-230.us-west-2.compute.amazonaws.com/checkout/?q=monitoring/v1/sensor-result/dblog_event_severity_debug'.Othermonitoring.services.test99MonitoringServicesTest->testSensorResult()
Value NULL is equal to value 'OK'.Othermonitoring.services.test99MonitoringServicesTest->testSensorResult()
Value NULL is equal to value '0'.Othermonitoring.services.test99MonitoringServicesTest->testSensorResult()
Value NULL is equal to value '0'.Othermonitoring.services.test99MonitoringServicesTest->testSensorResult()
Value NULL is equal to value '0 events in 1 day'.Othermonitoring.services.test99MonitoringServicesTest->testSensorResult()
Value NULL is equal to value 1444305382.Othermonitoring.services.test99MonitoringServicesTest->testSensorResult()
Value NULL is equal to value 0.76.Othermonitoring.services.test99MonitoringServicesTest->testSensorResult()
Value false is TRUE.Othermonitoring.services.test98MonitoringServicesTest->testSensorResult()
Value NULL is equal to value 'dblog_event_severity_emergency'.Othermonitoring.services.test99MonitoringServicesTest->testSensorResult()
Value NULL is equal to value 'http://ec2-54-148-9-230.us-west-2.compute.amazonaws.com/checkout/?q=monitoring/v1/sensor-result/dblog_event_severity_emergency'.Othermonitoring.services.test99MonitoringServicesTest->testSensorResult()
Value NULL is equal to value 'OK'.Othermonitoring.services.test99MonitoringServicesTest->testSensorResult()
Value NULL is equal to value '0'.Othermonitoring.services.test99MonitoringServicesTest->testSensorResult()
Value NULL is equal to value '0'.Othermonitoring.services.test99MonitoringServicesTest->testSensorResult()
Value NULL is equal to value '0 events in 1 day'.Othermonitoring.services.test99MonitoringServicesTest->testSensorResult()
Value NULL is equal to value 1444305382.Othermonitoring.services.test99MonitoringServicesTest->testSensorResult()
Value NULL is equal to value 0.32.Othermonitoring.services.test99MonitoringServicesTest->testSensorResult()
Value false is TRUE.Othermonitoring.services.test98MonitoringServicesTest->testSensorResult()
Value NULL is equal to value 'dblog_event_severity_error'.Othermonitoring.services.test99MonitoringServicesTest->testSensorResult()
Value NULL is equal to value 'http://ec2-54-148-9-230.us-west-2.compute.amazonaws.com/checkout/?q=monitoring/v1/sensor-result/dblog_event_severity_error'.Othermonitoring.services.test99MonitoringServicesTest->testSensorResult()
Argument 2 passed to Drupal\monitoring\Sensor\Sensors\SensorDatabaseAggregator::getFieldName() must be an array, string given, called in /var/lib/drupaltestbot/sites/default/files/checkout/sites/default/modules/monitoring/lib/Drupal/monitoring/Sensor/Sensors/SensorDatabaseAggregator.php on line 135 and definedRecoverable errorSensorDatabaseAggregator.php162Drupal\monitoring\Sensor\Sensors\SensorDatabaseAggregator->getFieldName()
Argument 2 passed to Drupal\monitoring\Sensor\Sensors\SensorDatabaseAggregator::getFieldName() must be an array, string given, called in /var/lib/drupaltestbot/sites/default/files/checkout/sites/default/modules/monitoring/lib/Drupal/monitoring/Sensor/Sensors/SensorDatabaseAggregator.php on line 135 and definedRecoverable errorSensorDatabaseAggregator.php162Drupal\monitoring\Sensor\Sensors\SensorDatabaseAggregator->getFieldName()
Argument 2 passed to Drupal\monitoring\Sensor\Sensors\SensorDatabaseAggregator::getFieldName() must be an array, string given, called in /var/lib/drupaltestbot/sites/default/files/checkout/sites/default/modules/monitoring/lib/Drupal/monitoring/Sensor/Sensors/SensorDatabaseAggregator.php on line 135 and definedRecoverable errorSensorDatabaseAggregator.php162Drupal\monitoring\Sensor\Sensors\SensorDatabaseAggregator->getFieldName()
Value NULL is equal to value 'CRITICAL'.Othermonitoring.services.test99MonitoringServicesTest->testSensorResult()
Value NULL is equal to value 'PDOException: SQLSTATE[42000]: Syntax error or access violation: 1064 You have an error in your SQL syntax; check the manual that corresponds to your MariaDB server version for the right syntax to use near \'T \'t\') AND (f F \'f\') AND ( < \'<\') AND (timestamp > \'1444218982\')\' at line 1'.Othermonitoring.services.test99MonitoringServicesTest->testSensorResult()
Value NULL is equal to value 1444305382.Othermonitoring.services.test99MonitoringServicesTest->testSensorResult()
Value NULL is equal to value 1.7.Othermonitoring.services.test99MonitoringServicesTest->testSensorResult()
Value false is TRUE.Othermonitoring.services.test98MonitoringServicesTest->testSensorResult()
Value NULL is equal to value 'dblog_event_severity_info'.Othermonitoring.services.test99MonitoringServicesTest->testSensorResult()
Value NULL is equal to value 'http://ec2-54-148-9-230.us-west-2.compute.amazonaws.com/checkout/?q=monitoring/v1/sensor-result/dblog_event_severity_info'.Othermonitoring.services.test99MonitoringServicesTest->testSensorResult()
Value NULL is equal to value 'OK'.Othermonitoring.services.test99MonitoringServicesTest->testSensorResult()
Value NULL is equal to value '22'.Othermonitoring.services.test99MonitoringServicesTest->testSensorResult()
Value NULL is equal to value '22'.Othermonitoring.services.test99MonitoringServicesTest->testSensorResult()
Value NULL is equal to value '22 events in 1 day'.Othermonitoring.services.test99MonitoringServicesTest->testSensorResult()
Value NULL is equal to value 1444305382.Othermonitoring.services.test99MonitoringServicesTest->testSensorResult()
Value NULL is equal to value 0.44.Othermonitoring.services.test99MonitoringServicesTest->testSensorResult()
Value false is TRUE.Othermonitoring.services.test98MonitoringServicesTest->testSensorResult()
Value NULL is equal to value 'dblog_event_severity_notice'.Othermonitoring.services.test99MonitoringServicesTest->testSensorResult()
Value NULL is equal to value 'http://ec2-54-148-9-230.us-west-2.compute.amazonaws.com/checkout/?q=monitoring/v1/sensor-result/dblog_event_severity_notice'.Othermonitoring.services.test99MonitoringServicesTest->testSensorResult()
Value NULL is equal to value 'OK'.Othermonitoring.services.test99MonitoringServicesTest->testSensorResult()
Value NULL is equal to value '12'.Othermonitoring.services.test99MonitoringServicesTest->testSensorResult()
Value NULL is equal to value '12'.Othermonitoring.services.test99MonitoringServicesTest->testSensorResult()
Value NULL is equal to value '12 events in 1 day'.Othermonitoring.services.test99MonitoringServicesTest->testSensorResult()
Value NULL is equal to value 1444305382.Othermonitoring.services.test99MonitoringServicesTest->testSensorResult()
Value NULL is equal to value 0.52.Othermonitoring.services.test99MonitoringServicesTest->testSensorResult()
Value false is TRUE.Othermonitoring.services.test98MonitoringServicesTest->testSensorResult()
Value NULL is equal to value 'test_sensor_cat_watchdog'.Othermonitoring.services.test99MonitoringServicesTest->testSensorResult()
Value NULL is equal to value 'http://ec2-54-148-9-230.us-west-2.compute.amazonaws.com/checkout/?q=monitoring/v1/sensor-result/test_sensor_cat_watchdog'.Othermonitoring.services.test99MonitoringServicesTest->testSensorResult()
LeafMonitoring simplenews (MonitoringSimplenewsTest) [Monitoring]300
ExpandMonitoring UI (MonitoringUITest) [Monitoring]29750128
MessageGroupFilenameLineFunctionStatus
Argument 2 passed to Drupal\monitoring\Sensor\Sensors\SensorDatabaseAggregator::getFieldName() must be an array, string given, called in /var/lib/drupaltestbot/sites/default/files/checkout/sites/default/modules/monitoring/lib/Drupal/monitoring/Sensor/Sensors/SensorDatabaseAggregator.php on line 135 and definedRecoverable fatal errorSensorDatabaseAggregator.php162Drupal\monitoring\Sensor\Sensors\SensorDatabaseAggregator->getFieldName()
"0 druplicons in 1 day" foundOthermonitoring.ui.test58MonitoringUITest->testAggregateSensorTimeIntervalConfig()
Argument 2 passed to Drupal\monitoring\Sensor\Sensors\SensorDatabaseAggregator::getFieldName() must be an array, string given, called in /var/lib/drupaltestbot/sites/default/files/checkout/sites/default/modules/monitoring/lib/Drupal/monitoring/Sensor/Sensors/SensorDatabaseAggregator.php on line 135 and definedRecoverable fatal errorSensorDatabaseAggregator.php162Drupal\monitoring\Sensor\Sensors\SensorDatabaseAggregator->getFieldName()
"0 druplicons in 3 hours" foundOthermonitoring.ui.test79MonitoringUITest->testAggregateSensorTimeIntervalConfig()
Argument 2 passed to Drupal\monitoring\Sensor\Sensors\SensorDatabaseAggregator::getFieldName() must be an array, string given, called in /var/lib/drupaltestbot/sites/default/files/checkout/sites/default/modules/monitoring/lib/Drupal/monitoring/Sensor/Sensors/SensorDatabaseAggregator.php on line 135 and definedRecoverable fatal errorSensorDatabaseAggregator.php162Drupal\monitoring\Sensor\Sensors\SensorDatabaseAggregator->getFieldName()
"0 druplicons" foundOthermonitoring.ui.test93MonitoringUITest->testAggregateSensorTimeIntervalConfig()
Argument 2 passed to Drupal\monitoring\Sensor\Sensors\SensorDatabaseAggregator::getFieldName() must be an array, string given, called in /var/lib/drupaltestbot/sites/default/files/checkout/sites/default/modules/monitoring/lib/Drupal/monitoring/Sensor/Sensors/SensorDatabaseAggregator.php on line 135 and definedRecoverable fatal errorSensorDatabaseAggregator.php162Drupal\monitoring\Sensor\Sensors\SensorDatabaseAggregator->getFieldName()
Raw "Sensor <em class="placeholder">Test sensor</em> (<em class="placeholder">Test</em>) cached before" foundOthermonitoring.ui.test115MonitoringUITest->testSensorOverviewPage()
Undefined offset: 0Noticemonitoring.ui.test119MonitoringUITest->testSensorOverviewPage()
Trying to get property of non-objectNoticemonitoring.ui.test123MonitoringUITest->testSensorOverviewPage()
Trying to get property of non-objectNoticemonitoring.ui.test124MonitoringUITest->testSensorOverviewPage()
Trying to get property of non-objectNoticemonitoring.ui.test124MonitoringUITest->testSensorOverviewPage()
Value 'Cron' is equal to value NULL.Othermonitoring.ui.test124MonitoringUITest->testSensorOverviewPage()
Trying to get property of non-objectNoticemonitoring.ui.test128MonitoringUITest->testSensorOverviewPage()
Trying to get property of non-objectNoticemonitoring.ui.test129MonitoringUITest->testSensorOverviewPage()
Trying to get property of non-objectNoticemonitoring.ui.test129MonitoringUITest->testSensorOverviewPage()
Value NULL is equal to value 'Cron safe threshold enabled'.Othermonitoring.ui.test129MonitoringUITest->testSensorOverviewPage()
Trying to get property of non-objectNoticemonitoring.ui.test128MonitoringUITest->testSensorOverviewPage()
Trying to get property of non-objectNoticemonitoring.ui.test129MonitoringUITest->testSensorOverviewPage()
Trying to get property of non-objectNoticemonitoring.ui.test129MonitoringUITest->testSensorOverviewPage()
Value NULL is equal to value 'Last cron run age'.Othermonitoring.ui.test129MonitoringUITest->testSensorOverviewPage()
Trying to get property of non-objectNoticemonitoring.ui.test123MonitoringUITest->testSensorOverviewPage()
Trying to get property of non-objectNoticemonitoring.ui.test124MonitoringUITest->testSensorOverviewPage()
Trying to get property of non-objectNoticemonitoring.ui.test124MonitoringUITest->testSensorOverviewPage()
Value 'Other' is equal to value NULL.Othermonitoring.ui.test124MonitoringUITest->testSensorOverviewPage()
Trying to get property of non-objectNoticemonitoring.ui.test128MonitoringUITest->testSensorOverviewPage()
Trying to get property of non-objectNoticemonitoring.ui.test129MonitoringUITest->testSensorOverviewPage()
Trying to get property of non-objectNoticemonitoring.ui.test129MonitoringUITest->testSensorOverviewPage()
Value NULL is equal to value 'Maintenance mode'.Othermonitoring.ui.test129MonitoringUITest->testSensorOverviewPage()
Trying to get property of non-objectNoticemonitoring.ui.test123MonitoringUITest->testSensorOverviewPage()
Trying to get property of non-objectNoticemonitoring.ui.test124MonitoringUITest->testSensorOverviewPage()
Trying to get property of non-objectNoticemonitoring.ui.test124MonitoringUITest->testSensorOverviewPage()
Value 'Queue' is equal to value NULL.Othermonitoring.ui.test124MonitoringUITest->testSensorOverviewPage()
Trying to get property of non-objectNoticemonitoring.ui.test128MonitoringUITest->testSensorOverviewPage()
Trying to get property of non-objectNoticemonitoring.ui.test129MonitoringUITest->testSensorOverviewPage()
Trying to get property of non-objectNoticemonitoring.ui.test129MonitoringUITest->testSensorOverviewPage()
Value NULL is equal to value 'monitoring_test'.Othermonitoring.ui.test129MonitoringUITest->testSensorOverviewPage()
Trying to get property of non-objectNoticemonitoring.ui.test123MonitoringUITest->testSensorOverviewPage()
Trying to get property of non-objectNoticemonitoring.ui.test124MonitoringUITest->testSensorOverviewPage()
Trying to get property of non-objectNoticemonitoring.ui.test124MonitoringUITest->testSensorOverviewPage()
Value 'Requirements' is equal to value NULL.Othermonitoring.ui.test124MonitoringUITest->testSensorOverviewPage()
Trying to get property of non-objectNoticemonitoring.ui.test128MonitoringUITest->testSensorOverviewPage()
Trying to get property of non-objectNoticemonitoring.ui.test129MonitoringUITest->testSensorOverviewPage()
Trying to get property of non-objectNoticemonitoring.ui.test129MonitoringUITest->testSensorOverviewPage()
Value NULL is equal to value 'Module ctools'.Othermonitoring.ui.test129MonitoringUITest->testSensorOverviewPage()
Trying to get property of non-objectNoticemonitoring.ui.test128MonitoringUITest->testSensorOverviewPage()
Trying to get property of non-objectNoticemonitoring.ui.test129MonitoringUITest->testSensorOverviewPage()
Trying to get property of non-objectNoticemonitoring.ui.test129MonitoringUITest->testSensorOverviewPage()
Value NULL is equal to value 'Module monitoring_test'.Othermonitoring.ui.test129MonitoringUITest->testSensorOverviewPage()
Trying to get property of non-objectNoticemonitoring.ui.test128MonitoringUITest->testSensorOverviewPage()
Trying to get property of non-objectNoticemonitoring.ui.test129MonitoringUITest->testSensorOverviewPage()
Trying to get property of non-objectNoticemonitoring.ui.test129MonitoringUITest->testSensorOverviewPage()
Value NULL is equal to value 'Module node'.Othermonitoring.ui.test129MonitoringUITest->testSensorOverviewPage()
Trying to get property of non-objectNoticemonitoring.ui.test128MonitoringUITest->testSensorOverviewPage()
Trying to get property of non-objectNoticemonitoring.ui.test129MonitoringUITest->testSensorOverviewPage()
Trying to get property of non-objectNoticemonitoring.ui.test129MonitoringUITest->testSensorOverviewPage()
Value NULL is equal to value 'Module system'.Othermonitoring.ui.test129MonitoringUITest->testSensorOverviewPage()
Trying to get property of non-objectNoticemonitoring.ui.test123MonitoringUITest->testSensorOverviewPage()
Trying to get property of non-objectNoticemonitoring.ui.test124MonitoringUITest->testSensorOverviewPage()
Trying to get property of non-objectNoticemonitoring.ui.test124MonitoringUITest->testSensorOverviewPage()
Value 'System' is equal to value NULL.Othermonitoring.ui.test124MonitoringUITest->testSensorOverviewPage()
Trying to get property of non-objectNoticemonitoring.ui.test128MonitoringUITest->testSensorOverviewPage()
Trying to get property of non-objectNoticemonitoring.ui.test129MonitoringUITest->testSensorOverviewPage()
Trying to get property of non-objectNoticemonitoring.ui.test129MonitoringUITest->testSensorOverviewPage()
Value NULL is equal to value 'Disappeared sensors'.Othermonitoring.ui.test129MonitoringUITest->testSensorOverviewPage()
Trying to get property of non-objectNoticemonitoring.ui.test123MonitoringUITest->testSensorOverviewPage()
Trying to get property of non-objectNoticemonitoring.ui.test124MonitoringUITest->testSensorOverviewPage()
Trying to get property of non-objectNoticemonitoring.ui.test124MonitoringUITest->testSensorOverviewPage()
Value 'Test' is equal to value NULL.Othermonitoring.ui.test124MonitoringUITest->testSensorOverviewPage()
Trying to get property of non-objectNoticemonitoring.ui.test128MonitoringUITest->testSensorOverviewPage()
Trying to get property of non-objectNoticemonitoring.ui.test129MonitoringUITest->testSensorOverviewPage()
Trying to get property of non-objectNoticemonitoring.ui.test129MonitoringUITest->testSensorOverviewPage()
Value NULL is equal to value 'DB Aggregate test'.Othermonitoring.ui.test129MonitoringUITest->testSensorOverviewPage()
Trying to get property of non-objectNoticemonitoring.ui.test128MonitoringUITest->testSensorOverviewPage()
Trying to get property of non-objectNoticemonitoring.ui.test129MonitoringUITest->testSensorOverviewPage()
Trying to get property of non-objectNoticemonitoring.ui.test129MonitoringUITest->testSensorOverviewPage()
Value NULL is equal to value 'Test from integration hook'.Othermonitoring.ui.test129MonitoringUITest->testSensorOverviewPage()
Trying to get property of non-objectNoticemonitoring.ui.test128MonitoringUITest->testSensorOverviewPage()
Trying to get property of non-objectNoticemonitoring.ui.test129MonitoringUITest->testSensorOverviewPage()
Trying to get property of non-objectNoticemonitoring.ui.test129MonitoringUITest->testSensorOverviewPage()
Value NULL is equal to value 'Test sensor'.Othermonitoring.ui.test129MonitoringUITest->testSensorOverviewPage()
Trying to get property of non-objectNoticemonitoring.ui.test128MonitoringUITest->testSensorOverviewPage()
Trying to get property of non-objectNoticemonitoring.ui.test129MonitoringUITest->testSensorOverviewPage()
Trying to get property of non-objectNoticemonitoring.ui.test129MonitoringUITest->testSensorOverviewPage()
Value NULL is equal to value 'Test sensor exceeds'.Othermonitoring.ui.test129MonitoringUITest->testSensorOverviewPage()
Trying to get property of non-objectNoticemonitoring.ui.test128MonitoringUITest->testSensorOverviewPage()
Trying to get property of non-objectNoticemonitoring.ui.test129MonitoringUITest->testSensorOverviewPage()
Trying to get property of non-objectNoticemonitoring.ui.test129MonitoringUITest->testSensorOverviewPage()
Value NULL is equal to value 'Test sensor falls'.Othermonitoring.ui.test129MonitoringUITest->testSensorOverviewPage()
Trying to get property of non-objectNoticemonitoring.ui.test128MonitoringUITest->testSensorOverviewPage()
Trying to get property of non-objectNoticemonitoring.ui.test129MonitoringUITest->testSensorOverviewPage()
Trying to get property of non-objectNoticemonitoring.ui.test129MonitoringUITest->testSensorOverviewPage()
Value NULL is equal to value 'Test sensor inner'.Othermonitoring.ui.test129MonitoringUITest->testSensorOverviewPage()
Trying to get property of non-objectNoticemonitoring.ui.test128MonitoringUITest->testSensorOverviewPage()
Trying to get property of non-objectNoticemonitoring.ui.test129MonitoringUITest->testSensorOverviewPage()
Trying to get property of non-objectNoticemonitoring.ui.test129MonitoringUITest->testSensorOverviewPage()
Value NULL is equal to value 'Test sensor outer'.Othermonitoring.ui.test129MonitoringUITest->testSensorOverviewPage()
Trying to get property of non-objectNoticemonitoring.ui.test128MonitoringUITest->testSensorOverviewPage()
Trying to get property of non-objectNoticemonitoring.ui.test129MonitoringUITest->testSensorOverviewPage()
Trying to get property of non-objectNoticemonitoring.ui.test129MonitoringUITest->testSensorOverviewPage()
Value NULL is equal to value 'Watchdog aggregate test'.Othermonitoring.ui.test129MonitoringUITest->testSensorOverviewPage()
Trying to get property of non-objectNoticemonitoring.ui.test123MonitoringUITest->testSensorOverviewPage()
Trying to get property of non-objectNoticemonitoring.ui.test124MonitoringUITest->testSensorOverviewPage()
Trying to get property of non-objectNoticemonitoring.ui.test124MonitoringUITest->testSensorOverviewPage()
Value 'User activity' is equal to value NULL.Othermonitoring.ui.test124MonitoringUITest->testSensorOverviewPage()
Trying to get property of non-objectNoticemonitoring.ui.test128MonitoringUITest->testSensorOverviewPage()
Trying to get property of non-objectNoticemonitoring.ui.test129MonitoringUITest->testSensorOverviewPage()
Trying to get property of non-objectNoticemonitoring.ui.test129MonitoringUITest->testSensorOverviewPage()
Value NULL is equal to value 'All active sessions'.Othermonitoring.ui.test129MonitoringUITest->testSensorOverviewPage()
Trying to get property of non-objectNoticemonitoring.ui.test128MonitoringUITest->testSensorOverviewPage()
Trying to get property of non-objectNoticemonitoring.ui.test129MonitoringUITest->testSensorOverviewPage()
Trying to get property of non-objectNoticemonitoring.ui.test129MonitoringUITest->testSensorOverviewPage()
Value NULL is equal to value 'Authenticated user sessions'.Othermonitoring.ui.test129MonitoringUITest->testSensorOverviewPage()
Trying to get property of non-objectNoticemonitoring.ui.test128MonitoringUITest->testSensorOverviewPage()
Trying to get property of non-objectNoticemonitoring.ui.test129MonitoringUITest->testSensorOverviewPage()
Trying to get property of non-objectNoticemonitoring.ui.test129MonitoringUITest->testSensorOverviewPage()
Value NULL is equal to value 'Failed user logins'.Othermonitoring.ui.test129MonitoringUITest->testSensorOverviewPage()
Trying to get property of non-objectNoticemonitoring.ui.test128MonitoringUITest->testSensorOverviewPage()
Trying to get property of non-objectNoticemonitoring.ui.test129MonitoringUITest->testSensorOverviewPage()
Trying to get property of non-objectNoticemonitoring.ui.test129MonitoringUITest->testSensorOverviewPage()
Value NULL is equal to value 'New users'.Othermonitoring.ui.test129MonitoringUITest->testSensorOverviewPage()
Trying to get property of non-objectNoticemonitoring.ui.test128MonitoringUITest->testSensorOverviewPage()
Trying to get property of non-objectNoticemonitoring.ui.test129MonitoringUITest->testSensorOverviewPage()
Trying to get property of non-objectNoticemonitoring.ui.test129MonitoringUITest->testSensorOverviewPage()
Value NULL is equal to value 'Successful user logins'.Othermonitoring.ui.test129MonitoringUITest->testSensorOverviewPage()
Trying to get property of non-objectNoticemonitoring.ui.test128MonitoringUITest->testSensorOverviewPage()
Trying to get property of non-objectNoticemonitoring.ui.test129MonitoringUITest->testSensorOverviewPage()
Trying to get property of non-objectNoticemonitoring.ui.test129MonitoringUITest->testSensorOverviewPage()
Value NULL is equal to value 'User session logouts'.Othermonitoring.ui.test129MonitoringUITest->testSensorOverviewPage()
Trying to get property of non-objectNoticemonitoring.ui.test123MonitoringUITest->testSensorOverviewPage()
Trying to get property of non-objectNoticemonitoring.ui.test124MonitoringUITest->testSensorOverviewPage()
Trying to get property of non-objectNoticemonitoring.ui.test124MonitoringUITest->testSensorOverviewPage()
Value 'Watchdog' is equal to value NULL.Othermonitoring.ui.test124MonitoringUITest->testSensorOverviewPage()
Trying to get property of non-objectNoticemonitoring.ui.test128MonitoringUITest->testSensorOverviewPage()
Trying to get property of non-objectNoticemonitoring.ui.test129MonitoringUITest->testSensorOverviewPage()
Trying to get property of non-objectNoticemonitoring.ui.test129MonitoringUITest->testSensorOverviewPage()
Value NULL is equal to value 'Page not found errors'.Othermonitoring.ui.test129MonitoringUITest->testSensorOverviewPage()
Trying to get property of non-objectNoticemonitoring.ui.test128MonitoringUITest->testSensorOverviewPage()
Trying to get property of non-objectNoticemonitoring.ui.test129MonitoringUITest->testSensorOverviewPage()
Trying to get property of non-objectNoticemonitoring.ui.test129MonitoringUITest->testSensorOverviewPage()
Value NULL is equal to value 'Severity alert'.Othermonitoring.ui.test129MonitoringUITest->testSensorOverviewPage()
Trying to get property of non-objectNoticemonitoring.ui.test128MonitoringUITest->testSensorOverviewPage()
Trying to get property of non-objectNoticemonitoring.ui.test129MonitoringUITest->testSensorOverviewPage()
Trying to get property of non-objectNoticemonitoring.ui.test129MonitoringUITest->testSensorOverviewPage()
Value NULL is equal to value 'Severity critical'.Othermonitoring.ui.test129MonitoringUITest->testSensorOverviewPage()
Trying to get property of non-objectNoticemonitoring.ui.test128MonitoringUITest->testSensorOverviewPage()
Trying to get property of non-objectNoticemonitoring.ui.test129MonitoringUITest->testSensorOverviewPage()
Trying to get property of non-objectNoticemonitoring.ui.test129MonitoringUITest->testSensorOverviewPage()
Value NULL is equal to value 'Severity debug'.Othermonitoring.ui.test129MonitoringUITest->testSensorOverviewPage()
Trying to get property of non-objectNoticemonitoring.ui.test128MonitoringUITest->testSensorOverviewPage()
Trying to get property of non-objectNoticemonitoring.ui.test129MonitoringUITest->testSensorOverviewPage()
Trying to get property of non-objectNoticemonitoring.ui.test129MonitoringUITest->testSensorOverviewPage()
Value NULL is equal to value 'Severity emergency'.Othermonitoring.ui.test129MonitoringUITest->testSensorOverviewPage()
Trying to get property of non-objectNoticemonitoring.ui.test128MonitoringUITest->testSensorOverviewPage()
Trying to get property of non-objectNoticemonitoring.ui.test129MonitoringUITest->testSensorOverviewPage()
Trying to get property of non-objectNoticemonitoring.ui.test129MonitoringUITest->testSensorOverviewPage()
Value NULL is equal to value 'Severity error'.Othermonitoring.ui.test129MonitoringUITest->testSensorOverviewPage()
Trying to get property of non-objectNoticemonitoring.ui.test128MonitoringUITest->testSensorOverviewPage()
Trying to get property of non-objectNoticemonitoring.ui.test129MonitoringUITest->testSensorOverviewPage()
Trying to get property of non-objectNoticemonitoring.ui.test129MonitoringUITest->testSensorOverviewPage()
Value NULL is equal to value 'Severity info'.Othermonitoring.ui.test129MonitoringUITest->testSensorOverviewPage()
Trying to get property of non-objectNoticemonitoring.ui.test128MonitoringUITest->testSensorOverviewPage()
Trying to get property of non-objectNoticemonitoring.ui.test129MonitoringUITest->testSensorOverviewPage()
Trying to get property of non-objectNoticemonitoring.ui.test129MonitoringUITest->testSensorOverviewPage()
Value NULL is equal to value 'Severity notice'.Othermonitoring.ui.test129MonitoringUITest->testSensorOverviewPage()
Trying to get property of non-objectNoticemonitoring.ui.test128MonitoringUITest->testSensorOverviewPage()
Trying to get property of non-objectNoticemonitoring.ui.test129MonitoringUITest->testSensorOverviewPage()
Trying to get property of non-objectNoticemonitoring.ui.test129MonitoringUITest->testSensorOverviewPage()
Value NULL is equal to value 'Test sensor category Watchdog'.Othermonitoring.ui.test129MonitoringUITest->testSensorOverviewPage()
Argument 2 passed to Drupal\monitoring\Sensor\Sensors\SensorDatabaseAggregator::getFieldName() must be an array, string given, called in /var/lib/drupaltestbot/sites/default/files/checkout/sites/default/modules/monitoring/lib/Drupal/monitoring/Sensor/Sensors/SensorDatabaseAggregator.php on line 135 and definedRecoverable fatal errorSensorDatabaseAggregator.php162Drupal\monitoring\Sensor\Sensors\SensorDatabaseAggregator->getFieldName()
"First message" foundOthermonitoring.ui.test228MonitoringUITest->testForceExecute()
Argument 2 passed to Drupal\monitoring\Sensor\Sensors\SensorDatabaseAggregator::getFieldName() must be an array, string given, called in /var/lib/drupaltestbot/sites/default/files/checkout/sites/default/modules/monitoring/lib/Drupal/monitoring/Sensor/Sensors/SensorDatabaseAggregator.php on line 135 and definedRecoverable fatal errorSensorDatabaseAggregator.php162Drupal\monitoring\Sensor\Sensors\SensorDatabaseAggregator->getFieldName()
"First message" foundOthermonitoring.ui.test237MonitoringUITest->testForceExecute()
Link Force execute all does not exist on http://ec2-54-148-9-230.us-west-2.compute.amazonaws.com/checkout/?q=admin/reports/monitoringBrowsermonitoring.ui.test240MonitoringUITest->testForceExecute()
"Second message" foundOthermonitoring.ui.test242MonitoringUITest->testForceExecute()
Link with label Force execution found.Othermonitoring.ui.test250MonitoringUITest->testForceExecute()
Argument 2 passed to Drupal\monitoring\Sensor\Sensors\SensorDatabaseAggregator::getFieldName() must be an array, string given, called in /var/lib/drupaltestbot/sites/default/files/checkout/sites/default/modules/monitoring/lib/Drupal/monitoring/Sensor/Sensors/SensorDatabaseAggregator.php on line 135 and definedRecoverable fatal errorSensorDatabaseAggregator.php162Drupal\monitoring\Sensor\Sensors\SensorDatabaseAggregator->getFieldName()
"Third message" foundOthermonitoring.ui.test253MonitoringUITest->testForceExecute()