examples-rest_example-1883784-43.patch

Test status
StatusResult
Last receivedWed, 10/07/2015 - 16:23:00
Last requestedWed, 10/07/2015 - 16:33:47
Last testedWed, 10/07/2015 - 16:34:47
Test count1
Environment status
PHP 5.5 MySQLfail
File information
Fileexamples-rest_example-1883784-43.patch
BranchExamples for Developers - 8.x-1.x
LinkIssue Link
SummaryFAILED: [[SimpleTest]]: [PHP 5.5 MySQL] 1,023 pass(es), 32 fail(s), and 12 exception(s).
Details

PHP 5.5 MySQL

  1. Setup environment
  2. Detect an invalid patch URL
  3. Detect invalid repository information
  4. Detect invalid patch format
  5. Detect a non-applicable patch
  6. Detect invalid PHP syntax
  7. Detect a Drupal installation failure
  8. Detect a test run failure
  9. Detect a failing test
    Review the test failures below then if necessary run them locally until the problem has been fixed.
  10. Complete test suite with all tests passing
1,023 pass(es), 32 fail(s), and 12 exception(s)

Non-pass

Test namePassFailException
ExpandDrupal\content_entity_example\Tests\ContentEntityExampleTest22320
MessageGroupFilenameLineFunctionStatus
"test name" foundOtherContentEntityExampleTest.php78Drupal\content_entity_example\Tests\ContentEntityExampleTest->testContentEntityExample()
"Contact Settings" foundOtherContentEntityExampleTest.php97Drupal\content_entity_example\Tests\ContentEntityExampleTest->testContentEntityExample()
ExpandDrupal\field_example\Tests\Text3WidgetTest104145
MessageGroupFilenameLineFunctionStatus
simplexml_import_dom(): Invalid Nodetype to importsimplexml_import_dom(Object) Drupal\simpletest\WebTestBase->parse() Drupal\simpletest\WebTestBase->drupalPostForm(NULL, Array, Object) Drupal\field_example\FieldExampleWebTestBase->createField('field_example_rgb', 'field_example_3text', '1') Drupal\field_example\Tests\Text3WidgetTest->testSingleValueField() Drupal\simpletest\TestBase->run(Array) simpletest_script_run_one_test('8', 'Drupal\field_example\Tests\Text3WidgetTest') WarningAssertContentTrait.php138Drupal\simpletest\WebTestBase->parse()
Drupal\Core\StringTranslation\TranslatableMarkup Object ( [string:protected] => Saved settings for field %field_name with widget %widget_type and cardinality %cardinality [translatedMarkup:protected] => [options:protected] => Array ( ) [stringTranslation:protected] => Drupal\Core\StringTranslation\TranslationManager Object ( [translators:protected] => Array ( [30] => Array ( [0] => Drupal\Core\StringTranslation\Translator\CustomStrings Object ( [settings:protected] => Drupal\Core\Site\Settings Object ( [storage:Drupal\Core\Site\Settings:private] => Array ( [hash_salt] => qtJmJTXpGWjV1Vh2B1BrWid3qdUABzt22XCTPp4fwYPVM7ewGr70MbkXZtSnzn2N21cdYZA9-Q [update_free_access] => [container_yamls] => Array ( [0] => /var/lib/drupaltestbot/sites/default/files/checkout/sites/simpletest/821501/services.yml ) [file_public_path] => sites/simpletest/821501/files [file_private_path] => sites/simpletest/821501/private [test_parent_site] => sites/default [apcu_ensure_unique_prefix] => [install_profile] => testing ) [_serviceId] => settings ) [translations:protected] => Array ( [en] => Array ( ) [] => Array ( ) ) [_serviceId] => string_translator.custom_strings ) ) ) [sortedTranslators:protected] => Array ( [0] => Drupal\Core\StringTranslation\Translator\CustomStrings Object ( [settings:protected] => Drupal\Core\Site\Settings Object ( [storage:Drupal\Core\Site\Settings:private] => Array ( [hash_salt] => qtJmJTXpGWjV1Vh2B1BrWid3qdUABzt22XCTPp4fwYPVM7ewGr70MbkXZtSnzn2N21cdYZA9-Q [update_free_access] => [container_yamls] => Array ( [0] => /var/lib/drupaltestbot/sites/default/files/checkout/sites/simpletest/821501/services.yml ) [file_public_path] => sites/simpletest/821501/files [file_private_path] => sites/simpletest/821501/private [test_parent_site] => sites/default [apcu_ensure_unique_prefix] => [install_profile] => testing ) [_serviceId] => settings ) [translations:protected] => Array ( [en] => Array ( ) [] => Array ( ) ) [_serviceId] => string_translator.custom_strings ) ) [defaultLangcode:protected] => en [_serviceId] => string_translation ) [arguments:protected] => Array ( [%field_name] => lkg7uvrwz2 [%widget_type] => field_example_3text [%cardinality] => 1 ) ) DebugFieldExampleWebTestBase.php134Drupal\field_example\FieldExampleWebTestBase->createField()
"Updated field lkg7uvrwz2 field settings." foundOtherFieldExampleWebTestBase.php135Drupal\field_example\FieldExampleWebTestBase->createField()
Undefined offset: 0Drupal\field_example\Tests\Text3WidgetTest->testSingleValueField() Drupal\simpletest\TestBase->run(Array) simpletest_script_run_one_test('8', 'Drupal\field_example\Tests\Text3WidgetTest') NoticeText3WidgetTest.php58Drupal\field_example\Tests\Text3WidgetTest->testSingleValueField()
Value '' is equal to value 'The color code in this field is #000a01'.OtherText3WidgetTest.php58Drupal\field_example\Tests\Text3WidgetTest->testSingleValueField()
Declaration of Drupal\field_example\Plugin\Field\FieldFormatter\SimpleTextFormatter::viewElements() must be compatible with Drupal\Core\Field\FormatterInterface::viewElements(Drupal\Core\Field\FieldItemListInterface $items, $langcode)PHP Fatal errorSimpleTextFormatter.php0Unknown
simplexml_import_dom(): Invalid Nodetype to importsimplexml_import_dom(Object) Drupal\simpletest\WebTestBase->parse() Drupal\simpletest\WebTestBase->drupalPostForm(NULL, Array, Object) Drupal\field_example\FieldExampleWebTestBase->createField('field_example_rgb', 'field_example_3text', '-1') Drupal\field_example\Tests\Text3WidgetTest->testMultiValueField() Drupal\simpletest\TestBase->run(Array) simpletest_script_run_one_test('8', 'Drupal\field_example\Tests\Text3WidgetTest') WarningAssertContentTrait.php138Drupal\simpletest\WebTestBase->parse()
Drupal\Core\StringTranslation\TranslatableMarkup Object ( [string:protected] => Saved settings for field %field_name with widget %widget_type and cardinality %cardinality [translatedMarkup:protected] => [options:protected] => Array ( ) [stringTranslation:protected] => Drupal\Core\StringTranslation\TranslationManager Object ( [translators:protected] => Array ( [30] => Array ( [0] => Drupal\Core\StringTranslation\Translator\CustomStrings Object ( [settings:protected] => Drupal\Core\Site\Settings Object ( [storage:Drupal\Core\Site\Settings:private] => Array ( [hash_salt] => K8eX1ypFakkKAEk7PTiMCDbNkSkfO-tvdmhKpBLpRGyujJXETNCkzUhZr4zhHGCaC9QPM1GrVg [update_free_access] => [container_yamls] => Array ( [0] => /var/lib/drupaltestbot/sites/default/files/checkout/sites/simpletest/886347/services.yml ) [file_public_path] => sites/simpletest/886347/files [file_private_path] => sites/simpletest/886347/private [test_parent_site] => sites/default [apcu_ensure_unique_prefix] => [install_profile] => testing ) [_serviceId] => settings ) [translations:protected] => Array ( [en] => Array ( ) [] => Array ( ) ) [_serviceId] => string_translator.custom_strings ) ) ) [sortedTranslators:protected] => Array ( [0] => Drupal\Core\StringTranslation\Translator\CustomStrings Object ( [settings:protected] => Drupal\Core\Site\Settings Object ( [storage:Drupal\Core\Site\Settings:private] => Array ( [hash_salt] => K8eX1ypFakkKAEk7PTiMCDbNkSkfO-tvdmhKpBLpRGyujJXETNCkzUhZr4zhHGCaC9QPM1GrVg [update_free_access] => [container_yamls] => Array ( [0] => /var/lib/drupaltestbot/sites/default/files/checkout/sites/simpletest/886347/services.yml ) [file_public_path] => sites/simpletest/886347/files [file_private_path] => sites/simpletest/886347/private [test_parent_site] => sites/default [apcu_ensure_unique_prefix] => [install_profile] => testing ) [_serviceId] => settings ) [translations:protected] => Array ( [en] => Array ( ) [] => Array ( ) ) [_serviceId] => string_translator.custom_strings ) ) [defaultLangcode:protected] => en [_serviceId] => string_translation ) [arguments:protected] => Array ( [%field_name] => mexzrp2mtf [%widget_type] => field_example_3text [%cardinality] => -1 ) ) DebugFieldExampleWebTestBase.php134Drupal\field_example\FieldExampleWebTestBase->createField()
"Updated field mexzrp2mtf field settings." foundOtherFieldExampleWebTestBase.php135Drupal\field_example\FieldExampleWebTestBase->createField()
Found the Add another item buttonOtherText3WidgetTest.php91Drupal\field_example\Tests\Text3WidgetTest->testMultiValueField()
Found the requested form fields at OtherText3WidgetTest.php91Drupal\field_example\Tests\Text3WidgetTest->testMultiValueField()
Failed to set field field_mexzrp2mtf[1][value][r] to ffOtherText3WidgetTest.php99Drupal\field_example\Tests\Text3WidgetTest->testMultiValueField()
Failed to set field field_mexzrp2mtf[1][value][g] to ffOtherText3WidgetTest.php99Drupal\field_example\Tests\Text3WidgetTest->testMultiValueField()
Failed to set field field_mexzrp2mtf[1][value][b] to ffOtherText3WidgetTest.php99Drupal\field_example\Tests\Text3WidgetTest->testMultiValueField()
Found the requested form fields at OtherText3WidgetTest.php99Drupal\field_example\Tests\Text3WidgetTest->testMultiValueField()
"rjrjegud6g nwndFbXl0heAxCgrXhSe has been created" foundOtherText3WidgetTest.php100Drupal\field_example\Tests\Text3WidgetTest->testMultiValueField()
Undefined offset: 0Drupal\field_example\Tests\Text3WidgetTest->testMultiValueField() Drupal\simpletest\TestBase->run(Array) simpletest_script_run_one_test('8', 'Drupal\field_example\Tests\Text3WidgetTest') NoticeText3WidgetTest.php104Drupal\field_example\Tests\Text3WidgetTest->testMultiValueField()
Value '' is equal to value 'The color code in this field is #00ff00'.OtherText3WidgetTest.php104Drupal\field_example\Tests\Text3WidgetTest->testMultiValueField()
Undefined offset: 1Drupal\field_example\Tests\Text3WidgetTest->testMultiValueField() Drupal\simpletest\TestBase->run(Array) simpletest_script_run_one_test('8', 'Drupal\field_example\Tests\Text3WidgetTest') NoticeText3WidgetTest.php105Drupal\field_example\Tests\Text3WidgetTest->testMultiValueField()
Value '' is equal to value 'The color code in this field is #ffffff'.OtherText3WidgetTest.php105Drupal\field_example\Tests\Text3WidgetTest->testMultiValueField()
Declaration of Drupal\field_example\Plugin\Field\FieldFormatter\SimpleTextFormatter::viewElements() must be compatible with Drupal\Core\Field\FormatterInterface::viewElements(Drupal\Core\Field\FieldItemListInterface $items, $langcode)PHP Fatal errorSimpleTextFormatter.php0Unknown
ExpandDrupal\field_example\Tests\TextWidgetTest104125
MessageGroupFilenameLineFunctionStatus
simplexml_import_dom(): Invalid Nodetype to importsimplexml_import_dom(Object) Drupal\simpletest\WebTestBase->parse() Drupal\simpletest\WebTestBase->drupalPostForm(NULL, Array, Object) Drupal\field_example\FieldExampleWebTestBase->createField('field_example_rgb', 'field_example_text', '1') Drupal\field_example\Tests\TextWidgetTest->testSingleValueField() Drupal\simpletest\TestBase->run(Array) simpletest_script_run_one_test('7', 'Drupal\field_example\Tests\TextWidgetTest') WarningAssertContentTrait.php138Drupal\simpletest\WebTestBase->parse()
Drupal\Core\StringTranslation\TranslatableMarkup Object ( [string:protected] => Saved settings for field %field_name with widget %widget_type and cardinality %cardinality [translatedMarkup:protected] => [options:protected] => Array ( ) [stringTranslation:protected] => Drupal\Core\StringTranslation\TranslationManager Object ( [translators:protected] => Array ( [30] => Array ( [0] => Drupal\Core\StringTranslation\Translator\CustomStrings Object ( [settings:protected] => Drupal\Core\Site\Settings Object ( [storage:Drupal\Core\Site\Settings:private] => Array ( [hash_salt] => vsrhAZdC34UOw0e_sVT_awqKpOsGzwHUyR7rHiP8kwX5gqPRyW6XeOMc8WG3H0s_DdgI3TX-zw [update_free_access] => [container_yamls] => Array ( [0] => /var/lib/drupaltestbot/sites/default/files/checkout/sites/simpletest/296494/services.yml ) [file_public_path] => sites/simpletest/296494/files [file_private_path] => sites/simpletest/296494/private [test_parent_site] => sites/default [apcu_ensure_unique_prefix] => [install_profile] => testing ) [_serviceId] => settings ) [translations:protected] => Array ( [en] => Array ( ) [] => Array ( ) ) [_serviceId] => string_translator.custom_strings ) ) ) [sortedTranslators:protected] => Array ( [0] => Drupal\Core\StringTranslation\Translator\CustomStrings Object ( [settings:protected] => Drupal\Core\Site\Settings Object ( [storage:Drupal\Core\Site\Settings:private] => Array ( [hash_salt] => vsrhAZdC34UOw0e_sVT_awqKpOsGzwHUyR7rHiP8kwX5gqPRyW6XeOMc8WG3H0s_DdgI3TX-zw [update_free_access] => [container_yamls] => Array ( [0] => /var/lib/drupaltestbot/sites/default/files/checkout/sites/simpletest/296494/services.yml ) [file_public_path] => sites/simpletest/296494/files [file_private_path] => sites/simpletest/296494/private [test_parent_site] => sites/default [apcu_ensure_unique_prefix] => [install_profile] => testing ) [_serviceId] => settings ) [translations:protected] => Array ( [en] => Array ( ) [] => Array ( ) ) [_serviceId] => string_translator.custom_strings ) ) [defaultLangcode:protected] => en [_serviceId] => string_translation ) [arguments:protected] => Array ( [%field_name] => pbqghqvuf8 [%widget_type] => field_example_text [%cardinality] => 1 ) ) DebugFieldExampleWebTestBase.php134Drupal\field_example\FieldExampleWebTestBase->createField()
"Updated field pbqghqvuf8 field settings." foundOtherFieldExampleWebTestBase.php135Drupal\field_example\FieldExampleWebTestBase->createField()
Undefined offset: 0Drupal\field_example\Tests\TextWidgetTest->testSingleValueField() Drupal\simpletest\TestBase->run(Array) simpletest_script_run_one_test('7', 'Drupal\field_example\Tests\TextWidgetTest') NoticeTextWidgetTest.php59Drupal\field_example\Tests\TextWidgetTest->testSingleValueField()
Value '' is equal to value 'The color code in this field is #000001'.OtherTextWidgetTest.php59Drupal\field_example\Tests\TextWidgetTest->testSingleValueField()
Declaration of Drupal\field_example\Plugin\Field\FieldFormatter\SimpleTextFormatter::viewElements() must be compatible with Drupal\Core\Field\FormatterInterface::viewElements(Drupal\Core\Field\FieldItemListInterface $items, $langcode)PHP Fatal errorSimpleTextFormatter.php0Unknown
simplexml_import_dom(): Invalid Nodetype to importsimplexml_import_dom(Object) Drupal\simpletest\WebTestBase->parse() Drupal\simpletest\WebTestBase->drupalPostForm(NULL, Array, Object) Drupal\field_example\FieldExampleWebTestBase->createField('field_example_rgb', 'field_example_text', '-1') Drupal\field_example\Tests\TextWidgetTest->testMultiValueField() Drupal\simpletest\TestBase->run(Array) simpletest_script_run_one_test('7', 'Drupal\field_example\Tests\TextWidgetTest') WarningAssertContentTrait.php138Drupal\simpletest\WebTestBase->parse()
Drupal\Core\StringTranslation\TranslatableMarkup Object ( [string:protected] => Saved settings for field %field_name with widget %widget_type and cardinality %cardinality [translatedMarkup:protected] => [options:protected] => Array ( ) [stringTranslation:protected] => Drupal\Core\StringTranslation\TranslationManager Object ( [translators:protected] => Array ( [30] => Array ( [0] => Drupal\Core\StringTranslation\Translator\CustomStrings Object ( [settings:protected] => Drupal\Core\Site\Settings Object ( [storage:Drupal\Core\Site\Settings:private] => Array ( [hash_salt] => SYcJ3fgYnvykfNUj_C5sQdYrw8Z6OK95ADoHPRouAxyTQcvvlPeLu0wLd9ZJvAcawA3sKElvxg [update_free_access] => [container_yamls] => Array ( [0] => /var/lib/drupaltestbot/sites/default/files/checkout/sites/simpletest/819362/services.yml ) [file_public_path] => sites/simpletest/819362/files [file_private_path] => sites/simpletest/819362/private [test_parent_site] => sites/default [apcu_ensure_unique_prefix] => [install_profile] => testing ) [_serviceId] => settings ) [translations:protected] => Array ( [en] => Array ( ) [] => Array ( ) ) [_serviceId] => string_translator.custom_strings ) ) ) [sortedTranslators:protected] => Array ( [0] => Drupal\Core\StringTranslation\Translator\CustomStrings Object ( [settings:protected] => Drupal\Core\Site\Settings Object ( [storage:Drupal\Core\Site\Settings:private] => Array ( [hash_salt] => SYcJ3fgYnvykfNUj_C5sQdYrw8Z6OK95ADoHPRouAxyTQcvvlPeLu0wLd9ZJvAcawA3sKElvxg [update_free_access] => [container_yamls] => Array ( [0] => /var/lib/drupaltestbot/sites/default/files/checkout/sites/simpletest/819362/services.yml ) [file_public_path] => sites/simpletest/819362/files [file_private_path] => sites/simpletest/819362/private [test_parent_site] => sites/default [apcu_ensure_unique_prefix] => [install_profile] => testing ) [_serviceId] => settings ) [translations:protected] => Array ( [en] => Array ( ) [] => Array ( ) ) [_serviceId] => string_translator.custom_strings ) ) [defaultLangcode:protected] => en [_serviceId] => string_translation ) [arguments:protected] => Array ( [%field_name] => aoz2kyatja [%widget_type] => field_example_text [%cardinality] => -1 ) ) DebugFieldExampleWebTestBase.php134Drupal\field_example\FieldExampleWebTestBase->createField()
"Updated field aoz2kyatja field settings." foundOtherFieldExampleWebTestBase.php135Drupal\field_example\FieldExampleWebTestBase->createField()
Found the Add another item buttonOtherTextWidgetTest.php91Drupal\field_example\Tests\TextWidgetTest->testMultiValueField()
Found the requested form fields at OtherTextWidgetTest.php91Drupal\field_example\Tests\TextWidgetTest->testMultiValueField()
Failed to set field field_aoz2kyatja[1][value] to #ffffffOtherTextWidgetTest.php98Drupal\field_example\Tests\TextWidgetTest->testMultiValueField()
Found the requested form fields at OtherTextWidgetTest.php98Drupal\field_example\Tests\TextWidgetTest->testMultiValueField()
"pvoaftld3k oPMYE1iSHIGiiETUj9qw has been created" foundOtherTextWidgetTest.php99Drupal\field_example\Tests\TextWidgetTest->testMultiValueField()
Undefined offset: 0Drupal\field_example\Tests\TextWidgetTest->testMultiValueField() Drupal\simpletest\TestBase->run(Array) simpletest_script_run_one_test('7', 'Drupal\field_example\Tests\TextWidgetTest') NoticeTextWidgetTest.php103Drupal\field_example\Tests\TextWidgetTest->testMultiValueField()
Value '' is equal to value 'The color code in this field is #00ff00'.OtherTextWidgetTest.php103Drupal\field_example\Tests\TextWidgetTest->testMultiValueField()
Undefined offset: 1Drupal\field_example\Tests\TextWidgetTest->testMultiValueField() Drupal\simpletest\TestBase->run(Array) simpletest_script_run_one_test('7', 'Drupal\field_example\Tests\TextWidgetTest') NoticeTextWidgetTest.php104Drupal\field_example\Tests\TextWidgetTest->testMultiValueField()
Value '' is equal to value 'The color code in this field is #ffffff'.OtherTextWidgetTest.php104Drupal\field_example\Tests\TextWidgetTest->testMultiValueField()
Declaration of Drupal\field_example\Plugin\Field\FieldFormatter\SimpleTextFormatter::viewElements() must be compatible with Drupal\Core\Field\FormatterInterface::viewElements(Drupal\Core\Field\FieldItemListInterface $items, $langcode)PHP Fatal errorSimpleTextFormatter.php0Unknown
ExpandDrupal\node_type_example\Tests\NodeTypeExampleTest4210
MessageGroupFilenameLineFunctionStatus
Basic page created.OtherNodeTypeExampleTest.php116Drupal\node_type_example\Tests\NodeTypeExampleTest->testNodeTypes()
ExpandDrupal\rest_example\Tests\RestExampleMenuTest011
MessageGroupFilenameLineFunctionStatus
The test did not complete due to a fatal error.Completion checkRestExampleMenuTest.php40Drupal\rest_example\Tests\RestExampleMenuTest->testRestExampleLink()
Drupal\Core\Config\Schema\SchemaIncompleteException: Schema errors for views.view.rest_service with the following errors: views.view.rest_service:display.default.display_options.fields.nid.settings.thousand_separator missing schema, views.view.rest_service:display.default.display_options.fields.nid.settings.prefix_suffix missing schema, views.view.rest_service:display.default.display_options.arguments.nid.validate_options.multiple variable type is string but applied schema class is Drupal\Core\TypedData\Plugin\DataType\IntegerData, views.view.rest_service:display.default.display_options.arguments.nid.validate_options.access variable type is integer but applied schema class is Drupal\Core\TypedData\Plugin\DataType\BooleanData in Drupal\Core\Config\Testing\ConfigSchemaChecker->onConfigSave() (line 98 of /var/lib/drupaltestbot/sites/default/files/checkout/core/lib/Drupal/Core/Config/Testing/ConfigSchemaChecker.php). Drupal\Core\Config\Testing\ConfigSchemaChecker->onConfigSave(Object, 'config.save', Object) Drupal\Component\EventDispatcher\ContainerAwareEventDispatcher->dispatch('config.save', Object) Drupal\Core\Config\Config->save(1) Drupal\Core\Config\Entity\ConfigEntityStorage->doSave('rest_service', Object) Drupal\Core\Entity\EntityStorageBase->save(Object) Drupal\Core\Config\Entity\ConfigEntityStorage->save(Object) Drupal\Core\Entity\Entity->save() Drupal\Core\Config\Entity\ConfigEntityBase->save() Drupal\Core\Config\ConfigInstaller->createConfiguration('', Array) Drupal\Core\Config\ConfigInstaller->installDefaultConfig('module', 'rest_example') Drupal\Core\ProxyClass\Config\ConfigInstaller->installDefaultConfig('module', 'rest_example') Drupal\Core\Extension\ModuleInstaller->install(Array, 1) Drupal\Core\ProxyClass\Extension\ModuleInstaller->install(Array, 1) Drupal\simpletest\WebTestBase->installModulesFromClassProperty(Object) Drupal\simpletest\WebTestBase->setUp() Drupal\simpletest\TestBase->run(Array) simpletest_script_run_one_test('24', 'Drupal\rest_example\Tests\RestExampleMenuTest') Uncaught exceptionConfigSchemaChecker.php98Drupal\Core\Config\Testing\ConfigSchemaChecker->onConfigSave()
ExpandDrupal\simpletest_example\Tests\SimpleTestExampleMockModuleTest1201
MessageGroupFilenameLineFunctionStatus
Missing argument 5 for simpletest_example_test_node_view()Warningsimpletest_example_test.module29simpletest_example_test_node_view()
ExpandDrupal\simpletest_example\Tests\SimpleTestExampleTest3320
MessageGroupFilenameLineFunctionStatus
SimpleTest Example content created.OtherSimpleTestExampleTest.php94Drupal\simpletest_example\Tests\SimpleTestExampleTest->testSimpleTestExampleCreate()
"Submitted by gdSDeSBY on Thu, 10/08/2015 - 03:34" foundOtherSimpleTestExampleTest.php108Drupal\simpletest_example\Tests\SimpleTestExampleTest->testSimpleTestExampleCreate()

All

Test namePassFailException
LeafDrupal\block_example\Tests\BlockExampleMenuTest800
LeafDrupal\block_example\Tests\BlockExampleTest2700
LeafDrupal\cache_example\Tests\CacheExampleTestCase5900
LeafDrupal\config_entity_example\Tests\ConfigEntityExampleTest7100
ExpandDrupal\content_entity_example\Tests\ContentEntityExampleTest22320
MessageGroupFilenameLineFunctionStatus
"test name" foundOtherContentEntityExampleTest.php78Drupal\content_entity_example\Tests\ContentEntityExampleTest->testContentEntityExample()
"Contact Settings" foundOtherContentEntityExampleTest.php97Drupal\content_entity_example\Tests\ContentEntityExampleTest->testContentEntityExample()
LeafDrupal\cron_example\Tests\CronExampleTestCase3500
LeafDrupal\dbtng_example\Tests\DBTNGExampleTest5900
LeafDrupal\email_example\Tests\EmailExampleTest2100
LeafDrupal\examples\Tests\ExamplesTest2000
LeafDrupal\field_example\Tests\FieldExampleMenuTest800
ExpandDrupal\field_example\Tests\Text3WidgetTest104145
MessageGroupFilenameLineFunctionStatus
simplexml_import_dom(): Invalid Nodetype to importsimplexml_import_dom(Object) Drupal\simpletest\WebTestBase->parse() Drupal\simpletest\WebTestBase->drupalPostForm(NULL, Array, Object) Drupal\field_example\FieldExampleWebTestBase->createField('field_example_rgb', 'field_example_3text', '1') Drupal\field_example\Tests\Text3WidgetTest->testSingleValueField() Drupal\simpletest\TestBase->run(Array) simpletest_script_run_one_test('8', 'Drupal\field_example\Tests\Text3WidgetTest') WarningAssertContentTrait.php138Drupal\simpletest\WebTestBase->parse()
Drupal\Core\StringTranslation\TranslatableMarkup Object ( [string:protected] => Saved settings for field %field_name with widget %widget_type and cardinality %cardinality [translatedMarkup:protected] => [options:protected] => Array ( ) [stringTranslation:protected] => Drupal\Core\StringTranslation\TranslationManager Object ( [translators:protected] => Array ( [30] => Array ( [0] => Drupal\Core\StringTranslation\Translator\CustomStrings Object ( [settings:protected] => Drupal\Core\Site\Settings Object ( [storage:Drupal\Core\Site\Settings:private] => Array ( [hash_salt] => qtJmJTXpGWjV1Vh2B1BrWid3qdUABzt22XCTPp4fwYPVM7ewGr70MbkXZtSnzn2N21cdYZA9-Q [update_free_access] => [container_yamls] => Array ( [0] => /var/lib/drupaltestbot/sites/default/files/checkout/sites/simpletest/821501/services.yml ) [file_public_path] => sites/simpletest/821501/files [file_private_path] => sites/simpletest/821501/private [test_parent_site] => sites/default [apcu_ensure_unique_prefix] => [install_profile] => testing ) [_serviceId] => settings ) [translations:protected] => Array ( [en] => Array ( ) [] => Array ( ) ) [_serviceId] => string_translator.custom_strings ) ) ) [sortedTranslators:protected] => Array ( [0] => Drupal\Core\StringTranslation\Translator\CustomStrings Object ( [settings:protected] => Drupal\Core\Site\Settings Object ( [storage:Drupal\Core\Site\Settings:private] => Array ( [hash_salt] => qtJmJTXpGWjV1Vh2B1BrWid3qdUABzt22XCTPp4fwYPVM7ewGr70MbkXZtSnzn2N21cdYZA9-Q [update_free_access] => [container_yamls] => Array ( [0] => /var/lib/drupaltestbot/sites/default/files/checkout/sites/simpletest/821501/services.yml ) [file_public_path] => sites/simpletest/821501/files [file_private_path] => sites/simpletest/821501/private [test_parent_site] => sites/default [apcu_ensure_unique_prefix] => [install_profile] => testing ) [_serviceId] => settings ) [translations:protected] => Array ( [en] => Array ( ) [] => Array ( ) ) [_serviceId] => string_translator.custom_strings ) ) [defaultLangcode:protected] => en [_serviceId] => string_translation ) [arguments:protected] => Array ( [%field_name] => lkg7uvrwz2 [%widget_type] => field_example_3text [%cardinality] => 1 ) ) DebugFieldExampleWebTestBase.php134Drupal\field_example\FieldExampleWebTestBase->createField()
"Updated field lkg7uvrwz2 field settings." foundOtherFieldExampleWebTestBase.php135Drupal\field_example\FieldExampleWebTestBase->createField()
Undefined offset: 0Drupal\field_example\Tests\Text3WidgetTest->testSingleValueField() Drupal\simpletest\TestBase->run(Array) simpletest_script_run_one_test('8', 'Drupal\field_example\Tests\Text3WidgetTest') NoticeText3WidgetTest.php58Drupal\field_example\Tests\Text3WidgetTest->testSingleValueField()
Value '' is equal to value 'The color code in this field is #000a01'.OtherText3WidgetTest.php58Drupal\field_example\Tests\Text3WidgetTest->testSingleValueField()
Declaration of Drupal\field_example\Plugin\Field\FieldFormatter\SimpleTextFormatter::viewElements() must be compatible with Drupal\Core\Field\FormatterInterface::viewElements(Drupal\Core\Field\FieldItemListInterface $items, $langcode)PHP Fatal errorSimpleTextFormatter.php0Unknown
simplexml_import_dom(): Invalid Nodetype to importsimplexml_import_dom(Object) Drupal\simpletest\WebTestBase->parse() Drupal\simpletest\WebTestBase->drupalPostForm(NULL, Array, Object) Drupal\field_example\FieldExampleWebTestBase->createField('field_example_rgb', 'field_example_3text', '-1') Drupal\field_example\Tests\Text3WidgetTest->testMultiValueField() Drupal\simpletest\TestBase->run(Array) simpletest_script_run_one_test('8', 'Drupal\field_example\Tests\Text3WidgetTest') WarningAssertContentTrait.php138Drupal\simpletest\WebTestBase->parse()
Drupal\Core\StringTranslation\TranslatableMarkup Object ( [string:protected] => Saved settings for field %field_name with widget %widget_type and cardinality %cardinality [translatedMarkup:protected] => [options:protected] => Array ( ) [stringTranslation:protected] => Drupal\Core\StringTranslation\TranslationManager Object ( [translators:protected] => Array ( [30] => Array ( [0] => Drupal\Core\StringTranslation\Translator\CustomStrings Object ( [settings:protected] => Drupal\Core\Site\Settings Object ( [storage:Drupal\Core\Site\Settings:private] => Array ( [hash_salt] => K8eX1ypFakkKAEk7PTiMCDbNkSkfO-tvdmhKpBLpRGyujJXETNCkzUhZr4zhHGCaC9QPM1GrVg [update_free_access] => [container_yamls] => Array ( [0] => /var/lib/drupaltestbot/sites/default/files/checkout/sites/simpletest/886347/services.yml ) [file_public_path] => sites/simpletest/886347/files [file_private_path] => sites/simpletest/886347/private [test_parent_site] => sites/default [apcu_ensure_unique_prefix] => [install_profile] => testing ) [_serviceId] => settings ) [translations:protected] => Array ( [en] => Array ( ) [] => Array ( ) ) [_serviceId] => string_translator.custom_strings ) ) ) [sortedTranslators:protected] => Array ( [0] => Drupal\Core\StringTranslation\Translator\CustomStrings Object ( [settings:protected] => Drupal\Core\Site\Settings Object ( [storage:Drupal\Core\Site\Settings:private] => Array ( [hash_salt] => K8eX1ypFakkKAEk7PTiMCDbNkSkfO-tvdmhKpBLpRGyujJXETNCkzUhZr4zhHGCaC9QPM1GrVg [update_free_access] => [container_yamls] => Array ( [0] => /var/lib/drupaltestbot/sites/default/files/checkout/sites/simpletest/886347/services.yml ) [file_public_path] => sites/simpletest/886347/files [file_private_path] => sites/simpletest/886347/private [test_parent_site] => sites/default [apcu_ensure_unique_prefix] => [install_profile] => testing ) [_serviceId] => settings ) [translations:protected] => Array ( [en] => Array ( ) [] => Array ( ) ) [_serviceId] => string_translator.custom_strings ) ) [defaultLangcode:protected] => en [_serviceId] => string_translation ) [arguments:protected] => Array ( [%field_name] => mexzrp2mtf [%widget_type] => field_example_3text [%cardinality] => -1 ) ) DebugFieldExampleWebTestBase.php134Drupal\field_example\FieldExampleWebTestBase->createField()
"Updated field mexzrp2mtf field settings." foundOtherFieldExampleWebTestBase.php135Drupal\field_example\FieldExampleWebTestBase->createField()
Found the Add another item buttonOtherText3WidgetTest.php91Drupal\field_example\Tests\Text3WidgetTest->testMultiValueField()
Found the requested form fields at OtherText3WidgetTest.php91Drupal\field_example\Tests\Text3WidgetTest->testMultiValueField()
Failed to set field field_mexzrp2mtf[1][value][r] to ffOtherText3WidgetTest.php99Drupal\field_example\Tests\Text3WidgetTest->testMultiValueField()
Failed to set field field_mexzrp2mtf[1][value][g] to ffOtherText3WidgetTest.php99Drupal\field_example\Tests\Text3WidgetTest->testMultiValueField()
Failed to set field field_mexzrp2mtf[1][value][b] to ffOtherText3WidgetTest.php99Drupal\field_example\Tests\Text3WidgetTest->testMultiValueField()
Found the requested form fields at OtherText3WidgetTest.php99Drupal\field_example\Tests\Text3WidgetTest->testMultiValueField()
"rjrjegud6g nwndFbXl0heAxCgrXhSe has been created" foundOtherText3WidgetTest.php100Drupal\field_example\Tests\Text3WidgetTest->testMultiValueField()
Undefined offset: 0Drupal\field_example\Tests\Text3WidgetTest->testMultiValueField() Drupal\simpletest\TestBase->run(Array) simpletest_script_run_one_test('8', 'Drupal\field_example\Tests\Text3WidgetTest') NoticeText3WidgetTest.php104Drupal\field_example\Tests\Text3WidgetTest->testMultiValueField()
Value '' is equal to value 'The color code in this field is #00ff00'.OtherText3WidgetTest.php104Drupal\field_example\Tests\Text3WidgetTest->testMultiValueField()
Undefined offset: 1Drupal\field_example\Tests\Text3WidgetTest->testMultiValueField() Drupal\simpletest\TestBase->run(Array) simpletest_script_run_one_test('8', 'Drupal\field_example\Tests\Text3WidgetTest') NoticeText3WidgetTest.php105Drupal\field_example\Tests\Text3WidgetTest->testMultiValueField()
Value '' is equal to value 'The color code in this field is #ffffff'.OtherText3WidgetTest.php105Drupal\field_example\Tests\Text3WidgetTest->testMultiValueField()
Declaration of Drupal\field_example\Plugin\Field\FieldFormatter\SimpleTextFormatter::viewElements() must be compatible with Drupal\Core\Field\FormatterInterface::viewElements(Drupal\Core\Field\FieldItemListInterface $items, $langcode)PHP Fatal errorSimpleTextFormatter.php0Unknown
ExpandDrupal\field_example\Tests\TextWidgetTest104125
MessageGroupFilenameLineFunctionStatus
simplexml_import_dom(): Invalid Nodetype to importsimplexml_import_dom(Object) Drupal\simpletest\WebTestBase->parse() Drupal\simpletest\WebTestBase->drupalPostForm(NULL, Array, Object) Drupal\field_example\FieldExampleWebTestBase->createField('field_example_rgb', 'field_example_text', '1') Drupal\field_example\Tests\TextWidgetTest->testSingleValueField() Drupal\simpletest\TestBase->run(Array) simpletest_script_run_one_test('7', 'Drupal\field_example\Tests\TextWidgetTest') WarningAssertContentTrait.php138Drupal\simpletest\WebTestBase->parse()
Drupal\Core\StringTranslation\TranslatableMarkup Object ( [string:protected] => Saved settings for field %field_name with widget %widget_type and cardinality %cardinality [translatedMarkup:protected] => [options:protected] => Array ( ) [stringTranslation:protected] => Drupal\Core\StringTranslation\TranslationManager Object ( [translators:protected] => Array ( [30] => Array ( [0] => Drupal\Core\StringTranslation\Translator\CustomStrings Object ( [settings:protected] => Drupal\Core\Site\Settings Object ( [storage:Drupal\Core\Site\Settings:private] => Array ( [hash_salt] => vsrhAZdC34UOw0e_sVT_awqKpOsGzwHUyR7rHiP8kwX5gqPRyW6XeOMc8WG3H0s_DdgI3TX-zw [update_free_access] => [container_yamls] => Array ( [0] => /var/lib/drupaltestbot/sites/default/files/checkout/sites/simpletest/296494/services.yml ) [file_public_path] => sites/simpletest/296494/files [file_private_path] => sites/simpletest/296494/private [test_parent_site] => sites/default [apcu_ensure_unique_prefix] => [install_profile] => testing ) [_serviceId] => settings ) [translations:protected] => Array ( [en] => Array ( ) [] => Array ( ) ) [_serviceId] => string_translator.custom_strings ) ) ) [sortedTranslators:protected] => Array ( [0] => Drupal\Core\StringTranslation\Translator\CustomStrings Object ( [settings:protected] => Drupal\Core\Site\Settings Object ( [storage:Drupal\Core\Site\Settings:private] => Array ( [hash_salt] => vsrhAZdC34UOw0e_sVT_awqKpOsGzwHUyR7rHiP8kwX5gqPRyW6XeOMc8WG3H0s_DdgI3TX-zw [update_free_access] => [container_yamls] => Array ( [0] => /var/lib/drupaltestbot/sites/default/files/checkout/sites/simpletest/296494/services.yml ) [file_public_path] => sites/simpletest/296494/files [file_private_path] => sites/simpletest/296494/private [test_parent_site] => sites/default [apcu_ensure_unique_prefix] => [install_profile] => testing ) [_serviceId] => settings ) [translations:protected] => Array ( [en] => Array ( ) [] => Array ( ) ) [_serviceId] => string_translator.custom_strings ) ) [defaultLangcode:protected] => en [_serviceId] => string_translation ) [arguments:protected] => Array ( [%field_name] => pbqghqvuf8 [%widget_type] => field_example_text [%cardinality] => 1 ) ) DebugFieldExampleWebTestBase.php134Drupal\field_example\FieldExampleWebTestBase->createField()
"Updated field pbqghqvuf8 field settings." foundOtherFieldExampleWebTestBase.php135Drupal\field_example\FieldExampleWebTestBase->createField()
Undefined offset: 0Drupal\field_example\Tests\TextWidgetTest->testSingleValueField() Drupal\simpletest\TestBase->run(Array) simpletest_script_run_one_test('7', 'Drupal\field_example\Tests\TextWidgetTest') NoticeTextWidgetTest.php59Drupal\field_example\Tests\TextWidgetTest->testSingleValueField()
Value '' is equal to value 'The color code in this field is #000001'.OtherTextWidgetTest.php59Drupal\field_example\Tests\TextWidgetTest->testSingleValueField()
Declaration of Drupal\field_example\Plugin\Field\FieldFormatter\SimpleTextFormatter::viewElements() must be compatible with Drupal\Core\Field\FormatterInterface::viewElements(Drupal\Core\Field\FieldItemListInterface $items, $langcode)PHP Fatal errorSimpleTextFormatter.php0Unknown
simplexml_import_dom(): Invalid Nodetype to importsimplexml_import_dom(Object) Drupal\simpletest\WebTestBase->parse() Drupal\simpletest\WebTestBase->drupalPostForm(NULL, Array, Object) Drupal\field_example\FieldExampleWebTestBase->createField('field_example_rgb', 'field_example_text', '-1') Drupal\field_example\Tests\TextWidgetTest->testMultiValueField() Drupal\simpletest\TestBase->run(Array) simpletest_script_run_one_test('7', 'Drupal\field_example\Tests\TextWidgetTest') WarningAssertContentTrait.php138Drupal\simpletest\WebTestBase->parse()
Drupal\Core\StringTranslation\TranslatableMarkup Object ( [string:protected] => Saved settings for field %field_name with widget %widget_type and cardinality %cardinality [translatedMarkup:protected] => [options:protected] => Array ( ) [stringTranslation:protected] => Drupal\Core\StringTranslation\TranslationManager Object ( [translators:protected] => Array ( [30] => Array ( [0] => Drupal\Core\StringTranslation\Translator\CustomStrings Object ( [settings:protected] => Drupal\Core\Site\Settings Object ( [storage:Drupal\Core\Site\Settings:private] => Array ( [hash_salt] => SYcJ3fgYnvykfNUj_C5sQdYrw8Z6OK95ADoHPRouAxyTQcvvlPeLu0wLd9ZJvAcawA3sKElvxg [update_free_access] => [container_yamls] => Array ( [0] => /var/lib/drupaltestbot/sites/default/files/checkout/sites/simpletest/819362/services.yml ) [file_public_path] => sites/simpletest/819362/files [file_private_path] => sites/simpletest/819362/private [test_parent_site] => sites/default [apcu_ensure_unique_prefix] => [install_profile] => testing ) [_serviceId] => settings ) [translations:protected] => Array ( [en] => Array ( ) [] => Array ( ) ) [_serviceId] => string_translator.custom_strings ) ) ) [sortedTranslators:protected] => Array ( [0] => Drupal\Core\StringTranslation\Translator\CustomStrings Object ( [settings:protected] => Drupal\Core\Site\Settings Object ( [storage:Drupal\Core\Site\Settings:private] => Array ( [hash_salt] => SYcJ3fgYnvykfNUj_C5sQdYrw8Z6OK95ADoHPRouAxyTQcvvlPeLu0wLd9ZJvAcawA3sKElvxg [update_free_access] => [container_yamls] => Array ( [0] => /var/lib/drupaltestbot/sites/default/files/checkout/sites/simpletest/819362/services.yml ) [file_public_path] => sites/simpletest/819362/files [file_private_path] => sites/simpletest/819362/private [test_parent_site] => sites/default [apcu_ensure_unique_prefix] => [install_profile] => testing ) [_serviceId] => settings ) [translations:protected] => Array ( [en] => Array ( ) [] => Array ( ) ) [_serviceId] => string_translator.custom_strings ) ) [defaultLangcode:protected] => en [_serviceId] => string_translation ) [arguments:protected] => Array ( [%field_name] => aoz2kyatja [%widget_type] => field_example_text [%cardinality] => -1 ) ) DebugFieldExampleWebTestBase.php134Drupal\field_example\FieldExampleWebTestBase->createField()
"Updated field aoz2kyatja field settings." foundOtherFieldExampleWebTestBase.php135Drupal\field_example\FieldExampleWebTestBase->createField()
Found the Add another item buttonOtherTextWidgetTest.php91Drupal\field_example\Tests\TextWidgetTest->testMultiValueField()
Found the requested form fields at OtherTextWidgetTest.php91Drupal\field_example\Tests\TextWidgetTest->testMultiValueField()
Failed to set field field_aoz2kyatja[1][value] to #ffffffOtherTextWidgetTest.php98Drupal\field_example\Tests\TextWidgetTest->testMultiValueField()
Found the requested form fields at OtherTextWidgetTest.php98Drupal\field_example\Tests\TextWidgetTest->testMultiValueField()
"pvoaftld3k oPMYE1iSHIGiiETUj9qw has been created" foundOtherTextWidgetTest.php99Drupal\field_example\Tests\TextWidgetTest->testMultiValueField()
Undefined offset: 0Drupal\field_example\Tests\TextWidgetTest->testMultiValueField() Drupal\simpletest\TestBase->run(Array) simpletest_script_run_one_test('7', 'Drupal\field_example\Tests\TextWidgetTest') NoticeTextWidgetTest.php103Drupal\field_example\Tests\TextWidgetTest->testMultiValueField()
Value '' is equal to value 'The color code in this field is #00ff00'.OtherTextWidgetTest.php103Drupal\field_example\Tests\TextWidgetTest->testMultiValueField()
Undefined offset: 1Drupal\field_example\Tests\TextWidgetTest->testMultiValueField() Drupal\simpletest\TestBase->run(Array) simpletest_script_run_one_test('7', 'Drupal\field_example\Tests\TextWidgetTest') NoticeTextWidgetTest.php104Drupal\field_example\Tests\TextWidgetTest->testMultiValueField()
Value '' is equal to value 'The color code in this field is #ffffff'.OtherTextWidgetTest.php104Drupal\field_example\Tests\TextWidgetTest->testMultiValueField()
Declaration of Drupal\field_example\Plugin\Field\FieldFormatter\SimpleTextFormatter::viewElements() must be compatible with Drupal\Core\Field\FormatterInterface::viewElements(Drupal\Core\Field\FieldItemListInterface $items, $langcode)PHP Fatal errorSimpleTextFormatter.php0Unknown
LeafDrupal\js_example\Tests\JsExampleTest1000
ExpandDrupal\node_type_example\Tests\NodeTypeExampleTest4210
MessageGroupFilenameLineFunctionStatus
Basic page created.OtherNodeTypeExampleTest.php116Drupal\node_type_example\Tests\NodeTypeExampleTest->testNodeTypes()
LeafDrupal\page_example\Tests\PageExampleTest9000
LeafDrupal\phpunit_example\Tests\PHPUnitExampleMenuTest800
ExpandDrupal\rest_example\Tests\RestExampleMenuTest011
MessageGroupFilenameLineFunctionStatus
The test did not complete due to a fatal error.Completion checkRestExampleMenuTest.php40Drupal\rest_example\Tests\RestExampleMenuTest->testRestExampleLink()
Drupal\Core\Config\Schema\SchemaIncompleteException: Schema errors for views.view.rest_service with the following errors: views.view.rest_service:display.default.display_options.fields.nid.settings.thousand_separator missing schema, views.view.rest_service:display.default.display_options.fields.nid.settings.prefix_suffix missing schema, views.view.rest_service:display.default.display_options.arguments.nid.validate_options.multiple variable type is string but applied schema class is Drupal\Core\TypedData\Plugin\DataType\IntegerData, views.view.rest_service:display.default.display_options.arguments.nid.validate_options.access variable type is integer but applied schema class is Drupal\Core\TypedData\Plugin\DataType\BooleanData in Drupal\Core\Config\Testing\ConfigSchemaChecker->onConfigSave() (line 98 of /var/lib/drupaltestbot/sites/default/files/checkout/core/lib/Drupal/Core/Config/Testing/ConfigSchemaChecker.php). Drupal\Core\Config\Testing\ConfigSchemaChecker->onConfigSave(Object, 'config.save', Object) Drupal\Component\EventDispatcher\ContainerAwareEventDispatcher->dispatch('config.save', Object) Drupal\Core\Config\Config->save(1) Drupal\Core\Config\Entity\ConfigEntityStorage->doSave('rest_service', Object) Drupal\Core\Entity\EntityStorageBase->save(Object) Drupal\Core\Config\Entity\ConfigEntityStorage->save(Object) Drupal\Core\Entity\Entity->save() Drupal\Core\Config\Entity\ConfigEntityBase->save() Drupal\Core\Config\ConfigInstaller->createConfiguration('', Array) Drupal\Core\Config\ConfigInstaller->installDefaultConfig('module', 'rest_example') Drupal\Core\ProxyClass\Config\ConfigInstaller->installDefaultConfig('module', 'rest_example') Drupal\Core\Extension\ModuleInstaller->install(Array, 1) Drupal\Core\ProxyClass\Extension\ModuleInstaller->install(Array, 1) Drupal\simpletest\WebTestBase->installModulesFromClassProperty(Object) Drupal\simpletest\WebTestBase->setUp() Drupal\simpletest\TestBase->run(Array) simpletest_script_run_one_test('24', 'Drupal\rest_example\Tests\RestExampleMenuTest') Uncaught exceptionConfigSchemaChecker.php98Drupal\Core\Config\Testing\ConfigSchemaChecker->onConfigSave()
ExpandDrupal\simpletest_example\Tests\SimpleTestExampleMockModuleTest1201
MessageGroupFilenameLineFunctionStatus
Missing argument 5 for simpletest_example_test_node_view()Warningsimpletest_example_test.module29simpletest_example_test_node_view()
ExpandDrupal\simpletest_example\Tests\SimpleTestExampleTest3320
MessageGroupFilenameLineFunctionStatus
SimpleTest Example content created.OtherSimpleTestExampleTest.php94Drupal\simpletest_example\Tests\SimpleTestExampleTest->testSimpleTestExampleCreate()
"Submitted by gdSDeSBY on Thu, 10/08/2015 - 03:34" foundOtherSimpleTestExampleTest.php108Drupal\simpletest_example\Tests\SimpleTestExampleTest->testSimpleTestExampleCreate()
LeafDrupal\tablesort_example\Tests\TableSortExampleTest2700
LeafDrupal\Tests\phpunit_example\Unit\AddClassTest2700
LeafDrupal\Tests\phpunit_example\Unit\DisplayManagerTest100
LeafDrupal\Tests\phpunit_example\Unit\ProtectedPrivatesTest400
LeafDrupal\tour_example\Tests\TourExampleTest3000