2581697-12.patch

Test status
StatusResult
Last receivedWed, 10/07/2015 - 14:31:00
Last requestedWed, 10/07/2015 - 15:00:49
Last testedWed, 10/07/2015 - 15:06:40
Test count1
Environment status
PHP 5.5 MySQLfail
File information
File2581697-12.patch
BranchMonitoring - 8.x-1.x
LinkIssue Link
SummaryFAILED: [[SimpleTest]]: [PHP 5.5 MySQL] 1,945 pass(es), 13 fail(s), and 2 exception(s).
Details

PHP 5.5 MySQL

  1. Setup environment
  2. Detect an invalid patch URL
  3. Detect invalid repository information
  4. Detect invalid patch format
  5. Detect a non-applicable patch
  6. Detect invalid PHP syntax
  7. Detect a Drupal installation failure
  8. Detect a test run failure
  9. Detect a failing test
    Review the test failures below then if necessary run them locally until the problem has been fixed.
  10. Complete test suite with all tests passing
1,945 pass(es), 13 fail(s), and 2 exception(s)

Non-pass

Test namePassFailException
ExpandDrupal\monitoring\Tests\MonitoringCoreKernelTest15901
MessageGroupFilenameLineFunctionStatus
Drupal\monitoring\Sensor\NonExistingSensorException: Sensor core_cron_safe_threshold does not exist in Drupal\monitoring\Sensor\SensorManager->getSensorConfigByName() (line 127 of /var/lib/drupaltestbot/sites/default/files/checkout/sites/default/modules/monitoring/src/Sensor/SensorManager.php). Drupal\monitoring\Sensor\SensorManager->getSensorConfigByName('core_cron_safe_threshold') Drupal\monitoring\Sensor\SensorManager->enableSensor('core_cron_safe_threshold') Drupal\monitoring\Tests\MonitoringUnitTestBase->runSensor('core_cron_safe_threshold') Drupal\monitoring\Tests\MonitoringCoreKernelTest->testConfigValueSensorPluginCronSafeThreshold() Drupal\simpletest\TestBase->run(Array) simpletest_script_run_one_test('7', 'Drupal\monitoring\Tests\MonitoringCoreKernelTest') Uncaught exceptionSensorManager.php127Drupal\monitoring\Sensor\SensorManager->getSensorConfigByName()
ExpandDrupal\monitoring\Tests\MonitoringUITest774131
MessageGroupFilenameLineFunctionStatus
Drupal\monitoring\Sensor\NonExistingSensorException: Sensor core_cron_safe_threshold does not exist in Drupal\monitoring\Sensor\SensorManager->getSensorConfigByName() (line 127 of /var/lib/drupaltestbot/sites/default/files/checkout/sites/default/modules/monitoring/src/Sensor/SensorManager.php). Drupal\monitoring\Sensor\SensorManager->getSensorConfigByName('core_cron_safe_threshold') Drupal\monitoring\Sensor\SensorManager->enableSensor('core_cron_safe_threshold') Drupal\monitoring\Tests\MonitoringUITest->testSensorCreation() Drupal\simpletest\TestBase->run(Array) simpletest_script_run_one_test('5', 'Drupal\monitoring\Tests\MonitoringUITest') Uncaught exceptionSensorManager.php127Drupal\monitoring\Sensor\SensorManager->getSensorConfigByName()
"FALSE" foundOtherMonitoringUITest.php551Drupal\monitoring\Tests\MonitoringUITest->testSensorDetailPage()
Link with label Delete found.OtherMonitoringUITest.php622Drupal\monitoring\Tests\MonitoringUITest->testSensorEditPage()
Checkbox field edit-settings-value is not checked.BrowserMonitoringUITest.php623Drupal\monitoring\Tests\MonitoringUITest->testSensorEditPage()
Failed to set field settings[value] to CheckedOtherMonitoringUITest.php624Drupal\monitoring\Tests\MonitoringUITest->testSensorEditPage()
Found the Save buttonOtherMonitoringUITest.php624Drupal\monitoring\Tests\MonitoringUITest->testSensorEditPage()
Found the requested form fields at OtherMonitoringUITest.php624Drupal\monitoring\Tests\MonitoringUITest->testSensorEditPage()
Checkbox field edit-settings-value is checked.BrowserMonitoringUITest.php627Drupal\monitoring\Tests\MonitoringUITest->testSensorEditPage()
Link with label Details found.OtherMonitoringUITest.php630Drupal\monitoring\Tests\MonitoringUITest->testSensorEditPage()
Link Details does not exist on http://ec2-52-88-136-72.us-west-2.compute.amazonaws.com/checkout/admin/config/system/monitoring/sensors/core_cron_safe_thresholdBrowserMonitoringUITest.php631Drupal\monitoring\Tests\MonitoringUITest->testSensorEditPage()
"Result" foundOtherMonitoringUITest.php632Drupal\monitoring\Tests\MonitoringUITest->testSensorEditPage()
Link with label Edit found.OtherMonitoringUITest.php634Drupal\monitoring\Tests\MonitoringUITest->testSensorEditPage()
Link Edit does not exist on http://ec2-52-88-136-72.us-west-2.compute.amazonaws.com/checkout/admin/config/system/monitoring/sensors/core_cron_safe_thresholdBrowserMonitoringUITest.php635Drupal\monitoring\Tests\MonitoringUITest->testSensorEditPage()
"Sensor plugin settings" foundOtherMonitoringUITest.php636Drupal\monitoring\Tests\MonitoringUITest->testSensorEditPage()

All

Test namePassFailException
LeafDrupal\monitoring\Tests\MonitoringApiTest8100
LeafDrupal\monitoring\Tests\MonitoringCaptchaTest1900
ExpandDrupal\monitoring\Tests\MonitoringCoreKernelTest15901
MessageGroupFilenameLineFunctionStatus
Drupal\monitoring\Sensor\NonExistingSensorException: Sensor core_cron_safe_threshold does not exist in Drupal\monitoring\Sensor\SensorManager->getSensorConfigByName() (line 127 of /var/lib/drupaltestbot/sites/default/files/checkout/sites/default/modules/monitoring/src/Sensor/SensorManager.php). Drupal\monitoring\Sensor\SensorManager->getSensorConfigByName('core_cron_safe_threshold') Drupal\monitoring\Sensor\SensorManager->enableSensor('core_cron_safe_threshold') Drupal\monitoring\Tests\MonitoringUnitTestBase->runSensor('core_cron_safe_threshold') Drupal\monitoring\Tests\MonitoringCoreKernelTest->testConfigValueSensorPluginCronSafeThreshold() Drupal\simpletest\TestBase->run(Array) simpletest_script_run_one_test('7', 'Drupal\monitoring\Tests\MonitoringCoreKernelTest') Uncaught exceptionSensorManager.php127Drupal\monitoring\Sensor\SensorManager->getSensorConfigByName()
LeafDrupal\monitoring\Tests\MonitoringCoreWebTest18500
LeafDrupal\monitoring\Tests\MonitoringPastTest1300
LeafDrupal\monitoring\Tests\MonitoringSearchAPITest1100
LeafDrupal\monitoring\Tests\MonitoringServicesTest57200
ExpandDrupal\monitoring\Tests\MonitoringUITest774131
MessageGroupFilenameLineFunctionStatus
Drupal\monitoring\Sensor\NonExistingSensorException: Sensor core_cron_safe_threshold does not exist in Drupal\monitoring\Sensor\SensorManager->getSensorConfigByName() (line 127 of /var/lib/drupaltestbot/sites/default/files/checkout/sites/default/modules/monitoring/src/Sensor/SensorManager.php). Drupal\monitoring\Sensor\SensorManager->getSensorConfigByName('core_cron_safe_threshold') Drupal\monitoring\Sensor\SensorManager->enableSensor('core_cron_safe_threshold') Drupal\monitoring\Tests\MonitoringUITest->testSensorCreation() Drupal\simpletest\TestBase->run(Array) simpletest_script_run_one_test('5', 'Drupal\monitoring\Tests\MonitoringUITest') Uncaught exceptionSensorManager.php127Drupal\monitoring\Sensor\SensorManager->getSensorConfigByName()
"FALSE" foundOtherMonitoringUITest.php551Drupal\monitoring\Tests\MonitoringUITest->testSensorDetailPage()
Link with label Delete found.OtherMonitoringUITest.php622Drupal\monitoring\Tests\MonitoringUITest->testSensorEditPage()
Checkbox field edit-settings-value is not checked.BrowserMonitoringUITest.php623Drupal\monitoring\Tests\MonitoringUITest->testSensorEditPage()
Failed to set field settings[value] to CheckedOtherMonitoringUITest.php624Drupal\monitoring\Tests\MonitoringUITest->testSensorEditPage()
Found the Save buttonOtherMonitoringUITest.php624Drupal\monitoring\Tests\MonitoringUITest->testSensorEditPage()
Found the requested form fields at OtherMonitoringUITest.php624Drupal\monitoring\Tests\MonitoringUITest->testSensorEditPage()
Checkbox field edit-settings-value is checked.BrowserMonitoringUITest.php627Drupal\monitoring\Tests\MonitoringUITest->testSensorEditPage()
Link with label Details found.OtherMonitoringUITest.php630Drupal\monitoring\Tests\MonitoringUITest->testSensorEditPage()
Link Details does not exist on http://ec2-52-88-136-72.us-west-2.compute.amazonaws.com/checkout/admin/config/system/monitoring/sensors/core_cron_safe_thresholdBrowserMonitoringUITest.php631Drupal\monitoring\Tests\MonitoringUITest->testSensorEditPage()
"Result" foundOtherMonitoringUITest.php632Drupal\monitoring\Tests\MonitoringUITest->testSensorEditPage()
Link with label Edit found.OtherMonitoringUITest.php634Drupal\monitoring\Tests\MonitoringUITest->testSensorEditPage()
Link Edit does not exist on http://ec2-52-88-136-72.us-west-2.compute.amazonaws.com/checkout/admin/config/system/monitoring/sensors/core_cron_safe_thresholdBrowserMonitoringUITest.php635Drupal\monitoring\Tests\MonitoringUITest->testSensorEditPage()
"Sensor plugin settings" foundOtherMonitoringUITest.php636Drupal\monitoring\Tests\MonitoringUITest->testSensorEditPage()
LeafDrupal\monitoring\Tests\MonitoringViewDisplayTest2900
LeafDrupal\monitoring_demo\Tests\MonitoringDemoTest1200
LeafDrupal\monitoring_multigraph\Tests\MultigraphServicesTest2600
LeafDrupal\monitoring_multigraph\Tests\MultigraphWebTest6400