2581187.flag_.new-admin-ui-test-11.patch

Test status
StatusResult
Last receivedWed, 10/07/2015 - 13:47:00
Last requestedWed, 10/07/2015 - 14:12:36
Last testedWed, 10/07/2015 - 14:13:18
Test count1
Environment status
PHP 5.5 MySQLfail
File information
File2581187.flag_.new-admin-ui-test-11.patch
BranchFlag - 8.x-4.x
LinkIssue Link
SummaryFAILED: [[SimpleTest]]: [PHP 5.5 MySQL] 458 pass(es), 20 fail(s), and 1 exception(s).
Details

PHP 5.5 MySQL

  1. Setup environment
  2. Detect an invalid patch URL
  3. Detect invalid repository information
  4. Detect invalid patch format
  5. Detect a non-applicable patch
  6. Detect invalid PHP syntax
  7. Detect a Drupal installation failure
  8. Detect a test run failure
  9. Detect a failing test
    Review the test failures below then if necessary run them locally until the problem has been fixed.
  10. Complete test suite with all tests passing
458 pass(es), 20 fail(s), and 1 exception(s)

Non-pass

Test namePassFailException
ExpandDrupal\flag\Tests\AdminUI1001
MessageGroupFilenameLineFunctionStatus
Drupal\Core\Entity\EntityStorageException: 'node_type' entity with ID 'article' already exists. in Drupal\Core\Entity\EntityStorageBase->doPreSave() (line 430 of /var/lib/drupaltestbot/sites/default/files/checkout/core/lib/Drupal/Core/Entity/EntityStorageBase.php). Drupal\Core\Entity\EntityStorageBase->doPreSave(Object) Drupal\Core\Entity\EntityStorageBase->save(Object) Drupal\Core\Config\Entity\ConfigEntityStorage->save(Object) Drupal\Core\Entity\Entity->save() Drupal\Core\Config\Entity\ConfigEntityBase->save() Drupal\simpletest\WebTestBase->drupalCreateContentType(Array) Drupal\flag\Tests\AdminUI->doFlagAdd() Drupal\flag\Tests\AdminUI->testFlagAdmin() Drupal\simpletest\TestBase->run(Array) simpletest_script_run_one_test('4', 'Drupal\flag\Tests\AdminUI') Uncaught exceptionEntityStorageBase.php430Drupal\Core\Entity\EntityStorageBase->doPreSave()
ExpandDrupal\flag\Tests\FlagSimpleTest223200
MessageGroupFilenameLineFunctionStatus
Link Flag this item does not exist on http://ec2-52-88-136-72.us-west-2.compute.amazonaws.com/checkout/node/1BrowserFlagSimpleTest.php116Drupal\flag\Tests\FlagSimpleTest->doFlagLinksTest()
Link with label Unflag this item found.OtherFlagSimpleTest.php118Drupal\flag\Tests\FlagSimpleTest->doFlagLinksTest()
Link with label Flag this item found.OtherFlagSimpleTest.php125Drupal\flag\Tests\FlagSimpleTest->doFlagLinksTest()
Link Unflag this item does not exist on http://ec2-52-88-136-72.us-west-2.compute.amazonaws.com/checkout/node/1BrowserFlagSimpleTest.php131Drupal\flag\Tests\FlagSimpleTest->doFlagLinksTest()
Link with label Flag this item found.OtherFlagSimpleTest.php133Drupal\flag\Tests\FlagSimpleTest->doFlagLinksTest()
Link Flag this item does not exist on http://ec2-52-88-136-72.us-west-2.compute.amazonaws.com/checkout/node/2BrowserFlagSimpleTest.php163Drupal\flag\Tests\FlagSimpleTest->doGlobalFlagLinksTest()
Link with label Unflag this item found.OtherFlagSimpleTest.php165Drupal\flag\Tests\FlagSimpleTest->doGlobalFlagLinksTest()
Link with label Flag this item found.OtherFlagSimpleTest.php169Drupal\flag\Tests\FlagSimpleTest->doGlobalFlagLinksTest()
Link with label Unflag this item found.OtherFlagSimpleTest.php181Drupal\flag\Tests\FlagSimpleTest->doGlobalFlagLinksTest()
Link with label Flag this item found.OtherFlagSimpleTest.php193Drupal\flag\Tests\FlagSimpleTest->doGlobalFlagLinksTest()
Link Flag this item does not exist on http://ec2-52-88-136-72.us-west-2.compute.amazonaws.com/checkout/node/3BrowserFlagSimpleTest.php293Drupal\flag\Tests\FlagSimpleTest->doTestFlagCounts()
Link with label Unflag this item found.OtherFlagSimpleTest.php295Drupal\flag\Tests\FlagSimpleTest->doTestFlagCounts()
Link Flag this item does not exist on http://ec2-52-88-136-72.us-west-2.compute.amazonaws.com/checkout/node/3BrowserFlagSimpleTest.php313Drupal\flag\Tests\FlagSimpleTest->doTestFlagCounts()
Link with label Unflag this item found.OtherFlagSimpleTest.php315Drupal\flag\Tests\FlagSimpleTest->doTestFlagCounts()
Link Unflag this item does not exist on http://ec2-52-88-136-72.us-west-2.compute.amazonaws.com/checkout/node/3BrowserFlagSimpleTest.php329Drupal\flag\Tests\FlagSimpleTest->doTestFlagCounts()
Link with label Flag this item found.OtherFlagSimpleTest.php331Drupal\flag\Tests\FlagSimpleTest->doTestFlagCounts()
Value 1 is equal to value '0'.OtherFlagSimpleTest.php341Drupal\flag\Tests\FlagSimpleTest->doTestFlagCounts()
Link with label Flag this item found.OtherFlagSimpleTest.php211Drupal\flag\Tests\FlagSimpleTest->doFlagLinkTeaserTest()
Link Flag this item does not exist on http://ec2-52-88-136-72.us-west-2.compute.amazonaws.com/checkout/node/5BrowserFlagSimpleTest.php243Drupal\flag\Tests\FlagSimpleTest->doUserDeletionTest()
Link with label Unflag this item found.OtherFlagSimpleTest.php245Drupal\flag\Tests\FlagSimpleTest->doUserDeletionTest()

All

Test namePassFailException
ExpandDrupal\flag\Tests\AdminUI1001
MessageGroupFilenameLineFunctionStatus
Drupal\Core\Entity\EntityStorageException: 'node_type' entity with ID 'article' already exists. in Drupal\Core\Entity\EntityStorageBase->doPreSave() (line 430 of /var/lib/drupaltestbot/sites/default/files/checkout/core/lib/Drupal/Core/Entity/EntityStorageBase.php). Drupal\Core\Entity\EntityStorageBase->doPreSave(Object) Drupal\Core\Entity\EntityStorageBase->save(Object) Drupal\Core\Config\Entity\ConfigEntityStorage->save(Object) Drupal\Core\Entity\Entity->save() Drupal\Core\Config\Entity\ConfigEntityBase->save() Drupal\simpletest\WebTestBase->drupalCreateContentType(Array) Drupal\flag\Tests\AdminUI->doFlagAdd() Drupal\flag\Tests\AdminUI->testFlagAdmin() Drupal\simpletest\TestBase->run(Array) simpletest_script_run_one_test('4', 'Drupal\flag\Tests\AdminUI') Uncaught exceptionEntityStorageBase.php430Drupal\Core\Entity\EntityStorageBase->doPreSave()
LeafDrupal\flag\Tests\FlagConfirmFormTest5900
LeafDrupal\flag\Tests\FlagCountsTest1000
LeafDrupal\flag\Tests\FlagEnableDisableTest5100
LeafDrupal\flag\Tests\FlagFieldEntryTest7700
LeafDrupal\flag\Tests\FlagResetTest1700
LeafDrupal\flag\Tests\FlagServiceTest1100
ExpandDrupal\flag\Tests\FlagSimpleTest223200
MessageGroupFilenameLineFunctionStatus
Link Flag this item does not exist on http://ec2-52-88-136-72.us-west-2.compute.amazonaws.com/checkout/node/1BrowserFlagSimpleTest.php116Drupal\flag\Tests\FlagSimpleTest->doFlagLinksTest()
Link with label Unflag this item found.OtherFlagSimpleTest.php118Drupal\flag\Tests\FlagSimpleTest->doFlagLinksTest()
Link with label Flag this item found.OtherFlagSimpleTest.php125Drupal\flag\Tests\FlagSimpleTest->doFlagLinksTest()
Link Unflag this item does not exist on http://ec2-52-88-136-72.us-west-2.compute.amazonaws.com/checkout/node/1BrowserFlagSimpleTest.php131Drupal\flag\Tests\FlagSimpleTest->doFlagLinksTest()
Link with label Flag this item found.OtherFlagSimpleTest.php133Drupal\flag\Tests\FlagSimpleTest->doFlagLinksTest()
Link Flag this item does not exist on http://ec2-52-88-136-72.us-west-2.compute.amazonaws.com/checkout/node/2BrowserFlagSimpleTest.php163Drupal\flag\Tests\FlagSimpleTest->doGlobalFlagLinksTest()
Link with label Unflag this item found.OtherFlagSimpleTest.php165Drupal\flag\Tests\FlagSimpleTest->doGlobalFlagLinksTest()
Link with label Flag this item found.OtherFlagSimpleTest.php169Drupal\flag\Tests\FlagSimpleTest->doGlobalFlagLinksTest()
Link with label Unflag this item found.OtherFlagSimpleTest.php181Drupal\flag\Tests\FlagSimpleTest->doGlobalFlagLinksTest()
Link with label Flag this item found.OtherFlagSimpleTest.php193Drupal\flag\Tests\FlagSimpleTest->doGlobalFlagLinksTest()
Link Flag this item does not exist on http://ec2-52-88-136-72.us-west-2.compute.amazonaws.com/checkout/node/3BrowserFlagSimpleTest.php293Drupal\flag\Tests\FlagSimpleTest->doTestFlagCounts()
Link with label Unflag this item found.OtherFlagSimpleTest.php295Drupal\flag\Tests\FlagSimpleTest->doTestFlagCounts()
Link Flag this item does not exist on http://ec2-52-88-136-72.us-west-2.compute.amazonaws.com/checkout/node/3BrowserFlagSimpleTest.php313Drupal\flag\Tests\FlagSimpleTest->doTestFlagCounts()
Link with label Unflag this item found.OtherFlagSimpleTest.php315Drupal\flag\Tests\FlagSimpleTest->doTestFlagCounts()
Link Unflag this item does not exist on http://ec2-52-88-136-72.us-west-2.compute.amazonaws.com/checkout/node/3BrowserFlagSimpleTest.php329Drupal\flag\Tests\FlagSimpleTest->doTestFlagCounts()
Link with label Flag this item found.OtherFlagSimpleTest.php331Drupal\flag\Tests\FlagSimpleTest->doTestFlagCounts()
Value 1 is equal to value '0'.OtherFlagSimpleTest.php341Drupal\flag\Tests\FlagSimpleTest->doTestFlagCounts()
Link with label Flag this item found.OtherFlagSimpleTest.php211Drupal\flag\Tests\FlagSimpleTest->doFlagLinkTeaserTest()
Link Flag this item does not exist on http://ec2-52-88-136-72.us-west-2.compute.amazonaws.com/checkout/node/5BrowserFlagSimpleTest.php243Drupal\flag\Tests\FlagSimpleTest->doUserDeletionTest()
Link with label Unflag this item found.OtherFlagSimpleTest.php245Drupal\flag\Tests\FlagSimpleTest->doUserDeletionTest()