make-2569651-21.patch

Test status
StatusResult
Last receivedWed, 10/07/2015 - 13:43:02
Last requestedWed, 10/07/2015 - 14:09:21
Last testedWed, 10/07/2015 - 14:12:36
Test count1
Environment status
PHP 5.5 MySQLfail
File information
Filemake-2569651-21.patch
BranchTranslation Management Tool - 8.x-1.x
LinkIssue Link
SummaryFAILED: [[SimpleTest]]: [PHP 5.5 MySQL] 2,812 pass(es), 0 fail(s), and 1 exception(s).
Details

PHP 5.5 MySQL

  1. Setup environment
  2. Detect an invalid patch URL
  3. Detect invalid repository information
  4. Detect invalid patch format
  5. Detect a non-applicable patch
  6. Detect invalid PHP syntax
  7. Detect a Drupal installation failure
  8. Detect a test run failure
  9. Detect a failing test
    Review the test failures below then if necessary run them locally until the problem has been fixed.
  10. Complete test suite with all tests passing
2,812 pass(es), 0 fail(s), and 1 exception(s)

Non-pass

Test namePassFailException
ExpandDrupal\tmgmt_content\Tests\ContentEntitySourceUnitTest16401
MessageGroupFilenameLineFunctionStatus
Drupal\Core\Entity\EntityStorageException: SQLSTATE[42S02]: Base table or view not found: 1146 Table 'drupaltestbotmysql.simpletest990831node_access' doesn't exist: DELETE FROM {node_access} WHERE (nid = :db_condition_placeholder_0); Array ( [:db_condition_placeholder_0] => 1 ) in Drupal\Core\Entity\Sql\SqlContentEntityStorage->save() (line 757 of /var/lib/drupaltestbot/sites/default/files/checkout/core/lib/Drupal/Core/Entity/Sql/SqlContentEntityStorage.php). Drupal\Core\Entity\Sql\SqlContentEntityStorage->save(Object) Drupal\Core\Entity\Entity->save() Drupal\tmgmt_content\Plugin\tmgmt\Source\ContentEntitySource->doSaveTranslations(Object, Array, 'de') Drupal\tmgmt_content\Plugin\tmgmt\Source\ContentEntitySource->saveTranslation(Object, 'de') Drupal\tmgmt\Entity\JobItem->acceptTranslation() Drupal\tmgmt\Entity\JobItem->needsReview() Drupal\tmgmt\Entity\JobItem->addTranslatedData(Array) Drupal\tmgmt\Entity\Job->addTranslatedData(Array) Drupal\tmgmt_test\Plugin\tmgmt\Translator\TestTranslator->requestTranslation(Object) Drupal\tmgmt\Entity\Job->requestTranslation() Drupal\tmgmt_content\Tests\ContentEntitySourceUnitTest->testAcceptTranslation() Drupal\simpletest\TestBase->run(Array) simpletest_script_run_one_test('2', 'Drupal\tmgmt_content\Tests\ContentEntitySourceUnitTest') Uncaught exceptionSqlContentEntityStorage.php757Drupal\Core\Entity\Sql\SqlContentEntityStorage->save()

All

Test namePassFailException
LeafDrupal\tmgmt\Tests\CrudTest19900
LeafDrupal\tmgmt\Tests\HelperTest4300
LeafDrupal\tmgmt\Tests\LocalTasksTests3100
LeafDrupal\tmgmt\Tests\PluginsTest5000
LeafDrupal\tmgmt\Tests\TMGMTCartTest5200
LeafDrupal\tmgmt\Tests\TMGMTUiTest68100
LeafDrupal\tmgmt\Tests\TranslatorTest8500
LeafDrupal\tmgmt\Tests\TranslatorUITest3000
LeafDrupal\tmgmt_config\Tests\ConfigSourceListTest27900
LeafDrupal\tmgmt_config\Tests\ConfigSourceUiTest30100
LeafDrupal\tmgmt_config\Tests\ConfigSourceUnitTest8900
LeafDrupal\tmgmt_content\Tests\ContentEntitySourceListTest16100
LeafDrupal\tmgmt_content\Tests\ContentEntitySourceUiTest29000
ExpandDrupal\tmgmt_content\Tests\ContentEntitySourceUnitTest16401
MessageGroupFilenameLineFunctionStatus
Drupal\Core\Entity\EntityStorageException: SQLSTATE[42S02]: Base table or view not found: 1146 Table 'drupaltestbotmysql.simpletest990831node_access' doesn't exist: DELETE FROM {node_access} WHERE (nid = :db_condition_placeholder_0); Array ( [:db_condition_placeholder_0] => 1 ) in Drupal\Core\Entity\Sql\SqlContentEntityStorage->save() (line 757 of /var/lib/drupaltestbot/sites/default/files/checkout/core/lib/Drupal/Core/Entity/Sql/SqlContentEntityStorage.php). Drupal\Core\Entity\Sql\SqlContentEntityStorage->save(Object) Drupal\Core\Entity\Entity->save() Drupal\tmgmt_content\Plugin\tmgmt\Source\ContentEntitySource->doSaveTranslations(Object, Array, 'de') Drupal\tmgmt_content\Plugin\tmgmt\Source\ContentEntitySource->saveTranslation(Object, 'de') Drupal\tmgmt\Entity\JobItem->acceptTranslation() Drupal\tmgmt\Entity\JobItem->needsReview() Drupal\tmgmt\Entity\JobItem->addTranslatedData(Array) Drupal\tmgmt\Entity\Job->addTranslatedData(Array) Drupal\tmgmt_test\Plugin\tmgmt\Translator\TestTranslator->requestTranslation(Object) Drupal\tmgmt\Entity\Job->requestTranslation() Drupal\tmgmt_content\Tests\ContentEntitySourceUnitTest->testAcceptTranslation() Drupal\simpletest\TestBase->run(Array) simpletest_script_run_one_test('2', 'Drupal\tmgmt_content\Tests\ContentEntitySourceUnitTest') Uncaught exceptionSqlContentEntityStorage.php757Drupal\Core\Entity\Sql\SqlContentEntityStorage->save()
LeafDrupal\tmgmt_content\Tests\ContentEntitySuggestionsTest2400
LeafDrupal\tmgmt_demo\Tests\TMGMTDemoTest4800
LeafDrupal\tmgmt_file\Tests\FileTranslatorTest17200
LeafDrupal\tmgmt_locale\Tests\LocaleSourceTest6300
LeafDrupal\tmgmt_locale\Tests\LocaleSourceUiTest5000