2581697-2.patch

Test status
StatusResult
Last receivedWed, 10/07/2015 - 12:53:00
Last requestedWed, 10/07/2015 - 13:44:33
Last testedWed, 10/07/2015 - 13:50:34
Test count1
Environment status
PHP 5.5 MySQLfail
File information
File2581697-2.patch
BranchMonitoring - 8.x-1.x
LinkIssue Link
SummaryFAILED: [[SimpleTest]]: [PHP 5.5 MySQL] 2,017 pass(es), 0 fail(s), and 1 exception(s).
Details

PHP 5.5 MySQL

  1. Setup environment
  2. Detect an invalid patch URL
  3. Detect invalid repository information
  4. Detect invalid patch format
  5. Detect a non-applicable patch
  6. Detect invalid PHP syntax
  7. Detect a Drupal installation failure
  8. Detect a test run failure
  9. Detect a failing test
    Review the test failures below then if necessary run them locally until the problem has been fixed.
  10. Complete test suite with all tests passing
2,017 pass(es), 0 fail(s), and 1 exception(s)

Non-pass

Test namePassFailException
ExpandDrupal\monitoring\Tests\MonitoringCoreKernelTest16001
MessageGroupFilenameLineFunctionStatus
Drupal\Core\Config\Schema\SchemaIncompleteException: Schema errors for system.cron with the following errors: system.cron:threshold.autorun missing schema in Drupal\Core\Config\Testing\ConfigSchemaChecker->onConfigSave() (line 98 of /var/lib/drupaltestbot/sites/default/files/checkout/core/lib/Drupal/Core/Config/Testing/ConfigSchemaChecker.php). Drupal\Core\Config\Testing\ConfigSchemaChecker->onConfigSave(Object, 'config.save', Object) Drupal\Component\EventDispatcher\ContainerAwareEventDispatcher->dispatch('config.save', Object) Drupal\Core\Config\Config->save() Drupal\monitoring\Tests\MonitoringCoreKernelTest->testConfigValueSensorPluginCronSafeThreshold() Drupal\simpletest\TestBase->run(Array) simpletest_script_run_one_test('10', 'Drupal\monitoring\Tests\MonitoringCoreKernelTest') Uncaught exceptionConfigSchemaChecker.php98Drupal\Core\Config\Testing\ConfigSchemaChecker->onConfigSave()

All

Test namePassFailException
LeafDrupal\monitoring\Tests\MonitoringApiTest8100
LeafDrupal\monitoring\Tests\MonitoringCaptchaTest1900
ExpandDrupal\monitoring\Tests\MonitoringCoreKernelTest16001
MessageGroupFilenameLineFunctionStatus
Drupal\Core\Config\Schema\SchemaIncompleteException: Schema errors for system.cron with the following errors: system.cron:threshold.autorun missing schema in Drupal\Core\Config\Testing\ConfigSchemaChecker->onConfigSave() (line 98 of /var/lib/drupaltestbot/sites/default/files/checkout/core/lib/Drupal/Core/Config/Testing/ConfigSchemaChecker.php). Drupal\Core\Config\Testing\ConfigSchemaChecker->onConfigSave(Object, 'config.save', Object) Drupal\Component\EventDispatcher\ContainerAwareEventDispatcher->dispatch('config.save', Object) Drupal\Core\Config\Config->save() Drupal\monitoring\Tests\MonitoringCoreKernelTest->testConfigValueSensorPluginCronSafeThreshold() Drupal\simpletest\TestBase->run(Array) simpletest_script_run_one_test('10', 'Drupal\monitoring\Tests\MonitoringCoreKernelTest') Uncaught exceptionConfigSchemaChecker.php98Drupal\Core\Config\Testing\ConfigSchemaChecker->onConfigSave()
LeafDrupal\monitoring\Tests\MonitoringCoreWebTest18500
LeafDrupal\monitoring\Tests\MonitoringPastTest1300
LeafDrupal\monitoring\Tests\MonitoringSearchAPITest1100
LeafDrupal\monitoring\Tests\MonitoringServicesTest58500
LeafDrupal\monitoring\Tests\MonitoringUITest83200
LeafDrupal\monitoring\Tests\MonitoringViewDisplayTest2900
LeafDrupal\monitoring_demo\Tests\MonitoringDemoTest1200
LeafDrupal\monitoring_multigraph\Tests\MultigraphServicesTest2600
LeafDrupal\monitoring_multigraph\Tests\MultigraphWebTest6400