tmgmt-rename_translator_settings_form_element_id-2569343-22.patch

Test status
StatusResult
Last receivedWed, 10/07/2015 - 11:35:00
Last requestedWed, 10/07/2015 - 11:35:01
Last testedWed, 10/07/2015 - 11:35:45
Test count1
Environment status
PHP 5.5 MySQLfail
File information
Filetmgmt-rename_translator_settings_form_element_id-2569343-22.patch
BranchTranslation Management Tool - 8.x-1.x
LinkIssue Link
SummaryFAILED: [[SimpleTest]]: [PHP 5.5 MySQL] 408 pass(es), 14 fail(s), and 14 exception(s).
Details

PHP 5.5 MySQL

  1. Setup environment
  2. Detect an invalid patch URL
  3. Detect invalid repository information
  4. Detect invalid patch format
  5. Detect a non-applicable patch
  6. Detect invalid PHP syntax
  7. Detect a Drupal installation failure
  8. Detect a test run failure
  9. Detect a failing test
    Review the test failures below then if necessary run them locally until the problem has been fixed.
  10. Complete test suite with all tests passing
408 pass(es), 14 fail(s), and 14 exception(s)

Non-pass

Test namePassFailException
ExpandDrupal\tmgmt\Tests\LocalTasksTests011
MessageGroupFilenameLineFunctionStatus
The test did not complete due to a fatal error.Completion checkLocalTasksTests.php38Drupal\tmgmt\Tests\LocalTasksTests->testTranslatorLocalTaks()
Drupal\Core\Config\Schema\SchemaIncompleteException: Schema errors for tmgmt.translator.test_translator with the following errors: tmgmt.translator.test_translator:settings.auto_accept missing schema in Drupal\Core\Config\Testing\ConfigSchemaChecker->onConfigSave() (line 98 of /var/lib/drupaltestbot/sites/default/files/checkout/core/lib/Drupal/Core/Config/Testing/ConfigSchemaChecker.php). Drupal\Core\Config\Testing\ConfigSchemaChecker->onConfigSave(Object, 'config.save', Object) Drupal\Component\EventDispatcher\ContainerAwareEventDispatcher->dispatch('config.save', Object) Drupal\Core\Config\Config->save() Drupal\Core\Config\Entity\ConfigEntityStorage->doSave('test_translator', Object) Drupal\Core\Entity\EntityStorageBase->save(Object) Drupal\Core\Config\Entity\ConfigEntityStorage->save(Object) Drupal\Core\Entity\Entity->save() Drupal\Core\Config\Entity\ConfigEntityBase->save() tmgmt_translator_auto_create(Array) tmgmt_modules_installed(Array) call_user_func_array('tmgmt_modules_installed', Array) Drupal\Core\Extension\ModuleHandler->invokeAll('modules_installed', Array) Drupal\Core\Extension\ModuleInstaller->install(Array, 1) Drupal\Core\ProxyClass\Extension\ModuleInstaller->install(Array, 1) Drupal\simpletest\WebTestBase->installModulesFromClassProperty(Object) Drupal\simpletest\WebTestBase->setUp() Drupal\tmgmt\Tests\TMGMTTestBase->setUp() Drupal\tmgmt\Tests\LocalTasksTests->setUp() Drupal\simpletest\TestBase->run(Array) simpletest_script_run_one_test('16', 'Drupal\tmgmt\Tests\LocalTasksTests') Uncaught exceptionConfigSchemaChecker.php98Drupal\Core\Config\Testing\ConfigSchemaChecker->onConfigSave()
ExpandDrupal\tmgmt\Tests\TMGMTCartTest011
MessageGroupFilenameLineFunctionStatus
The test did not complete due to a fatal error.Completion checkTMGMTCartTest.php43Drupal\tmgmt\Tests\TMGMTCartTest->testCartEnforceSourceLanguage()
Drupal\Core\Config\Schema\SchemaIncompleteException: Schema errors for tmgmt.translator.test_translator with the following errors: tmgmt.translator.test_translator:settings.auto_accept missing schema in Drupal\Core\Config\Testing\ConfigSchemaChecker->onConfigSave() (line 98 of /var/lib/drupaltestbot/sites/default/files/checkout/core/lib/Drupal/Core/Config/Testing/ConfigSchemaChecker.php). Drupal\Core\Config\Testing\ConfigSchemaChecker->onConfigSave(Object, 'config.save', Object) Drupal\Component\EventDispatcher\ContainerAwareEventDispatcher->dispatch('config.save', Object) Drupal\Core\Config\Config->save() Drupal\Core\Config\Entity\ConfigEntityStorage->doSave('test_translator', Object) Drupal\Core\Entity\EntityStorageBase->save(Object) Drupal\Core\Config\Entity\ConfigEntityStorage->save(Object) Drupal\Core\Entity\Entity->save() Drupal\Core\Config\Entity\ConfigEntityBase->save() tmgmt_translator_auto_create(Array) tmgmt_modules_installed(Array) call_user_func_array('tmgmt_modules_installed', Array) Drupal\Core\Extension\ModuleHandler->invokeAll('modules_installed', Array) Drupal\Core\Extension\ModuleInstaller->install(Array, 1) Drupal\Core\ProxyClass\Extension\ModuleInstaller->install(Array, 1) Drupal\simpletest\WebTestBase->installModulesFromClassProperty(Object) Drupal\simpletest\WebTestBase->setUp() Drupal\tmgmt\Tests\TMGMTTestBase->setUp() Drupal\tmgmt\Tests\TMGMTCartTest->setUp() Drupal\simpletest\TestBase->run(Array) simpletest_script_run_one_test('14', 'Drupal\tmgmt\Tests\TMGMTCartTest') Uncaught exceptionConfigSchemaChecker.php98Drupal\Core\Config\Testing\ConfigSchemaChecker->onConfigSave()
ExpandDrupal\tmgmt\Tests\TMGMTUiTest011
MessageGroupFilenameLineFunctionStatus
The test did not complete due to a fatal error.Completion checkTMGMTUiTest.php53Drupal\tmgmt\Tests\TMGMTUiTest->testCheckoutForm()
Drupal\Core\Config\Schema\SchemaIncompleteException: Schema errors for tmgmt.translator.test_translator with the following errors: tmgmt.translator.test_translator:settings.auto_accept missing schema in Drupal\Core\Config\Testing\ConfigSchemaChecker->onConfigSave() (line 98 of /var/lib/drupaltestbot/sites/default/files/checkout/core/lib/Drupal/Core/Config/Testing/ConfigSchemaChecker.php). Drupal\Core\Config\Testing\ConfigSchemaChecker->onConfigSave(Object, 'config.save', Object) Drupal\Component\EventDispatcher\ContainerAwareEventDispatcher->dispatch('config.save', Object) Drupal\Core\Config\Config->save() Drupal\Core\Config\Entity\ConfigEntityStorage->doSave('test_translator', Object) Drupal\Core\Entity\EntityStorageBase->save(Object) Drupal\Core\Config\Entity\ConfigEntityStorage->save(Object) Drupal\Core\Entity\Entity->save() Drupal\Core\Config\Entity\ConfigEntityBase->save() tmgmt_translator_auto_create(Array) tmgmt_modules_installed(Array) call_user_func_array('tmgmt_modules_installed', Array) Drupal\Core\Extension\ModuleHandler->invokeAll('modules_installed', Array) Drupal\Core\Extension\ModuleInstaller->install(Array, 1) Drupal\Core\ProxyClass\Extension\ModuleInstaller->install(Array, 1) Drupal\simpletest\WebTestBase->installModulesFromClassProperty(Object) Drupal\simpletest\WebTestBase->setUp() Drupal\tmgmt\Tests\TMGMTTestBase->setUp() Drupal\tmgmt\Tests\TMGMTUiTest->setUp() Drupal\simpletest\TestBase->run(Array) simpletest_script_run_one_test('13', 'Drupal\tmgmt\Tests\TMGMTUiTest') Uncaught exceptionConfigSchemaChecker.php98Drupal\Core\Config\Testing\ConfigSchemaChecker->onConfigSave()
ExpandDrupal\tmgmt\Tests\TranslatorTest011
MessageGroupFilenameLineFunctionStatus
The test did not complete due to a fatal error.Completion checkTranslatorTest.php40Drupal\tmgmt\Tests\TranslatorTest->testTranslatorHandling()
Drupal\Core\Config\Schema\SchemaIncompleteException: Schema errors for tmgmt.translator.test_translator with the following errors: tmgmt.translator.test_translator:settings.auto_accept missing schema in Drupal\Core\Config\Testing\ConfigSchemaChecker->onConfigSave() (line 98 of /var/lib/drupaltestbot/sites/default/files/checkout/core/lib/Drupal/Core/Config/Testing/ConfigSchemaChecker.php). Drupal\Core\Config\Testing\ConfigSchemaChecker->onConfigSave(Object, 'config.save', Object) Drupal\Component\EventDispatcher\ContainerAwareEventDispatcher->dispatch('config.save', Object) Drupal\Core\Config\Config->save() Drupal\Core\Config\Entity\ConfigEntityStorage->doSave('test_translator', Object) Drupal\Core\Entity\EntityStorageBase->save(Object) Drupal\Core\Config\Entity\ConfigEntityStorage->save(Object) Drupal\Core\Entity\Entity->save() Drupal\Core\Config\Entity\ConfigEntityBase->save() tmgmt_translator_auto_create(Array) tmgmt_modules_installed(Array) call_user_func_array('tmgmt_modules_installed', Array) Drupal\Core\Extension\ModuleHandler->invokeAll('modules_installed', Array) Drupal\Core\Extension\ModuleInstaller->install(Array, 1) Drupal\Core\ProxyClass\Extension\ModuleInstaller->install(Array, 1) Drupal\simpletest\WebTestBase->installModulesFromClassProperty(Object) Drupal\simpletest\WebTestBase->setUp() Drupal\tmgmt\Tests\TMGMTTestBase->setUp() Drupal\tmgmt\Tests\TranslatorTest->setUp() Drupal\simpletest\TestBase->run(Array) simpletest_script_run_one_test('12', 'Drupal\tmgmt\Tests\TranslatorTest') Uncaught exceptionConfigSchemaChecker.php98Drupal\Core\Config\Testing\ConfigSchemaChecker->onConfigSave()
ExpandDrupal\tmgmt\Tests\TranslatorUITest011
MessageGroupFilenameLineFunctionStatus
The test did not complete due to a fatal error.Completion checkTranslatorUITest.php37Drupal\tmgmt\Tests\TranslatorUITest->testTranslatorUI()
Drupal\Core\Config\Schema\SchemaIncompleteException: Schema errors for tmgmt.translator.test_translator with the following errors: tmgmt.translator.test_translator:settings.auto_accept missing schema in Drupal\Core\Config\Testing\ConfigSchemaChecker->onConfigSave() (line 98 of /var/lib/drupaltestbot/sites/default/files/checkout/core/lib/Drupal/Core/Config/Testing/ConfigSchemaChecker.php). Drupal\Core\Config\Testing\ConfigSchemaChecker->onConfigSave(Object, 'config.save', Object) Drupal\Component\EventDispatcher\ContainerAwareEventDispatcher->dispatch('config.save', Object) Drupal\Core\Config\Config->save() Drupal\Core\Config\Entity\ConfigEntityStorage->doSave('test_translator', Object) Drupal\Core\Entity\EntityStorageBase->save(Object) Drupal\Core\Config\Entity\ConfigEntityStorage->save(Object) Drupal\Core\Entity\Entity->save() Drupal\Core\Config\Entity\ConfigEntityBase->save() tmgmt_translator_auto_create(Array) tmgmt_modules_installed(Array) call_user_func_array('tmgmt_modules_installed', Array) Drupal\Core\Extension\ModuleHandler->invokeAll('modules_installed', Array) Drupal\Core\Extension\ModuleInstaller->install(Array, 1) Drupal\Core\ProxyClass\Extension\ModuleInstaller->install(Array, 1) Drupal\simpletest\WebTestBase->installModulesFromClassProperty(Object) Drupal\simpletest\WebTestBase->setUp() Drupal\tmgmt\Tests\TMGMTTestBase->setUp() Drupal\tmgmt\Tests\TranslatorUITest->setUp() Drupal\simpletest\TestBase->run(Array) simpletest_script_run_one_test('11', 'Drupal\tmgmt\Tests\TranslatorUITest') Uncaught exceptionConfigSchemaChecker.php98Drupal\Core\Config\Testing\ConfigSchemaChecker->onConfigSave()
ExpandDrupal\tmgmt_config\Tests\ConfigSourceListTest011
MessageGroupFilenameLineFunctionStatus
The test did not complete due to a fatal error.Completion checkConfigSourceListTest.php56Drupal\tmgmt_config\Tests\ConfigSourceListTest->testNodeTypeSubmissions()
Drupal\Core\Config\Schema\SchemaIncompleteException: Schema errors for tmgmt.translator.test_translator with the following errors: tmgmt.translator.test_translator:settings.auto_accept missing schema in Drupal\Core\Config\Testing\ConfigSchemaChecker->onConfigSave() (line 98 of /var/lib/drupaltestbot/sites/default/files/checkout/core/lib/Drupal/Core/Config/Testing/ConfigSchemaChecker.php). Drupal\Core\Config\Testing\ConfigSchemaChecker->onConfigSave(Object, 'config.save', Object) Drupal\Component\EventDispatcher\ContainerAwareEventDispatcher->dispatch('config.save', Object) Drupal\Core\Config\Config->save() Drupal\Core\Config\Entity\ConfigEntityStorage->doSave('test_translator', Object) Drupal\Core\Entity\EntityStorageBase->save(Object) Drupal\Core\Config\Entity\ConfigEntityStorage->save(Object) Drupal\Core\Entity\Entity->save() Drupal\Core\Config\Entity\ConfigEntityBase->save() tmgmt_translator_auto_create(Array) tmgmt_modules_installed(Array) call_user_func_array('tmgmt_modules_installed', Array) Drupal\Core\Extension\ModuleHandler->invokeAll('modules_installed', Array) Drupal\Core\Extension\ModuleInstaller->install(Array, 1) Drupal\Core\ProxyClass\Extension\ModuleInstaller->install(Array, 1) Drupal\simpletest\WebTestBase->installModulesFromClassProperty(Object) Drupal\simpletest\WebTestBase->setUp() Drupal\tmgmt\Tests\TMGMTTestBase->setUp() Drupal\tmgmt_config\Tests\ConfigSourceListTest->setUp() Drupal\simpletest\TestBase->run(Array) simpletest_script_run_one_test('10', 'Drupal\tmgmt_config\Tests\ConfigSourceListTest') Uncaught exceptionConfigSchemaChecker.php98Drupal\Core\Config\Testing\ConfigSchemaChecker->onConfigSave()
ExpandDrupal\tmgmt_config\Tests\ConfigSourceUiTest011
MessageGroupFilenameLineFunctionStatus
The test did not complete due to a fatal error.Completion checkConfigSourceUiTest.php52Drupal\tmgmt_config\Tests\ConfigSourceUiTest->testNodeTypeTranslateTabSingleCheckout()
Drupal\Core\Config\Schema\SchemaIncompleteException: Schema errors for tmgmt.translator.test_translator with the following errors: tmgmt.translator.test_translator:settings.auto_accept missing schema in Drupal\Core\Config\Testing\ConfigSchemaChecker->onConfigSave() (line 98 of /var/lib/drupaltestbot/sites/default/files/checkout/core/lib/Drupal/Core/Config/Testing/ConfigSchemaChecker.php). Drupal\Core\Config\Testing\ConfigSchemaChecker->onConfigSave(Object, 'config.save', Object) Drupal\Component\EventDispatcher\ContainerAwareEventDispatcher->dispatch('config.save', Object) Drupal\Core\Config\Config->save() Drupal\Core\Config\Entity\ConfigEntityStorage->doSave('test_translator', Object) Drupal\Core\Entity\EntityStorageBase->save(Object) Drupal\Core\Config\Entity\ConfigEntityStorage->save(Object) Drupal\Core\Entity\Entity->save() Drupal\Core\Config\Entity\ConfigEntityBase->save() tmgmt_translator_auto_create(Array) tmgmt_modules_installed(Array) call_user_func_array('tmgmt_modules_installed', Array) Drupal\Core\Extension\ModuleHandler->invokeAll('modules_installed', Array) Drupal\Core\Extension\ModuleInstaller->install(Array, 1) Drupal\Core\ProxyClass\Extension\ModuleInstaller->install(Array, 1) Drupal\simpletest\WebTestBase->installModulesFromClassProperty(Object) Drupal\simpletest\WebTestBase->setUp() Drupal\tmgmt\Tests\TMGMTTestBase->setUp() Drupal\tmgmt_config\Tests\ConfigSourceUiTest->setUp() Drupal\simpletest\TestBase->run(Array) simpletest_script_run_one_test('8', 'Drupal\tmgmt_config\Tests\ConfigSourceUiTest') Uncaught exceptionConfigSchemaChecker.php98Drupal\Core\Config\Testing\ConfigSchemaChecker->onConfigSave()
ExpandDrupal\tmgmt_config\Tests\ConfigSourceUnitTest1211
MessageGroupFilenameLineFunctionStatus
The test did not complete due to a fatal error.Completion checkConfigSourceUnitTest.php54Drupal\tmgmt_config\Tests\ConfigSourceUnitTest->testNodeType()
Drupal\Core\Config\Schema\SchemaIncompleteException: Schema errors for tmgmt.translator.test_translator with the following errors: tmgmt.translator.test_translator:settings.auto_accept missing schema in Drupal\Core\Config\Testing\ConfigSchemaChecker->onConfigSave() (line 98 of /var/lib/drupaltestbot/sites/default/files/checkout/core/lib/Drupal/Core/Config/Testing/ConfigSchemaChecker.php). Drupal\Core\Config\Testing\ConfigSchemaChecker->onConfigSave(Object, 'config.save', Object) Drupal\Component\EventDispatcher\ContainerAwareEventDispatcher->dispatch('config.save', Object) Drupal\Core\Config\Config->save() Drupal\Core\Config\Entity\ConfigEntityStorage->doSave('test_translator', Object) Drupal\Core\Entity\EntityStorageBase->save(Object) Drupal\Core\Config\Entity\ConfigEntityStorage->save(Object) Drupal\Core\Entity\Entity->save() Drupal\Core\Config\Entity\ConfigEntityBase->save() tmgmt_translator_auto_create(Array) Drupal\tmgmt_config\Tests\ConfigSourceUnitTest->setUp() Drupal\simpletest\TestBase->run(Array) simpletest_script_run_one_test('9', 'Drupal\tmgmt_config\Tests\ConfigSourceUnitTest') Uncaught exceptionConfigSchemaChecker.php98Drupal\Core\Config\Testing\ConfigSchemaChecker->onConfigSave()
ExpandDrupal\tmgmt_content\Tests\ContentEntitySourceListTest011
MessageGroupFilenameLineFunctionStatus
The test did not complete due to a fatal error.Completion checkContentEntitySourceListTest.php64Drupal\tmgmt_content\Tests\ContentEntitySourceListTest->testTermBundleFilter()
Drupal\Core\Config\Schema\SchemaIncompleteException: Schema errors for tmgmt.translator.test_translator with the following errors: tmgmt.translator.test_translator:settings.auto_accept missing schema in Drupal\Core\Config\Testing\ConfigSchemaChecker->onConfigSave() (line 98 of /var/lib/drupaltestbot/sites/default/files/checkout/core/lib/Drupal/Core/Config/Testing/ConfigSchemaChecker.php). Drupal\Core\Config\Testing\ConfigSchemaChecker->onConfigSave(Object, 'config.save', Object) Drupal\Component\EventDispatcher\ContainerAwareEventDispatcher->dispatch('config.save', Object) Drupal\Core\Config\Config->save() Drupal\Core\Config\Entity\ConfigEntityStorage->doSave('test_translator', Object) Drupal\Core\Entity\EntityStorageBase->save(Object) Drupal\Core\Config\Entity\ConfigEntityStorage->save(Object) Drupal\Core\Entity\Entity->save() Drupal\Core\Config\Entity\ConfigEntityBase->save() tmgmt_translator_auto_create(Array) tmgmt_modules_installed(Array) call_user_func_array('tmgmt_modules_installed', Array) Drupal\Core\Extension\ModuleHandler->invokeAll('modules_installed', Array) Drupal\Core\Extension\ModuleInstaller->install(Array, 1) Drupal\Core\ProxyClass\Extension\ModuleInstaller->install(Array, 1) Drupal\simpletest\WebTestBase->installModulesFromClassProperty(Object) Drupal\simpletest\WebTestBase->setUp() Drupal\tmgmt\Tests\TMGMTTestBase->setUp() Drupal\tmgmt_content\Tests\ContentEntitySourceListTest->setUp() Drupal\simpletest\TestBase->run(Array) simpletest_script_run_one_test('5', 'Drupal\tmgmt_content\Tests\ContentEntitySourceListTest') Uncaught exceptionConfigSchemaChecker.php98Drupal\Core\Config\Testing\ConfigSchemaChecker->onConfigSave()
ExpandDrupal\tmgmt_content\Tests\ContentEntitySourceUiTest011
MessageGroupFilenameLineFunctionStatus
The test did not complete due to a fatal error.Completion checkContentEntitySourceUiTest.php58Drupal\tmgmt_content\Tests\ContentEntitySourceUiTest->testNodeTranslateTabSingleCheckout()
Drupal\Core\Config\Schema\SchemaIncompleteException: Schema errors for tmgmt.translator.test_translator with the following errors: tmgmt.translator.test_translator:settings.auto_accept missing schema in Drupal\Core\Config\Testing\ConfigSchemaChecker->onConfigSave() (line 98 of /var/lib/drupaltestbot/sites/default/files/checkout/core/lib/Drupal/Core/Config/Testing/ConfigSchemaChecker.php). Drupal\Core\Config\Testing\ConfigSchemaChecker->onConfigSave(Object, 'config.save', Object) Drupal\Component\EventDispatcher\ContainerAwareEventDispatcher->dispatch('config.save', Object) Drupal\Core\Config\Config->save() Drupal\Core\Config\Entity\ConfigEntityStorage->doSave('test_translator', Object) Drupal\Core\Entity\EntityStorageBase->save(Object) Drupal\Core\Config\Entity\ConfigEntityStorage->save(Object) Drupal\Core\Entity\Entity->save() Drupal\Core\Config\Entity\ConfigEntityBase->save() tmgmt_translator_auto_create(Array) tmgmt_modules_installed(Array) call_user_func_array('tmgmt_modules_installed', Array) Drupal\Core\Extension\ModuleHandler->invokeAll('modules_installed', Array) Drupal\Core\Extension\ModuleInstaller->install(Array, 1) Drupal\Core\ProxyClass\Extension\ModuleInstaller->install(Array, 1) Drupal\simpletest\WebTestBase->installModulesFromClassProperty(Object) Drupal\simpletest\WebTestBase->setUp() Drupal\tmgmt\Tests\TMGMTTestBase->setUp() Drupal\tmgmt_content\Tests\ContentEntitySourceUiTest->setUp() Drupal\simpletest\TestBase->run(Array) simpletest_script_run_one_test('2', 'Drupal\tmgmt_content\Tests\ContentEntitySourceUiTest') Uncaught exceptionConfigSchemaChecker.php98Drupal\Core\Config\Testing\ConfigSchemaChecker->onConfigSave()
ExpandDrupal\tmgmt_content\Tests\ContentEntitySourceUnitTest1711
MessageGroupFilenameLineFunctionStatus
The test did not complete due to a fatal error.Completion checkContentEntitySourceUnitTest.php98Drupal\tmgmt_content\Tests\ContentEntitySourceUnitTest->testEntityTest()
Drupal\Core\Config\Schema\SchemaIncompleteException: Schema errors for tmgmt.translator.test_translator with the following errors: tmgmt.translator.test_translator:settings.auto_accept missing schema in Drupal\Core\Config\Testing\ConfigSchemaChecker->onConfigSave() (line 98 of /var/lib/drupaltestbot/sites/default/files/checkout/core/lib/Drupal/Core/Config/Testing/ConfigSchemaChecker.php). Drupal\Core\Config\Testing\ConfigSchemaChecker->onConfigSave(Object, 'config.save', Object) Drupal\Component\EventDispatcher\ContainerAwareEventDispatcher->dispatch('config.save', Object) Drupal\Core\Config\Config->save() Drupal\Core\Config\Entity\ConfigEntityStorage->doSave('test_translator', Object) Drupal\Core\Entity\EntityStorageBase->save(Object) Drupal\Core\Config\Entity\ConfigEntityStorage->save(Object) Drupal\Core\Entity\Entity->save() Drupal\Core\Config\Entity\ConfigEntityBase->save() tmgmt_translator_auto_create(Array) Drupal\tmgmt_content\Tests\ContentEntitySourceUnitTest->setUp() Drupal\simpletest\TestBase->run(Array) simpletest_script_run_one_test('4', 'Drupal\tmgmt_content\Tests\ContentEntitySourceUnitTest') Uncaught exceptionConfigSchemaChecker.php98Drupal\Core\Config\Testing\ConfigSchemaChecker->onConfigSave()
ExpandDrupal\tmgmt_demo\Tests\TMGMTDemoTest011
MessageGroupFilenameLineFunctionStatus
The test did not complete due to a fatal error.Completion checkTMGMTDemoTest.php40Drupal\tmgmt_demo\Tests\TMGMTDemoTest->testInstalled()
Drupal\Core\Config\Schema\SchemaIncompleteException: Schema errors for tmgmt.translator.test_translator with the following errors: tmgmt.translator.test_translator:settings.auto_accept missing schema in Drupal\Core\Config\Testing\ConfigSchemaChecker->onConfigSave() (line 98 of /var/lib/drupaltestbot/sites/default/files/checkout/core/lib/Drupal/Core/Config/Testing/ConfigSchemaChecker.php). Drupal\Core\Config\Testing\ConfigSchemaChecker->onConfigSave(Object, 'config.save', Object) Drupal\Component\EventDispatcher\ContainerAwareEventDispatcher->dispatch('config.save', Object) Drupal\Core\Config\Config->save() Drupal\Core\Config\Entity\ConfigEntityStorage->doSave('test_translator', Object) Drupal\Core\Entity\EntityStorageBase->save(Object) Drupal\Core\Config\Entity\ConfigEntityStorage->save(Object) Drupal\Core\Entity\Entity->save() Drupal\Core\Config\Entity\ConfigEntityBase->save() tmgmt_translator_auto_create(Array) tmgmt_modules_installed(Array) call_user_func_array('tmgmt_modules_installed', Array) Drupal\Core\Extension\ModuleHandler->invokeAll('modules_installed', Array) Drupal\Core\Extension\ModuleInstaller->install(Array, 1) Drupal\Core\ProxyClass\Extension\ModuleInstaller->install(Array, 1) Drupal\simpletest\WebTestBase->installModulesFromClassProperty(Object) Drupal\simpletest\WebTestBase->setUp() Drupal\tmgmt\Tests\TMGMTTestBase->setUp() Drupal\tmgmt_demo\Tests\TMGMTDemoTest->setUp() Drupal\simpletest\TestBase->run(Array) simpletest_script_run_one_test('1', 'Drupal\tmgmt_demo\Tests\TMGMTDemoTest') Uncaught exceptionConfigSchemaChecker.php98Drupal\Core\Config\Testing\ConfigSchemaChecker->onConfigSave()
ExpandDrupal\tmgmt_file\Tests\FileTranslatorTest011
MessageGroupFilenameLineFunctionStatus
The test did not complete due to a fatal error.Completion checkFileTranslatorTest.php42Drupal\tmgmt_file\Tests\FileTranslatorTest->testXLIFFTextProcessing()
Drupal\Core\Config\Schema\SchemaIncompleteException: Schema errors for tmgmt.translator.test_translator with the following errors: tmgmt.translator.test_translator:settings.auto_accept missing schema in Drupal\Core\Config\Testing\ConfigSchemaChecker->onConfigSave() (line 98 of /var/lib/drupaltestbot/sites/default/files/checkout/core/lib/Drupal/Core/Config/Testing/ConfigSchemaChecker.php). Drupal\Core\Config\Testing\ConfigSchemaChecker->onConfigSave(Object, 'config.save', Object) Drupal\Component\EventDispatcher\ContainerAwareEventDispatcher->dispatch('config.save', Object) Drupal\Core\Config\Config->save() Drupal\Core\Config\Entity\ConfigEntityStorage->doSave('test_translator', Object) Drupal\Core\Entity\EntityStorageBase->save(Object) Drupal\Core\Config\Entity\ConfigEntityStorage->save(Object) Drupal\Core\Entity\Entity->save() Drupal\Core\Config\Entity\ConfigEntityBase->save() tmgmt_translator_auto_create(Array) tmgmt_modules_installed(Array) call_user_func_array('tmgmt_modules_installed', Array) Drupal\Core\Extension\ModuleHandler->invokeAll('modules_installed', Array) Drupal\Core\Extension\ModuleInstaller->install(Array, 1) Drupal\Core\ProxyClass\Extension\ModuleInstaller->install(Array, 1) Drupal\simpletest\WebTestBase->installModulesFromClassProperty(Object) Drupal\simpletest\WebTestBase->setUp() Drupal\tmgmt\Tests\TMGMTTestBase->setUp() Drupal\tmgmt_file\Tests\FileTranslatorTest->setUp() Drupal\simpletest\TestBase->run(Array) simpletest_script_run_one_test('19', 'Drupal\tmgmt_file\Tests\FileTranslatorTest') Uncaught exceptionConfigSchemaChecker.php98Drupal\Core\Config\Testing\ConfigSchemaChecker->onConfigSave()
ExpandDrupal\tmgmt_locale\Tests\LocaleSourceUiTest011
MessageGroupFilenameLineFunctionStatus
The test did not complete due to a fatal error.Completion checkLocaleSourceUiTest.php43Drupal\tmgmt_locale\Tests\LocaleSourceUiTest->testOverview()
Drupal\Core\Config\Schema\SchemaIncompleteException: Schema errors for tmgmt.translator.test_translator with the following errors: tmgmt.translator.test_translator:settings.auto_accept missing schema in Drupal\Core\Config\Testing\ConfigSchemaChecker->onConfigSave() (line 98 of /var/lib/drupaltestbot/sites/default/files/checkout/core/lib/Drupal/Core/Config/Testing/ConfigSchemaChecker.php). Drupal\Core\Config\Testing\ConfigSchemaChecker->onConfigSave(Object, 'config.save', Object) Drupal\Component\EventDispatcher\ContainerAwareEventDispatcher->dispatch('config.save', Object) Drupal\Core\Config\Config->save() Drupal\Core\Config\Entity\ConfigEntityStorage->doSave('test_translator', Object) Drupal\Core\Entity\EntityStorageBase->save(Object) Drupal\Core\Config\Entity\ConfigEntityStorage->save(Object) Drupal\Core\Entity\Entity->save() Drupal\Core\Config\Entity\ConfigEntityBase->save() tmgmt_translator_auto_create(Array) tmgmt_modules_installed(Array) call_user_func_array('tmgmt_modules_installed', Array) Drupal\Core\Extension\ModuleHandler->invokeAll('modules_installed', Array) Drupal\Core\Extension\ModuleInstaller->install(Array, 1) Drupal\Core\ProxyClass\Extension\ModuleInstaller->install(Array, 1) Drupal\simpletest\WebTestBase->installModulesFromClassProperty(Object) Drupal\simpletest\WebTestBase->setUp() Drupal\tmgmt\Tests\TMGMTTestBase->setUp() Drupal\tmgmt_locale\Tests\LocaleSourceUiTest->setUp() Drupal\simpletest\TestBase->run(Array) simpletest_script_run_one_test('6', 'Drupal\tmgmt_locale\Tests\LocaleSourceUiTest') Uncaught exceptionConfigSchemaChecker.php98Drupal\Core\Config\Testing\ConfigSchemaChecker->onConfigSave()

All

Test namePassFailException
LeafDrupal\tmgmt\Tests\CrudTest19900
LeafDrupal\tmgmt\Tests\HelperTest4300
ExpandDrupal\tmgmt\Tests\LocalTasksTests011
MessageGroupFilenameLineFunctionStatus
The test did not complete due to a fatal error.Completion checkLocalTasksTests.php38Drupal\tmgmt\Tests\LocalTasksTests->testTranslatorLocalTaks()
Drupal\Core\Config\Schema\SchemaIncompleteException: Schema errors for tmgmt.translator.test_translator with the following errors: tmgmt.translator.test_translator:settings.auto_accept missing schema in Drupal\Core\Config\Testing\ConfigSchemaChecker->onConfigSave() (line 98 of /var/lib/drupaltestbot/sites/default/files/checkout/core/lib/Drupal/Core/Config/Testing/ConfigSchemaChecker.php). Drupal\Core\Config\Testing\ConfigSchemaChecker->onConfigSave(Object, 'config.save', Object) Drupal\Component\EventDispatcher\ContainerAwareEventDispatcher->dispatch('config.save', Object) Drupal\Core\Config\Config->save() Drupal\Core\Config\Entity\ConfigEntityStorage->doSave('test_translator', Object) Drupal\Core\Entity\EntityStorageBase->save(Object) Drupal\Core\Config\Entity\ConfigEntityStorage->save(Object) Drupal\Core\Entity\Entity->save() Drupal\Core\Config\Entity\ConfigEntityBase->save() tmgmt_translator_auto_create(Array) tmgmt_modules_installed(Array) call_user_func_array('tmgmt_modules_installed', Array) Drupal\Core\Extension\ModuleHandler->invokeAll('modules_installed', Array) Drupal\Core\Extension\ModuleInstaller->install(Array, 1) Drupal\Core\ProxyClass\Extension\ModuleInstaller->install(Array, 1) Drupal\simpletest\WebTestBase->installModulesFromClassProperty(Object) Drupal\simpletest\WebTestBase->setUp() Drupal\tmgmt\Tests\TMGMTTestBase->setUp() Drupal\tmgmt\Tests\LocalTasksTests->setUp() Drupal\simpletest\TestBase->run(Array) simpletest_script_run_one_test('16', 'Drupal\tmgmt\Tests\LocalTasksTests') Uncaught exceptionConfigSchemaChecker.php98Drupal\Core\Config\Testing\ConfigSchemaChecker->onConfigSave()
LeafDrupal\tmgmt\Tests\PluginsTest5000
ExpandDrupal\tmgmt\Tests\TMGMTCartTest011
MessageGroupFilenameLineFunctionStatus
The test did not complete due to a fatal error.Completion checkTMGMTCartTest.php43Drupal\tmgmt\Tests\TMGMTCartTest->testCartEnforceSourceLanguage()
Drupal\Core\Config\Schema\SchemaIncompleteException: Schema errors for tmgmt.translator.test_translator with the following errors: tmgmt.translator.test_translator:settings.auto_accept missing schema in Drupal\Core\Config\Testing\ConfigSchemaChecker->onConfigSave() (line 98 of /var/lib/drupaltestbot/sites/default/files/checkout/core/lib/Drupal/Core/Config/Testing/ConfigSchemaChecker.php). Drupal\Core\Config\Testing\ConfigSchemaChecker->onConfigSave(Object, 'config.save', Object) Drupal\Component\EventDispatcher\ContainerAwareEventDispatcher->dispatch('config.save', Object) Drupal\Core\Config\Config->save() Drupal\Core\Config\Entity\ConfigEntityStorage->doSave('test_translator', Object) Drupal\Core\Entity\EntityStorageBase->save(Object) Drupal\Core\Config\Entity\ConfigEntityStorage->save(Object) Drupal\Core\Entity\Entity->save() Drupal\Core\Config\Entity\ConfigEntityBase->save() tmgmt_translator_auto_create(Array) tmgmt_modules_installed(Array) call_user_func_array('tmgmt_modules_installed', Array) Drupal\Core\Extension\ModuleHandler->invokeAll('modules_installed', Array) Drupal\Core\Extension\ModuleInstaller->install(Array, 1) Drupal\Core\ProxyClass\Extension\ModuleInstaller->install(Array, 1) Drupal\simpletest\WebTestBase->installModulesFromClassProperty(Object) Drupal\simpletest\WebTestBase->setUp() Drupal\tmgmt\Tests\TMGMTTestBase->setUp() Drupal\tmgmt\Tests\TMGMTCartTest->setUp() Drupal\simpletest\TestBase->run(Array) simpletest_script_run_one_test('14', 'Drupal\tmgmt\Tests\TMGMTCartTest') Uncaught exceptionConfigSchemaChecker.php98Drupal\Core\Config\Testing\ConfigSchemaChecker->onConfigSave()
ExpandDrupal\tmgmt\Tests\TMGMTUiTest011
MessageGroupFilenameLineFunctionStatus
The test did not complete due to a fatal error.Completion checkTMGMTUiTest.php53Drupal\tmgmt\Tests\TMGMTUiTest->testCheckoutForm()
Drupal\Core\Config\Schema\SchemaIncompleteException: Schema errors for tmgmt.translator.test_translator with the following errors: tmgmt.translator.test_translator:settings.auto_accept missing schema in Drupal\Core\Config\Testing\ConfigSchemaChecker->onConfigSave() (line 98 of /var/lib/drupaltestbot/sites/default/files/checkout/core/lib/Drupal/Core/Config/Testing/ConfigSchemaChecker.php). Drupal\Core\Config\Testing\ConfigSchemaChecker->onConfigSave(Object, 'config.save', Object) Drupal\Component\EventDispatcher\ContainerAwareEventDispatcher->dispatch('config.save', Object) Drupal\Core\Config\Config->save() Drupal\Core\Config\Entity\ConfigEntityStorage->doSave('test_translator', Object) Drupal\Core\Entity\EntityStorageBase->save(Object) Drupal\Core\Config\Entity\ConfigEntityStorage->save(Object) Drupal\Core\Entity\Entity->save() Drupal\Core\Config\Entity\ConfigEntityBase->save() tmgmt_translator_auto_create(Array) tmgmt_modules_installed(Array) call_user_func_array('tmgmt_modules_installed', Array) Drupal\Core\Extension\ModuleHandler->invokeAll('modules_installed', Array) Drupal\Core\Extension\ModuleInstaller->install(Array, 1) Drupal\Core\ProxyClass\Extension\ModuleInstaller->install(Array, 1) Drupal\simpletest\WebTestBase->installModulesFromClassProperty(Object) Drupal\simpletest\WebTestBase->setUp() Drupal\tmgmt\Tests\TMGMTTestBase->setUp() Drupal\tmgmt\Tests\TMGMTUiTest->setUp() Drupal\simpletest\TestBase->run(Array) simpletest_script_run_one_test('13', 'Drupal\tmgmt\Tests\TMGMTUiTest') Uncaught exceptionConfigSchemaChecker.php98Drupal\Core\Config\Testing\ConfigSchemaChecker->onConfigSave()
ExpandDrupal\tmgmt\Tests\TranslatorTest011
MessageGroupFilenameLineFunctionStatus
The test did not complete due to a fatal error.Completion checkTranslatorTest.php40Drupal\tmgmt\Tests\TranslatorTest->testTranslatorHandling()
Drupal\Core\Config\Schema\SchemaIncompleteException: Schema errors for tmgmt.translator.test_translator with the following errors: tmgmt.translator.test_translator:settings.auto_accept missing schema in Drupal\Core\Config\Testing\ConfigSchemaChecker->onConfigSave() (line 98 of /var/lib/drupaltestbot/sites/default/files/checkout/core/lib/Drupal/Core/Config/Testing/ConfigSchemaChecker.php). Drupal\Core\Config\Testing\ConfigSchemaChecker->onConfigSave(Object, 'config.save', Object) Drupal\Component\EventDispatcher\ContainerAwareEventDispatcher->dispatch('config.save', Object) Drupal\Core\Config\Config->save() Drupal\Core\Config\Entity\ConfigEntityStorage->doSave('test_translator', Object) Drupal\Core\Entity\EntityStorageBase->save(Object) Drupal\Core\Config\Entity\ConfigEntityStorage->save(Object) Drupal\Core\Entity\Entity->save() Drupal\Core\Config\Entity\ConfigEntityBase->save() tmgmt_translator_auto_create(Array) tmgmt_modules_installed(Array) call_user_func_array('tmgmt_modules_installed', Array) Drupal\Core\Extension\ModuleHandler->invokeAll('modules_installed', Array) Drupal\Core\Extension\ModuleInstaller->install(Array, 1) Drupal\Core\ProxyClass\Extension\ModuleInstaller->install(Array, 1) Drupal\simpletest\WebTestBase->installModulesFromClassProperty(Object) Drupal\simpletest\WebTestBase->setUp() Drupal\tmgmt\Tests\TMGMTTestBase->setUp() Drupal\tmgmt\Tests\TranslatorTest->setUp() Drupal\simpletest\TestBase->run(Array) simpletest_script_run_one_test('12', 'Drupal\tmgmt\Tests\TranslatorTest') Uncaught exceptionConfigSchemaChecker.php98Drupal\Core\Config\Testing\ConfigSchemaChecker->onConfigSave()
ExpandDrupal\tmgmt\Tests\TranslatorUITest011
MessageGroupFilenameLineFunctionStatus
The test did not complete due to a fatal error.Completion checkTranslatorUITest.php37Drupal\tmgmt\Tests\TranslatorUITest->testTranslatorUI()
Drupal\Core\Config\Schema\SchemaIncompleteException: Schema errors for tmgmt.translator.test_translator with the following errors: tmgmt.translator.test_translator:settings.auto_accept missing schema in Drupal\Core\Config\Testing\ConfigSchemaChecker->onConfigSave() (line 98 of /var/lib/drupaltestbot/sites/default/files/checkout/core/lib/Drupal/Core/Config/Testing/ConfigSchemaChecker.php). Drupal\Core\Config\Testing\ConfigSchemaChecker->onConfigSave(Object, 'config.save', Object) Drupal\Component\EventDispatcher\ContainerAwareEventDispatcher->dispatch('config.save', Object) Drupal\Core\Config\Config->save() Drupal\Core\Config\Entity\ConfigEntityStorage->doSave('test_translator', Object) Drupal\Core\Entity\EntityStorageBase->save(Object) Drupal\Core\Config\Entity\ConfigEntityStorage->save(Object) Drupal\Core\Entity\Entity->save() Drupal\Core\Config\Entity\ConfigEntityBase->save() tmgmt_translator_auto_create(Array) tmgmt_modules_installed(Array) call_user_func_array('tmgmt_modules_installed', Array) Drupal\Core\Extension\ModuleHandler->invokeAll('modules_installed', Array) Drupal\Core\Extension\ModuleInstaller->install(Array, 1) Drupal\Core\ProxyClass\Extension\ModuleInstaller->install(Array, 1) Drupal\simpletest\WebTestBase->installModulesFromClassProperty(Object) Drupal\simpletest\WebTestBase->setUp() Drupal\tmgmt\Tests\TMGMTTestBase->setUp() Drupal\tmgmt\Tests\TranslatorUITest->setUp() Drupal\simpletest\TestBase->run(Array) simpletest_script_run_one_test('11', 'Drupal\tmgmt\Tests\TranslatorUITest') Uncaught exceptionConfigSchemaChecker.php98Drupal\Core\Config\Testing\ConfigSchemaChecker->onConfigSave()
ExpandDrupal\tmgmt_config\Tests\ConfigSourceListTest011
MessageGroupFilenameLineFunctionStatus
The test did not complete due to a fatal error.Completion checkConfigSourceListTest.php56Drupal\tmgmt_config\Tests\ConfigSourceListTest->testNodeTypeSubmissions()
Drupal\Core\Config\Schema\SchemaIncompleteException: Schema errors for tmgmt.translator.test_translator with the following errors: tmgmt.translator.test_translator:settings.auto_accept missing schema in Drupal\Core\Config\Testing\ConfigSchemaChecker->onConfigSave() (line 98 of /var/lib/drupaltestbot/sites/default/files/checkout/core/lib/Drupal/Core/Config/Testing/ConfigSchemaChecker.php). Drupal\Core\Config\Testing\ConfigSchemaChecker->onConfigSave(Object, 'config.save', Object) Drupal\Component\EventDispatcher\ContainerAwareEventDispatcher->dispatch('config.save', Object) Drupal\Core\Config\Config->save() Drupal\Core\Config\Entity\ConfigEntityStorage->doSave('test_translator', Object) Drupal\Core\Entity\EntityStorageBase->save(Object) Drupal\Core\Config\Entity\ConfigEntityStorage->save(Object) Drupal\Core\Entity\Entity->save() Drupal\Core\Config\Entity\ConfigEntityBase->save() tmgmt_translator_auto_create(Array) tmgmt_modules_installed(Array) call_user_func_array('tmgmt_modules_installed', Array) Drupal\Core\Extension\ModuleHandler->invokeAll('modules_installed', Array) Drupal\Core\Extension\ModuleInstaller->install(Array, 1) Drupal\Core\ProxyClass\Extension\ModuleInstaller->install(Array, 1) Drupal\simpletest\WebTestBase->installModulesFromClassProperty(Object) Drupal\simpletest\WebTestBase->setUp() Drupal\tmgmt\Tests\TMGMTTestBase->setUp() Drupal\tmgmt_config\Tests\ConfigSourceListTest->setUp() Drupal\simpletest\TestBase->run(Array) simpletest_script_run_one_test('10', 'Drupal\tmgmt_config\Tests\ConfigSourceListTest') Uncaught exceptionConfigSchemaChecker.php98Drupal\Core\Config\Testing\ConfigSchemaChecker->onConfigSave()
ExpandDrupal\tmgmt_config\Tests\ConfigSourceUiTest011
MessageGroupFilenameLineFunctionStatus
The test did not complete due to a fatal error.Completion checkConfigSourceUiTest.php52Drupal\tmgmt_config\Tests\ConfigSourceUiTest->testNodeTypeTranslateTabSingleCheckout()
Drupal\Core\Config\Schema\SchemaIncompleteException: Schema errors for tmgmt.translator.test_translator with the following errors: tmgmt.translator.test_translator:settings.auto_accept missing schema in Drupal\Core\Config\Testing\ConfigSchemaChecker->onConfigSave() (line 98 of /var/lib/drupaltestbot/sites/default/files/checkout/core/lib/Drupal/Core/Config/Testing/ConfigSchemaChecker.php). Drupal\Core\Config\Testing\ConfigSchemaChecker->onConfigSave(Object, 'config.save', Object) Drupal\Component\EventDispatcher\ContainerAwareEventDispatcher->dispatch('config.save', Object) Drupal\Core\Config\Config->save() Drupal\Core\Config\Entity\ConfigEntityStorage->doSave('test_translator', Object) Drupal\Core\Entity\EntityStorageBase->save(Object) Drupal\Core\Config\Entity\ConfigEntityStorage->save(Object) Drupal\Core\Entity\Entity->save() Drupal\Core\Config\Entity\ConfigEntityBase->save() tmgmt_translator_auto_create(Array) tmgmt_modules_installed(Array) call_user_func_array('tmgmt_modules_installed', Array) Drupal\Core\Extension\ModuleHandler->invokeAll('modules_installed', Array) Drupal\Core\Extension\ModuleInstaller->install(Array, 1) Drupal\Core\ProxyClass\Extension\ModuleInstaller->install(Array, 1) Drupal\simpletest\WebTestBase->installModulesFromClassProperty(Object) Drupal\simpletest\WebTestBase->setUp() Drupal\tmgmt\Tests\TMGMTTestBase->setUp() Drupal\tmgmt_config\Tests\ConfigSourceUiTest->setUp() Drupal\simpletest\TestBase->run(Array) simpletest_script_run_one_test('8', 'Drupal\tmgmt_config\Tests\ConfigSourceUiTest') Uncaught exceptionConfigSchemaChecker.php98Drupal\Core\Config\Testing\ConfigSchemaChecker->onConfigSave()
ExpandDrupal\tmgmt_config\Tests\ConfigSourceUnitTest1211
MessageGroupFilenameLineFunctionStatus
The test did not complete due to a fatal error.Completion checkConfigSourceUnitTest.php54Drupal\tmgmt_config\Tests\ConfigSourceUnitTest->testNodeType()
Drupal\Core\Config\Schema\SchemaIncompleteException: Schema errors for tmgmt.translator.test_translator with the following errors: tmgmt.translator.test_translator:settings.auto_accept missing schema in Drupal\Core\Config\Testing\ConfigSchemaChecker->onConfigSave() (line 98 of /var/lib/drupaltestbot/sites/default/files/checkout/core/lib/Drupal/Core/Config/Testing/ConfigSchemaChecker.php). Drupal\Core\Config\Testing\ConfigSchemaChecker->onConfigSave(Object, 'config.save', Object) Drupal\Component\EventDispatcher\ContainerAwareEventDispatcher->dispatch('config.save', Object) Drupal\Core\Config\Config->save() Drupal\Core\Config\Entity\ConfigEntityStorage->doSave('test_translator', Object) Drupal\Core\Entity\EntityStorageBase->save(Object) Drupal\Core\Config\Entity\ConfigEntityStorage->save(Object) Drupal\Core\Entity\Entity->save() Drupal\Core\Config\Entity\ConfigEntityBase->save() tmgmt_translator_auto_create(Array) Drupal\tmgmt_config\Tests\ConfigSourceUnitTest->setUp() Drupal\simpletest\TestBase->run(Array) simpletest_script_run_one_test('9', 'Drupal\tmgmt_config\Tests\ConfigSourceUnitTest') Uncaught exceptionConfigSchemaChecker.php98Drupal\Core\Config\Testing\ConfigSchemaChecker->onConfigSave()
ExpandDrupal\tmgmt_content\Tests\ContentEntitySourceListTest011
MessageGroupFilenameLineFunctionStatus
The test did not complete due to a fatal error.Completion checkContentEntitySourceListTest.php64Drupal\tmgmt_content\Tests\ContentEntitySourceListTest->testTermBundleFilter()
Drupal\Core\Config\Schema\SchemaIncompleteException: Schema errors for tmgmt.translator.test_translator with the following errors: tmgmt.translator.test_translator:settings.auto_accept missing schema in Drupal\Core\Config\Testing\ConfigSchemaChecker->onConfigSave() (line 98 of /var/lib/drupaltestbot/sites/default/files/checkout/core/lib/Drupal/Core/Config/Testing/ConfigSchemaChecker.php). Drupal\Core\Config\Testing\ConfigSchemaChecker->onConfigSave(Object, 'config.save', Object) Drupal\Component\EventDispatcher\ContainerAwareEventDispatcher->dispatch('config.save', Object) Drupal\Core\Config\Config->save() Drupal\Core\Config\Entity\ConfigEntityStorage->doSave('test_translator', Object) Drupal\Core\Entity\EntityStorageBase->save(Object) Drupal\Core\Config\Entity\ConfigEntityStorage->save(Object) Drupal\Core\Entity\Entity->save() Drupal\Core\Config\Entity\ConfigEntityBase->save() tmgmt_translator_auto_create(Array) tmgmt_modules_installed(Array) call_user_func_array('tmgmt_modules_installed', Array) Drupal\Core\Extension\ModuleHandler->invokeAll('modules_installed', Array) Drupal\Core\Extension\ModuleInstaller->install(Array, 1) Drupal\Core\ProxyClass\Extension\ModuleInstaller->install(Array, 1) Drupal\simpletest\WebTestBase->installModulesFromClassProperty(Object) Drupal\simpletest\WebTestBase->setUp() Drupal\tmgmt\Tests\TMGMTTestBase->setUp() Drupal\tmgmt_content\Tests\ContentEntitySourceListTest->setUp() Drupal\simpletest\TestBase->run(Array) simpletest_script_run_one_test('5', 'Drupal\tmgmt_content\Tests\ContentEntitySourceListTest') Uncaught exceptionConfigSchemaChecker.php98Drupal\Core\Config\Testing\ConfigSchemaChecker->onConfigSave()
ExpandDrupal\tmgmt_content\Tests\ContentEntitySourceUiTest011
MessageGroupFilenameLineFunctionStatus
The test did not complete due to a fatal error.Completion checkContentEntitySourceUiTest.php58Drupal\tmgmt_content\Tests\ContentEntitySourceUiTest->testNodeTranslateTabSingleCheckout()
Drupal\Core\Config\Schema\SchemaIncompleteException: Schema errors for tmgmt.translator.test_translator with the following errors: tmgmt.translator.test_translator:settings.auto_accept missing schema in Drupal\Core\Config\Testing\ConfigSchemaChecker->onConfigSave() (line 98 of /var/lib/drupaltestbot/sites/default/files/checkout/core/lib/Drupal/Core/Config/Testing/ConfigSchemaChecker.php). Drupal\Core\Config\Testing\ConfigSchemaChecker->onConfigSave(Object, 'config.save', Object) Drupal\Component\EventDispatcher\ContainerAwareEventDispatcher->dispatch('config.save', Object) Drupal\Core\Config\Config->save() Drupal\Core\Config\Entity\ConfigEntityStorage->doSave('test_translator', Object) Drupal\Core\Entity\EntityStorageBase->save(Object) Drupal\Core\Config\Entity\ConfigEntityStorage->save(Object) Drupal\Core\Entity\Entity->save() Drupal\Core\Config\Entity\ConfigEntityBase->save() tmgmt_translator_auto_create(Array) tmgmt_modules_installed(Array) call_user_func_array('tmgmt_modules_installed', Array) Drupal\Core\Extension\ModuleHandler->invokeAll('modules_installed', Array) Drupal\Core\Extension\ModuleInstaller->install(Array, 1) Drupal\Core\ProxyClass\Extension\ModuleInstaller->install(Array, 1) Drupal\simpletest\WebTestBase->installModulesFromClassProperty(Object) Drupal\simpletest\WebTestBase->setUp() Drupal\tmgmt\Tests\TMGMTTestBase->setUp() Drupal\tmgmt_content\Tests\ContentEntitySourceUiTest->setUp() Drupal\simpletest\TestBase->run(Array) simpletest_script_run_one_test('2', 'Drupal\tmgmt_content\Tests\ContentEntitySourceUiTest') Uncaught exceptionConfigSchemaChecker.php98Drupal\Core\Config\Testing\ConfigSchemaChecker->onConfigSave()
ExpandDrupal\tmgmt_content\Tests\ContentEntitySourceUnitTest1711
MessageGroupFilenameLineFunctionStatus
The test did not complete due to a fatal error.Completion checkContentEntitySourceUnitTest.php98Drupal\tmgmt_content\Tests\ContentEntitySourceUnitTest->testEntityTest()
Drupal\Core\Config\Schema\SchemaIncompleteException: Schema errors for tmgmt.translator.test_translator with the following errors: tmgmt.translator.test_translator:settings.auto_accept missing schema in Drupal\Core\Config\Testing\ConfigSchemaChecker->onConfigSave() (line 98 of /var/lib/drupaltestbot/sites/default/files/checkout/core/lib/Drupal/Core/Config/Testing/ConfigSchemaChecker.php). Drupal\Core\Config\Testing\ConfigSchemaChecker->onConfigSave(Object, 'config.save', Object) Drupal\Component\EventDispatcher\ContainerAwareEventDispatcher->dispatch('config.save', Object) Drupal\Core\Config\Config->save() Drupal\Core\Config\Entity\ConfigEntityStorage->doSave('test_translator', Object) Drupal\Core\Entity\EntityStorageBase->save(Object) Drupal\Core\Config\Entity\ConfigEntityStorage->save(Object) Drupal\Core\Entity\Entity->save() Drupal\Core\Config\Entity\ConfigEntityBase->save() tmgmt_translator_auto_create(Array) Drupal\tmgmt_content\Tests\ContentEntitySourceUnitTest->setUp() Drupal\simpletest\TestBase->run(Array) simpletest_script_run_one_test('4', 'Drupal\tmgmt_content\Tests\ContentEntitySourceUnitTest') Uncaught exceptionConfigSchemaChecker.php98Drupal\Core\Config\Testing\ConfigSchemaChecker->onConfigSave()
LeafDrupal\tmgmt_content\Tests\ContentEntitySuggestionsTest2400
ExpandDrupal\tmgmt_demo\Tests\TMGMTDemoTest011
MessageGroupFilenameLineFunctionStatus
The test did not complete due to a fatal error.Completion checkTMGMTDemoTest.php40Drupal\tmgmt_demo\Tests\TMGMTDemoTest->testInstalled()
Drupal\Core\Config\Schema\SchemaIncompleteException: Schema errors for tmgmt.translator.test_translator with the following errors: tmgmt.translator.test_translator:settings.auto_accept missing schema in Drupal\Core\Config\Testing\ConfigSchemaChecker->onConfigSave() (line 98 of /var/lib/drupaltestbot/sites/default/files/checkout/core/lib/Drupal/Core/Config/Testing/ConfigSchemaChecker.php). Drupal\Core\Config\Testing\ConfigSchemaChecker->onConfigSave(Object, 'config.save', Object) Drupal\Component\EventDispatcher\ContainerAwareEventDispatcher->dispatch('config.save', Object) Drupal\Core\Config\Config->save() Drupal\Core\Config\Entity\ConfigEntityStorage->doSave('test_translator', Object) Drupal\Core\Entity\EntityStorageBase->save(Object) Drupal\Core\Config\Entity\ConfigEntityStorage->save(Object) Drupal\Core\Entity\Entity->save() Drupal\Core\Config\Entity\ConfigEntityBase->save() tmgmt_translator_auto_create(Array) tmgmt_modules_installed(Array) call_user_func_array('tmgmt_modules_installed', Array) Drupal\Core\Extension\ModuleHandler->invokeAll('modules_installed', Array) Drupal\Core\Extension\ModuleInstaller->install(Array, 1) Drupal\Core\ProxyClass\Extension\ModuleInstaller->install(Array, 1) Drupal\simpletest\WebTestBase->installModulesFromClassProperty(Object) Drupal\simpletest\WebTestBase->setUp() Drupal\tmgmt\Tests\TMGMTTestBase->setUp() Drupal\tmgmt_demo\Tests\TMGMTDemoTest->setUp() Drupal\simpletest\TestBase->run(Array) simpletest_script_run_one_test('1', 'Drupal\tmgmt_demo\Tests\TMGMTDemoTest') Uncaught exceptionConfigSchemaChecker.php98Drupal\Core\Config\Testing\ConfigSchemaChecker->onConfigSave()
ExpandDrupal\tmgmt_file\Tests\FileTranslatorTest011
MessageGroupFilenameLineFunctionStatus
The test did not complete due to a fatal error.Completion checkFileTranslatorTest.php42Drupal\tmgmt_file\Tests\FileTranslatorTest->testXLIFFTextProcessing()
Drupal\Core\Config\Schema\SchemaIncompleteException: Schema errors for tmgmt.translator.test_translator with the following errors: tmgmt.translator.test_translator:settings.auto_accept missing schema in Drupal\Core\Config\Testing\ConfigSchemaChecker->onConfigSave() (line 98 of /var/lib/drupaltestbot/sites/default/files/checkout/core/lib/Drupal/Core/Config/Testing/ConfigSchemaChecker.php). Drupal\Core\Config\Testing\ConfigSchemaChecker->onConfigSave(Object, 'config.save', Object) Drupal\Component\EventDispatcher\ContainerAwareEventDispatcher->dispatch('config.save', Object) Drupal\Core\Config\Config->save() Drupal\Core\Config\Entity\ConfigEntityStorage->doSave('test_translator', Object) Drupal\Core\Entity\EntityStorageBase->save(Object) Drupal\Core\Config\Entity\ConfigEntityStorage->save(Object) Drupal\Core\Entity\Entity->save() Drupal\Core\Config\Entity\ConfigEntityBase->save() tmgmt_translator_auto_create(Array) tmgmt_modules_installed(Array) call_user_func_array('tmgmt_modules_installed', Array) Drupal\Core\Extension\ModuleHandler->invokeAll('modules_installed', Array) Drupal\Core\Extension\ModuleInstaller->install(Array, 1) Drupal\Core\ProxyClass\Extension\ModuleInstaller->install(Array, 1) Drupal\simpletest\WebTestBase->installModulesFromClassProperty(Object) Drupal\simpletest\WebTestBase->setUp() Drupal\tmgmt\Tests\TMGMTTestBase->setUp() Drupal\tmgmt_file\Tests\FileTranslatorTest->setUp() Drupal\simpletest\TestBase->run(Array) simpletest_script_run_one_test('19', 'Drupal\tmgmt_file\Tests\FileTranslatorTest') Uncaught exceptionConfigSchemaChecker.php98Drupal\Core\Config\Testing\ConfigSchemaChecker->onConfigSave()
LeafDrupal\tmgmt_locale\Tests\LocaleSourceTest6300
ExpandDrupal\tmgmt_locale\Tests\LocaleSourceUiTest011
MessageGroupFilenameLineFunctionStatus
The test did not complete due to a fatal error.Completion checkLocaleSourceUiTest.php43Drupal\tmgmt_locale\Tests\LocaleSourceUiTest->testOverview()
Drupal\Core\Config\Schema\SchemaIncompleteException: Schema errors for tmgmt.translator.test_translator with the following errors: tmgmt.translator.test_translator:settings.auto_accept missing schema in Drupal\Core\Config\Testing\ConfigSchemaChecker->onConfigSave() (line 98 of /var/lib/drupaltestbot/sites/default/files/checkout/core/lib/Drupal/Core/Config/Testing/ConfigSchemaChecker.php). Drupal\Core\Config\Testing\ConfigSchemaChecker->onConfigSave(Object, 'config.save', Object) Drupal\Component\EventDispatcher\ContainerAwareEventDispatcher->dispatch('config.save', Object) Drupal\Core\Config\Config->save() Drupal\Core\Config\Entity\ConfigEntityStorage->doSave('test_translator', Object) Drupal\Core\Entity\EntityStorageBase->save(Object) Drupal\Core\Config\Entity\ConfigEntityStorage->save(Object) Drupal\Core\Entity\Entity->save() Drupal\Core\Config\Entity\ConfigEntityBase->save() tmgmt_translator_auto_create(Array) tmgmt_modules_installed(Array) call_user_func_array('tmgmt_modules_installed', Array) Drupal\Core\Extension\ModuleHandler->invokeAll('modules_installed', Array) Drupal\Core\Extension\ModuleInstaller->install(Array, 1) Drupal\Core\ProxyClass\Extension\ModuleInstaller->install(Array, 1) Drupal\simpletest\WebTestBase->installModulesFromClassProperty(Object) Drupal\simpletest\WebTestBase->setUp() Drupal\tmgmt\Tests\TMGMTTestBase->setUp() Drupal\tmgmt_locale\Tests\LocaleSourceUiTest->setUp() Drupal\simpletest\TestBase->run(Array) simpletest_script_run_one_test('6', 'Drupal\tmgmt_locale\Tests\LocaleSourceUiTest') Uncaught exceptionConfigSchemaChecker.php98Drupal\Core\Config\Testing\ConfigSchemaChecker->onConfigSave()