check_user_privileges-2577187-18.patch

Test status
StatusResult
Last receivedWed, 10/07/2015 - 07:55:01
Last requestedWed, 10/07/2015 - 07:55:01
Last testedWed, 10/07/2015 - 08:00:51
Test count1
Environment status
PHP 5.5 MySQLfail
File information
Filecheck_user_privileges-2577187-18.patch
BranchMonitoring - 8.x-1.x
LinkIssue Link
SummaryFAILED: [[SimpleTest]]: [PHP 5.5 MySQL] 1,318 pass(es), 5 fail(s), and 3 exception(s).
Details

PHP 5.5 MySQL

  1. Setup environment
  2. Detect an invalid patch URL
  3. Detect invalid repository information
  4. Detect invalid patch format
  5. Detect a non-applicable patch
  6. Detect invalid PHP syntax
  7. Detect a Drupal installation failure
  8. Detect a test run failure
  9. Detect a failing test
    Review the test failures below then if necessary run them locally until the problem has been fixed.
  10. Complete test suite with all tests passing
1,318 pass(es), 5 fail(s), and 3 exception(s)

Non-pass

Test namePassFailException
ExpandDrupal\monitoring\Tests\MonitoringApiTest211
MessageGroupFilenameLineFunctionStatus
The test did not complete due to a fatal error.Completion checkMonitoringApiTest.php36Drupal\monitoring\Tests\MonitoringApiTest->testAPI()
Drupal\Component\Plugin\Exception\PluginNotFoundException: The "node" entity type does not exist. in Drupal\Core\Entity\EntityManager->getDefinition() (line 276 of /var/lib/drupaltestbot/sites/default/files/checkout/core/lib/Drupal/Core/Entity/EntityManager.php). Drupal\Core\Entity\EntityManager->getDefinition('node') Drupal\monitoring\Plugin\monitoring\SensorPlugin\ContentEntityAggregatorSensorPlugin->calculateDependencies() Drupal\monitoring\Entity\SensorConfig->calculateDependencies() Drupal\Core\Config\Entity\ConfigEntityBase->preSave(Object) Drupal\Core\Entity\EntityStorageBase->doPreSave(Object) Drupal\Core\Entity\EntityStorageBase->save(Object) Drupal\Core\Config\Entity\ConfigEntityStorage->save(Object) Drupal\Core\Entity\Entity->save() Drupal\Core\Config\Entity\ConfigEntityBase->save() Drupal\Core\Config\ConfigInstaller->createConfiguration('', Array, 1) Drupal\Core\Config\ConfigInstaller->installOptionalConfig(Object, '') Drupal\Core\Config\ConfigInstaller->installDefaultConfig('module', 'monitoring') Drupal\Core\ProxyClass\Config\ConfigInstaller->installDefaultConfig('module', 'monitoring') Drupal\simpletest\KernelTestBase->installConfig(Array) Drupal\monitoring\Tests\MonitoringUnitTestBase->setUp() Drupal\monitoring\Tests\MonitoringApiTest->setUp() Drupal\simpletest\TestBase->run(Array) simpletest_script_run_one_test('12', 'Drupal\monitoring\Tests\MonitoringApiTest') Uncaught exceptionEntityManager.php276Drupal\Core\Entity\EntityManager->getDefinition()
ExpandDrupal\monitoring\Tests\MonitoringPastTest211
MessageGroupFilenameLineFunctionStatus
The test did not complete due to a fatal error.Completion checkMonitoringPastTest.php36Drupal\monitoring\Tests\MonitoringPastTest->testPastSensors()
Drupal\Component\Plugin\Exception\PluginNotFoundException: The "node" entity type does not exist. in Drupal\Core\Entity\EntityManager->getDefinition() (line 276 of /var/lib/drupaltestbot/sites/default/files/checkout/core/lib/Drupal/Core/Entity/EntityManager.php). Drupal\Core\Entity\EntityManager->getDefinition('node') Drupal\monitoring\Plugin\monitoring\SensorPlugin\ContentEntityAggregatorSensorPlugin->calculateDependencies() Drupal\monitoring\Entity\SensorConfig->calculateDependencies() Drupal\Core\Config\Entity\ConfigEntityBase->preSave(Object) Drupal\Core\Entity\EntityStorageBase->doPreSave(Object) Drupal\Core\Entity\EntityStorageBase->save(Object) Drupal\Core\Config\Entity\ConfigEntityStorage->save(Object) Drupal\Core\Entity\Entity->save() Drupal\Core\Config\Entity\ConfigEntityBase->save() Drupal\Core\Config\ConfigInstaller->createConfiguration('', Array, 1) Drupal\Core\Config\ConfigInstaller->installOptionalConfig(Object, '') Drupal\Core\Config\ConfigInstaller->installDefaultConfig('module', 'monitoring') Drupal\Core\ProxyClass\Config\ConfigInstaller->installDefaultConfig('module', 'monitoring') Drupal\simpletest\KernelTestBase->installConfig(Array) Drupal\monitoring\Tests\MonitoringUnitTestBase->setUp() Drupal\monitoring\Tests\MonitoringPastTest->setUp() Drupal\simpletest\TestBase->run(Array) simpletest_script_run_one_test('9', 'Drupal\monitoring\Tests\MonitoringPastTest') Uncaught exceptionEntityManager.php276Drupal\Core\Entity\EntityManager->getDefinition()
ExpandDrupal\monitoring\Tests\MonitoringServicesTest1010
MessageGroupFilenameLineFunctionStatus
The test did not complete due to a fatal error.Completion checkMonitoringServicesTest.php65Drupal\monitoring\Tests\MonitoringServicesTest->testSensorConfig()
ExpandDrupal\monitoring\Tests\MonitoringViewDisplayTest011
MessageGroupFilenameLineFunctionStatus
The test did not complete due to a fatal error.Completion checkMonitoringViewDisplayTest.php25Drupal\monitoring\Tests\MonitoringViewDisplayTest->testViewDisplaySensor()
Drupal\Component\Plugin\Exception\PluginNotFoundException: The "node" entity type does not exist. in Drupal\Core\Entity\EntityManager->getDefinition() (line 276 of /var/lib/drupaltestbot/sites/default/files/checkout/core/lib/Drupal/Core/Entity/EntityManager.php). Drupal\Core\Entity\EntityManager->getDefinition('node') Drupal\monitoring\Plugin\monitoring\SensorPlugin\ContentEntityAggregatorSensorPlugin->calculateDependencies() Drupal\monitoring\Entity\SensorConfig->calculateDependencies() Drupal\Core\Config\Entity\ConfigEntityBase->preSave(Object) Drupal\Core\Entity\EntityStorageBase->doPreSave(Object) Drupal\Core\Entity\EntityStorageBase->save(Object) Drupal\Core\Config\Entity\ConfigEntityStorage->save(Object) Drupal\Core\Entity\Entity->save() Drupal\Core\Config\Entity\ConfigEntityBase->save() Drupal\Core\Config\ConfigInstaller->createConfiguration('', Array, 1) Drupal\Core\Config\ConfigInstaller->installOptionalConfig(Object, '') Drupal\Core\Config\ConfigInstaller->installDefaultConfig('module', 'monitoring') Drupal\Core\ProxyClass\Config\ConfigInstaller->installDefaultConfig('module', 'monitoring') Drupal\Core\Extension\ModuleInstaller->install(Array, 1) Drupal\Core\ProxyClass\Extension\ModuleInstaller->install(Array, 1) Drupal\simpletest\WebTestBase->installModulesFromClassProperty(Object) Drupal\simpletest\WebTestBase->setUp() Drupal\monitoring\Tests\MonitoringTestBase->setUp() Drupal\simpletest\TestBase->run(Array) simpletest_script_run_one_test('5', 'Drupal\monitoring\Tests\MonitoringViewDisplayTest') Uncaught exceptionEntityManager.php276Drupal\Core\Entity\EntityManager->getDefinition()
ExpandDrupal\monitoring_multigraph\Tests\MultigraphServicesTest1010
MessageGroupFilenameLineFunctionStatus
The test did not complete due to a fatal error.Completion checkMultigraphServicesTest.php71Drupal\monitoring_multigraph\Tests\MultigraphServicesTest->testMultigraph()

All

Test namePassFailException
ExpandDrupal\monitoring\Tests\MonitoringApiTest211
MessageGroupFilenameLineFunctionStatus
The test did not complete due to a fatal error.Completion checkMonitoringApiTest.php36Drupal\monitoring\Tests\MonitoringApiTest->testAPI()
Drupal\Component\Plugin\Exception\PluginNotFoundException: The "node" entity type does not exist. in Drupal\Core\Entity\EntityManager->getDefinition() (line 276 of /var/lib/drupaltestbot/sites/default/files/checkout/core/lib/Drupal/Core/Entity/EntityManager.php). Drupal\Core\Entity\EntityManager->getDefinition('node') Drupal\monitoring\Plugin\monitoring\SensorPlugin\ContentEntityAggregatorSensorPlugin->calculateDependencies() Drupal\monitoring\Entity\SensorConfig->calculateDependencies() Drupal\Core\Config\Entity\ConfigEntityBase->preSave(Object) Drupal\Core\Entity\EntityStorageBase->doPreSave(Object) Drupal\Core\Entity\EntityStorageBase->save(Object) Drupal\Core\Config\Entity\ConfigEntityStorage->save(Object) Drupal\Core\Entity\Entity->save() Drupal\Core\Config\Entity\ConfigEntityBase->save() Drupal\Core\Config\ConfigInstaller->createConfiguration('', Array, 1) Drupal\Core\Config\ConfigInstaller->installOptionalConfig(Object, '') Drupal\Core\Config\ConfigInstaller->installDefaultConfig('module', 'monitoring') Drupal\Core\ProxyClass\Config\ConfigInstaller->installDefaultConfig('module', 'monitoring') Drupal\simpletest\KernelTestBase->installConfig(Array) Drupal\monitoring\Tests\MonitoringUnitTestBase->setUp() Drupal\monitoring\Tests\MonitoringApiTest->setUp() Drupal\simpletest\TestBase->run(Array) simpletest_script_run_one_test('12', 'Drupal\monitoring\Tests\MonitoringApiTest') Uncaught exceptionEntityManager.php276Drupal\Core\Entity\EntityManager->getDefinition()
LeafDrupal\monitoring\Tests\MonitoringCaptchaTest1900
LeafDrupal\monitoring\Tests\MonitoringCoreKernelTest16200
LeafDrupal\monitoring\Tests\MonitoringCoreWebTest19400
ExpandDrupal\monitoring\Tests\MonitoringPastTest211
MessageGroupFilenameLineFunctionStatus
The test did not complete due to a fatal error.Completion checkMonitoringPastTest.php36Drupal\monitoring\Tests\MonitoringPastTest->testPastSensors()
Drupal\Component\Plugin\Exception\PluginNotFoundException: The "node" entity type does not exist. in Drupal\Core\Entity\EntityManager->getDefinition() (line 276 of /var/lib/drupaltestbot/sites/default/files/checkout/core/lib/Drupal/Core/Entity/EntityManager.php). Drupal\Core\Entity\EntityManager->getDefinition('node') Drupal\monitoring\Plugin\monitoring\SensorPlugin\ContentEntityAggregatorSensorPlugin->calculateDependencies() Drupal\monitoring\Entity\SensorConfig->calculateDependencies() Drupal\Core\Config\Entity\ConfigEntityBase->preSave(Object) Drupal\Core\Entity\EntityStorageBase->doPreSave(Object) Drupal\Core\Entity\EntityStorageBase->save(Object) Drupal\Core\Config\Entity\ConfigEntityStorage->save(Object) Drupal\Core\Entity\Entity->save() Drupal\Core\Config\Entity\ConfigEntityBase->save() Drupal\Core\Config\ConfigInstaller->createConfiguration('', Array, 1) Drupal\Core\Config\ConfigInstaller->installOptionalConfig(Object, '') Drupal\Core\Config\ConfigInstaller->installDefaultConfig('module', 'monitoring') Drupal\Core\ProxyClass\Config\ConfigInstaller->installDefaultConfig('module', 'monitoring') Drupal\simpletest\KernelTestBase->installConfig(Array) Drupal\monitoring\Tests\MonitoringUnitTestBase->setUp() Drupal\monitoring\Tests\MonitoringPastTest->setUp() Drupal\simpletest\TestBase->run(Array) simpletest_script_run_one_test('9', 'Drupal\monitoring\Tests\MonitoringPastTest') Uncaught exceptionEntityManager.php276Drupal\Core\Entity\EntityManager->getDefinition()
LeafDrupal\monitoring\Tests\MonitoringSearchAPITest1100
ExpandDrupal\monitoring\Tests\MonitoringServicesTest1010
MessageGroupFilenameLineFunctionStatus
The test did not complete due to a fatal error.Completion checkMonitoringServicesTest.php65Drupal\monitoring\Tests\MonitoringServicesTest->testSensorConfig()
LeafDrupal\monitoring\Tests\MonitoringUITest83200
ExpandDrupal\monitoring\Tests\MonitoringViewDisplayTest011
MessageGroupFilenameLineFunctionStatus
The test did not complete due to a fatal error.Completion checkMonitoringViewDisplayTest.php25Drupal\monitoring\Tests\MonitoringViewDisplayTest->testViewDisplaySensor()
Drupal\Component\Plugin\Exception\PluginNotFoundException: The "node" entity type does not exist. in Drupal\Core\Entity\EntityManager->getDefinition() (line 276 of /var/lib/drupaltestbot/sites/default/files/checkout/core/lib/Drupal/Core/Entity/EntityManager.php). Drupal\Core\Entity\EntityManager->getDefinition('node') Drupal\monitoring\Plugin\monitoring\SensorPlugin\ContentEntityAggregatorSensorPlugin->calculateDependencies() Drupal\monitoring\Entity\SensorConfig->calculateDependencies() Drupal\Core\Config\Entity\ConfigEntityBase->preSave(Object) Drupal\Core\Entity\EntityStorageBase->doPreSave(Object) Drupal\Core\Entity\EntityStorageBase->save(Object) Drupal\Core\Config\Entity\ConfigEntityStorage->save(Object) Drupal\Core\Entity\Entity->save() Drupal\Core\Config\Entity\ConfigEntityBase->save() Drupal\Core\Config\ConfigInstaller->createConfiguration('', Array, 1) Drupal\Core\Config\ConfigInstaller->installOptionalConfig(Object, '') Drupal\Core\Config\ConfigInstaller->installDefaultConfig('module', 'monitoring') Drupal\Core\ProxyClass\Config\ConfigInstaller->installDefaultConfig('module', 'monitoring') Drupal\Core\Extension\ModuleInstaller->install(Array, 1) Drupal\Core\ProxyClass\Extension\ModuleInstaller->install(Array, 1) Drupal\simpletest\WebTestBase->installModulesFromClassProperty(Object) Drupal\simpletest\WebTestBase->setUp() Drupal\monitoring\Tests\MonitoringTestBase->setUp() Drupal\simpletest\TestBase->run(Array) simpletest_script_run_one_test('5', 'Drupal\monitoring\Tests\MonitoringViewDisplayTest') Uncaught exceptionEntityManager.php276Drupal\Core\Entity\EntityManager->getDefinition()
LeafDrupal\monitoring_demo\Tests\MonitoringDemoTest1200
ExpandDrupal\monitoring_multigraph\Tests\MultigraphServicesTest1010
MessageGroupFilenameLineFunctionStatus
The test did not complete due to a fatal error.Completion checkMultigraphServicesTest.php71Drupal\monitoring_multigraph\Tests\MultigraphServicesTest->testMultigraph()
LeafDrupal\monitoring_multigraph\Tests\MultigraphWebTest6400