cart-manager-15.patch

Test status
StatusResult
Last receivedTue, 10/06/2015 - 22:14:00
Last requestedTue, 10/06/2015 - 23:35:36
Last testedTue, 10/06/2015 - 23:42:39
Test count1
Environment status
PHP 5.5 MySQLfail
File information
Filecart-manager-15.patch
BranchUbercart - 8.x-4.x
LinkIssue Link
SummaryFAILED: [[SimpleTest]]: [PHP 5.5 MySQL] 3,217 pass(es), 1 fail(s), and 215 exception(s).
Details

PHP 5.5 MySQL

  1. Setup environment
  2. Detect an invalid patch URL
  3. Detect invalid repository information
  4. Detect invalid patch format
  5. Detect a non-applicable patch
  6. Detect invalid PHP syntax
  7. Detect a Drupal installation failure
  8. Detect a test run failure
  9. Detect a failing test
    Review the test failures below then if necessary run them locally until the problem has been fixed.
  10. Complete test suite with all tests passing
3,217 pass(es), 1 fail(s), and 215 exception(s)

Non-pass

Test namePassFailException
ExpandDrupal\uc_attribute\Tests\AttributeTest433029
MessageGroupFilenameLineFunctionStatus
Missing argument 5 for rules_entity_view()Warningrules.module40rules_entity_view()
Missing argument 5 for rules_entity_view()Warningrules.module40rules_entity_view()
Missing argument 5 for rules_entity_view()Warningrules.module40rules_entity_view()
Missing argument 5 for rules_entity_view()Warningrules.module40rules_entity_view()
Missing argument 5 for rules_entity_view()Warningrules.module40rules_entity_view()
Missing argument 5 for rules_entity_view()Warningrules.module40rules_entity_view()
Missing argument 5 for rules_entity_view()Warningrules.module40rules_entity_view()
Missing argument 5 for rules_entity_view()Warningrules.module40rules_entity_view()
Missing argument 5 for rules_entity_view()Warningrules.module40rules_entity_view()
Missing argument 5 for rules_entity_view()Warningrules.module40rules_entity_view()
Missing argument 5 for rules_entity_view()Warningrules.module40rules_entity_view()
Missing argument 5 for rules_entity_view()Warningrules.module40rules_entity_view()
Missing argument 5 for rules_entity_view()Warningrules.module40rules_entity_view()
Missing argument 5 for rules_entity_view()Warningrules.module40rules_entity_view()
Missing argument 5 for rules_entity_view()Warningrules.module40rules_entity_view()
Missing argument 5 for rules_entity_view()Warningrules.module40rules_entity_view()
Missing argument 5 for rules_entity_view()Warningrules.module40rules_entity_view()
Missing argument 5 for rules_entity_view()Warningrules.module40rules_entity_view()
Missing argument 5 for rules_entity_view()Warningrules.module40rules_entity_view()
Missing argument 5 for rules_entity_view()Warningrules.module40rules_entity_view()
Missing argument 5 for rules_entity_view()Warningrules.module40rules_entity_view()
Missing argument 5 for rules_entity_view()Warningrules.module40rules_entity_view()
Missing argument 5 for rules_entity_view()Warningrules.module40rules_entity_view()
Missing argument 5 for rules_entity_view()Warningrules.module40rules_entity_view()
Missing argument 5 for rules_entity_view()Warningrules.module40rules_entity_view()
Missing argument 5 for rules_entity_view()Warningrules.module40rules_entity_view()
Missing argument 5 for rules_entity_view()Warningrules.module40rules_entity_view()
Missing argument 5 for rules_entity_view()Warningrules.module40rules_entity_view()
Missing argument 5 for rules_entity_view()Warningrules.module40rules_entity_view()
ExpandDrupal\uc_cart\Tests\CartBlockTest6502
MessageGroupFilenameLineFunctionStatus
Missing argument 5 for rules_entity_view()Warningrules.module40rules_entity_view()
Missing argument 5 for rules_entity_view()Warningrules.module40rules_entity_view()
ExpandDrupal\uc_cart\Tests\CartCheckoutTest496023
MessageGroupFilenameLineFunctionStatus
Missing argument 5 for rules_entity_view()Warningrules.module40rules_entity_view()
Missing argument 5 for rules_entity_view()Warningrules.module40rules_entity_view()
Missing argument 5 for rules_entity_view()Warningrules.module40rules_entity_view()
Missing argument 5 for rules_entity_view()Warningrules.module40rules_entity_view()
Missing argument 5 for rules_entity_view()Warningrules.module40rules_entity_view()
Missing argument 5 for rules_entity_view()Warningrules.module40rules_entity_view()
Missing argument 5 for rules_entity_view()Warningrules.module40rules_entity_view()
Missing argument 5 for rules_entity_view()Warningrules.module40rules_entity_view()
Missing argument 5 for rules_entity_view()Warningrules.module40rules_entity_view()
Missing argument 5 for rules_entity_view()Warningrules.module40rules_entity_view()
Missing argument 5 for rules_entity_view()Warningrules.module40rules_entity_view()
Missing argument 5 for rules_entity_view()Warningrules.module40rules_entity_view()
Missing argument 5 for rules_entity_view()Warningrules.module40rules_entity_view()
Missing argument 5 for rules_entity_view()Warningrules.module40rules_entity_view()
Missing argument 5 for rules_entity_view()Warningrules.module40rules_entity_view()
Missing argument 5 for rules_entity_view()Warningrules.module40rules_entity_view()
Missing argument 5 for rules_entity_view()Warningrules.module40rules_entity_view()
Missing argument 5 for rules_entity_view()Warningrules.module40rules_entity_view()
Missing argument 5 for rules_entity_view()Warningrules.module40rules_entity_view()
Missing argument 5 for rules_entity_view()Warningrules.module40rules_entity_view()
Missing argument 5 for rules_entity_view()Warningrules.module40rules_entity_view()
Missing argument 5 for rules_entity_view()Warningrules.module40rules_entity_view()
Missing argument 5 for rules_entity_view()Warningrules.module40rules_entity_view()
ExpandDrupal\uc_cart\Tests\CartSettingsTest150015
MessageGroupFilenameLineFunctionStatus
Missing argument 5 for rules_entity_view()Warningrules.module40rules_entity_view()
Missing argument 5 for rules_entity_view()Warningrules.module40rules_entity_view()
Missing argument 5 for rules_entity_view()Warningrules.module40rules_entity_view()
Missing argument 5 for rules_entity_view()Warningrules.module40rules_entity_view()
Missing argument 5 for rules_entity_view()Warningrules.module40rules_entity_view()
Missing argument 5 for rules_entity_view()Warningrules.module40rules_entity_view()
Missing argument 5 for rules_entity_view()Warningrules.module40rules_entity_view()
Missing argument 5 for rules_entity_view()Warningrules.module40rules_entity_view()
Missing argument 5 for rules_entity_view()Warningrules.module40rules_entity_view()
Missing argument 5 for rules_entity_view()Warningrules.module40rules_entity_view()
Missing argument 5 for rules_entity_view()Warningrules.module40rules_entity_view()
Missing argument 5 for rules_entity_view()Warningrules.module40rules_entity_view()
Missing argument 5 for rules_entity_view()Warningrules.module40rules_entity_view()
Missing argument 5 for rules_entity_view()Warningrules.module40rules_entity_view()
Missing argument 5 for rules_entity_view()Warningrules.module40rules_entity_view()
ExpandDrupal\uc_cart\Tests\CheckoutSettingsTest5204
MessageGroupFilenameLineFunctionStatus
Missing argument 5 for rules_entity_view()Warningrules.module40rules_entity_view()
Missing argument 5 for rules_entity_view()Warningrules.module40rules_entity_view()
Missing argument 5 for rules_entity_view()Warningrules.module40rules_entity_view()
Missing argument 5 for rules_entity_view()Warningrules.module40rules_entity_view()
ExpandDrupal\uc_cart_links\Tests\CartLinksTest386020
MessageGroupFilenameLineFunctionStatus
Missing argument 5 for rules_entity_view()Warningrules.module40rules_entity_view()
Missing argument 5 for rules_entity_view()Warningrules.module40rules_entity_view()
Missing argument 5 for rules_entity_view()Warningrules.module40rules_entity_view()
Missing argument 5 for rules_entity_view()Warningrules.module40rules_entity_view()
Missing argument 5 for rules_entity_view()Warningrules.module40rules_entity_view()
Missing argument 5 for rules_entity_view()Warningrules.module40rules_entity_view()
Missing argument 5 for rules_entity_view()Warningrules.module40rules_entity_view()
Missing argument 5 for rules_entity_view()Warningrules.module40rules_entity_view()
Missing argument 5 for rules_entity_view()Warningrules.module40rules_entity_view()
Missing argument 5 for rules_entity_view()Warningrules.module40rules_entity_view()
Missing argument 5 for rules_entity_view()Warningrules.module40rules_entity_view()
Missing argument 5 for rules_entity_view()Warningrules.module40rules_entity_view()
Missing argument 5 for rules_entity_view()Warningrules.module40rules_entity_view()
Missing argument 5 for rules_entity_view()Warningrules.module40rules_entity_view()
Missing argument 5 for rules_entity_view()Warningrules.module40rules_entity_view()
Missing argument 5 for rules_entity_view()Warningrules.module40rules_entity_view()
Missing argument 5 for rules_entity_view()Warningrules.module40rules_entity_view()
Missing argument 5 for rules_entity_view()Warningrules.module40rules_entity_view()
Missing argument 5 for rules_entity_view()Warningrules.module40rules_entity_view()
Missing argument 5 for rules_entity_view()Warningrules.module40rules_entity_view()
ExpandDrupal\uc_catalog\Tests\CatalogTest011
MessageGroupFilenameLineFunctionStatus
The test did not complete due to a fatal error.Completion checkCatalogTest.php27Drupal\uc_catalog\Tests\CatalogTest->testCatalog()
Drupal\Core\Config\UnmetDependenciesException: Configuration objects (field.field.node.product.taxonomy_catalog, field.storage.node.taxonomy_catalog) provided by uc_catalog have unmet dependencies in Drupal\Core\Config\UnmetDependenciesException::create() (line 89 of /var/lib/drupaltestbot/sites/default/files/checkout/core/lib/Drupal/Core/Config/UnmetDependenciesException.php). Drupal\Core\Config\UnmetDependenciesException::create('uc_catalog', Array) Drupal\Core\Config\ConfigInstaller->checkConfigurationToInstall('module', 'uc_catalog') Drupal\Core\ProxyClass\Config\ConfigInstaller->checkConfigurationToInstall('module', 'uc_catalog') Drupal\Core\Extension\ModuleInstaller->install(Array, 1) Drupal\Core\ProxyClass\Extension\ModuleInstaller->install(Array, 1) Drupal\simpletest\WebTestBase->installModulesFromClassProperty(Object) Drupal\simpletest\WebTestBase->setUp() Drupal\uc_store\Tests\UbercartTestBase->setUp() Drupal\simpletest\TestBase->run(Array) simpletest_script_run_one_test('11', 'Drupal\uc_catalog\Tests\CatalogTest') Uncaught exceptionUnmetDependenciesException.php89Drupal\Core\Config\UnmetDependenciesException::create()
ExpandDrupal\uc_credit\Tests\CreditCardTest314040
MessageGroupFilenameLineFunctionStatus
Missing argument 5 for rules_entity_view()Warningrules.module40rules_entity_view()
Missing argument 5 for rules_entity_view()Warningrules.module40rules_entity_view()
Missing argument 5 for rules_entity_view()Warningrules.module40rules_entity_view()
Missing argument 5 for rules_entity_view()Warningrules.module40rules_entity_view()
Missing argument 5 for rules_entity_view()Warningrules.module40rules_entity_view()
Missing argument 5 for rules_entity_view()Warningrules.module40rules_entity_view()
Missing argument 5 for rules_entity_view()Warningrules.module40rules_entity_view()
Missing argument 5 for rules_entity_view()Warningrules.module40rules_entity_view()
Missing argument 5 for rules_entity_view()Warningrules.module40rules_entity_view()
Missing argument 5 for rules_entity_view()Warningrules.module40rules_entity_view()
Missing argument 5 for rules_entity_view()Warningrules.module40rules_entity_view()
Missing argument 5 for rules_entity_view()Warningrules.module40rules_entity_view()
Missing argument 5 for rules_entity_view()Warningrules.module40rules_entity_view()
Missing argument 5 for rules_entity_view()Warningrules.module40rules_entity_view()
Missing argument 5 for rules_entity_view()Warningrules.module40rules_entity_view()
Missing argument 5 for rules_entity_view()Warningrules.module40rules_entity_view()
Missing argument 5 for rules_entity_view()Warningrules.module40rules_entity_view()
Missing argument 5 for rules_entity_view()Warningrules.module40rules_entity_view()
Missing argument 5 for rules_entity_view()Warningrules.module40rules_entity_view()
Missing argument 5 for rules_entity_view()Warningrules.module40rules_entity_view()
Missing argument 5 for rules_entity_view()Warningrules.module40rules_entity_view()
Missing argument 5 for rules_entity_view()Warningrules.module40rules_entity_view()
Missing argument 5 for rules_entity_view()Warningrules.module40rules_entity_view()
Missing argument 5 for rules_entity_view()Warningrules.module40rules_entity_view()
Missing argument 5 for rules_entity_view()Warningrules.module40rules_entity_view()
Missing argument 5 for rules_entity_view()Warningrules.module40rules_entity_view()
Missing argument 5 for rules_entity_view()Warningrules.module40rules_entity_view()
Missing argument 5 for rules_entity_view()Warningrules.module40rules_entity_view()
Missing argument 5 for rules_entity_view()Warningrules.module40rules_entity_view()
Missing argument 5 for rules_entity_view()Warningrules.module40rules_entity_view()
Missing argument 5 for rules_entity_view()Warningrules.module40rules_entity_view()
Missing argument 5 for rules_entity_view()Warningrules.module40rules_entity_view()
Missing argument 5 for rules_entity_view()Warningrules.module40rules_entity_view()
Missing argument 5 for rules_entity_view()Warningrules.module40rules_entity_view()
Missing argument 5 for rules_entity_view()Warningrules.module40rules_entity_view()
Missing argument 5 for rules_entity_view()Warningrules.module40rules_entity_view()
Missing argument 5 for rules_entity_view()Warningrules.module40rules_entity_view()
Missing argument 5 for rules_entity_view()Warningrules.module40rules_entity_view()
Missing argument 5 for rules_entity_view()Warningrules.module40rules_entity_view()
Missing argument 5 for rules_entity_view()Warningrules.module40rules_entity_view()
ExpandDrupal\uc_order\Tests\OrderTest224010
MessageGroupFilenameLineFunctionStatus
Missing argument 5 for rules_entity_view()Warningrules.module40rules_entity_view()
Missing argument 5 for rules_entity_view()Warningrules.module40rules_entity_view()
Missing argument 5 for rules_entity_view()Warningrules.module40rules_entity_view()
Missing argument 5 for rules_entity_view()Warningrules.module40rules_entity_view()
Missing argument 5 for rules_entity_view()Warningrules.module40rules_entity_view()
Missing argument 5 for rules_entity_view()Warningrules.module40rules_entity_view()
Missing argument 5 for rules_entity_view()Warningrules.module40rules_entity_view()
Missing argument 5 for rules_entity_view()Warningrules.module40rules_entity_view()
Missing argument 5 for rules_entity_view()Warningrules.module40rules_entity_view()
Missing argument 5 for rules_entity_view()Warningrules.module40rules_entity_view()
ExpandDrupal\uc_payment\Tests\PaymentPaneTest11408
MessageGroupFilenameLineFunctionStatus
Missing argument 5 for rules_entity_view()Warningrules.module40rules_entity_view()
Missing argument 5 for rules_entity_view()Warningrules.module40rules_entity_view()
Missing argument 5 for rules_entity_view()Warningrules.module40rules_entity_view()
Missing argument 5 for rules_entity_view()Warningrules.module40rules_entity_view()
Missing argument 5 for rules_entity_view()Warningrules.module40rules_entity_view()
Missing argument 5 for rules_entity_view()Warningrules.module40rules_entity_view()
Missing argument 5 for rules_entity_view()Warningrules.module40rules_entity_view()
Missing argument 5 for rules_entity_view()Warningrules.module40rules_entity_view()
ExpandDrupal\uc_payment_pack\Tests\PaymentPackTest149014
MessageGroupFilenameLineFunctionStatus
Missing argument 5 for rules_entity_view()Warningrules.module40rules_entity_view()
Missing argument 5 for rules_entity_view()Warningrules.module40rules_entity_view()
Missing argument 5 for rules_entity_view()Warningrules.module40rules_entity_view()
Missing argument 5 for rules_entity_view()Warningrules.module40rules_entity_view()
Missing argument 5 for rules_entity_view()Warningrules.module40rules_entity_view()
Missing argument 5 for rules_entity_view()Warningrules.module40rules_entity_view()
Missing argument 5 for rules_entity_view()Warningrules.module40rules_entity_view()
Missing argument 5 for rules_entity_view()Warningrules.module40rules_entity_view()
Missing argument 5 for rules_entity_view()Warningrules.module40rules_entity_view()
Missing argument 5 for rules_entity_view()Warningrules.module40rules_entity_view()
Missing argument 5 for rules_entity_view()Warningrules.module40rules_entity_view()
Missing argument 5 for rules_entity_view()Warningrules.module40rules_entity_view()
Missing argument 5 for rules_entity_view()Warningrules.module40rules_entity_view()
Missing argument 5 for rules_entity_view()Warningrules.module40rules_entity_view()
ExpandDrupal\uc_product\Tests\ProductTest153016
MessageGroupFilenameLineFunctionStatus
Missing argument 5 for rules_entity_view()Warningrules.module40rules_entity_view()
Missing argument 5 for rules_entity_view()Warningrules.module40rules_entity_view()
Missing argument 5 for rules_entity_view()Warningrules.module40rules_entity_view()
Missing argument 5 for rules_entity_view()Warningrules.module40rules_entity_view()
Missing argument 5 for rules_entity_view()Warningrules.module40rules_entity_view()
Missing argument 5 for rules_entity_view()Warningrules.module40rules_entity_view()
Missing argument 5 for rules_entity_view()Warningrules.module40rules_entity_view()
Missing argument 5 for rules_entity_view()Warningrules.module40rules_entity_view()
Missing argument 5 for rules_entity_view()Warningrules.module40rules_entity_view()
Missing argument 5 for rules_entity_view()Warningrules.module40rules_entity_view()
Missing argument 5 for rules_entity_view()Warningrules.module40rules_entity_view()
Missing argument 5 for rules_entity_view()Warningrules.module40rules_entity_view()
Missing argument 5 for rules_entity_view()Warningrules.module40rules_entity_view()
Missing argument 5 for rules_entity_view()Warningrules.module40rules_entity_view()
Missing argument 5 for rules_entity_view()Warningrules.module40rules_entity_view()
Missing argument 5 for rules_entity_view()Warningrules.module40rules_entity_view()
ExpandDrupal\uc_product_kit\Tests\ProductKitTest152012
MessageGroupFilenameLineFunctionStatus
Missing argument 5 for rules_entity_view()Warningrules.module40rules_entity_view()
Missing argument 5 for rules_entity_view()Warningrules.module40rules_entity_view()
Missing argument 5 for rules_entity_view()Warningrules.module40rules_entity_view()
Missing argument 5 for rules_entity_view()Warningrules.module40rules_entity_view()
Missing argument 5 for rules_entity_view()Warningrules.module40rules_entity_view()
Missing argument 5 for rules_entity_view()Warningrules.module40rules_entity_view()
Missing argument 5 for rules_entity_view()Warningrules.module40rules_entity_view()
Missing argument 5 for rules_entity_view()Warningrules.module40rules_entity_view()
Missing argument 5 for rules_entity_view()Warningrules.module40rules_entity_view()
Missing argument 5 for rules_entity_view()Warningrules.module40rules_entity_view()
Missing argument 5 for rules_entity_view()Warningrules.module40rules_entity_view()
Missing argument 5 for rules_entity_view()Warningrules.module40rules_entity_view()
ExpandDrupal\uc_quote\Tests\QuoteTest7805
MessageGroupFilenameLineFunctionStatus
Missing argument 5 for rules_entity_view()Warningrules.module40rules_entity_view()
Missing argument 5 for rules_entity_view()Warningrules.module40rules_entity_view()
Missing argument 5 for rules_entity_view()Warningrules.module40rules_entity_view()
Missing argument 5 for rules_entity_view()Warningrules.module40rules_entity_view()
Missing argument 5 for rules_entity_view()Warningrules.module40rules_entity_view()
ExpandDrupal\uc_role\Tests\RoleCheckoutTest2701
MessageGroupFilenameLineFunctionStatus
Missing argument 5 for rules_entity_view()Warningrules.module40rules_entity_view()
ExpandDrupal\uc_role\Tests\RoleTest3502
MessageGroupFilenameLineFunctionStatus
Missing argument 5 for rules_entity_view()Warningrules.module40rules_entity_view()
Missing argument 5 for rules_entity_view()Warningrules.module40rules_entity_view()
ExpandDrupal\uc_stock\Tests\StockTest10005
MessageGroupFilenameLineFunctionStatus
Missing argument 5 for rules_entity_view()Warningrules.module40rules_entity_view()
Missing argument 5 for rules_entity_view()Warningrules.module40rules_entity_view()
Missing argument 5 for rules_entity_view()Warningrules.module40rules_entity_view()
Missing argument 5 for rules_entity_view()Warningrules.module40rules_entity_view()
Missing argument 5 for rules_entity_view()Warningrules.module40rules_entity_view()
ExpandDrupal\uc_store\Tests\AjaxTest2702
MessageGroupFilenameLineFunctionStatus
Missing argument 5 for rules_entity_view()Warningrules.module40rules_entity_view()
Missing argument 5 for rules_entity_view()Warningrules.module40rules_entity_view()
ExpandDrupal\uc_store\Tests\StoreTest3501
MessageGroupFilenameLineFunctionStatus
Missing argument 5 for rules_entity_view()Warningrules.module40rules_entity_view()
ExpandDrupal\uc_tax\Tests\InclusiveTaxTest2103
MessageGroupFilenameLineFunctionStatus
Missing argument 5 for rules_entity_view()Warningrules.module40rules_entity_view()
Missing argument 5 for rules_entity_view()Warningrules.module40rules_entity_view()
Missing argument 5 for rules_entity_view()Warningrules.module40rules_entity_view()
ExpandDrupal\uc_tax\Tests\StoredTaxTest9402
MessageGroupFilenameLineFunctionStatus
Missing argument 5 for rules_entity_view()Warningrules.module40rules_entity_view()
Missing argument 5 for rules_entity_view()Warningrules.module40rules_entity_view()

All

Test namePassFailException
ExpandDrupal\uc_attribute\Tests\AttributeTest433029
MessageGroupFilenameLineFunctionStatus
Missing argument 5 for rules_entity_view()Warningrules.module40rules_entity_view()
Missing argument 5 for rules_entity_view()Warningrules.module40rules_entity_view()
Missing argument 5 for rules_entity_view()Warningrules.module40rules_entity_view()
Missing argument 5 for rules_entity_view()Warningrules.module40rules_entity_view()
Missing argument 5 for rules_entity_view()Warningrules.module40rules_entity_view()
Missing argument 5 for rules_entity_view()Warningrules.module40rules_entity_view()
Missing argument 5 for rules_entity_view()Warningrules.module40rules_entity_view()
Missing argument 5 for rules_entity_view()Warningrules.module40rules_entity_view()
Missing argument 5 for rules_entity_view()Warningrules.module40rules_entity_view()
Missing argument 5 for rules_entity_view()Warningrules.module40rules_entity_view()
Missing argument 5 for rules_entity_view()Warningrules.module40rules_entity_view()
Missing argument 5 for rules_entity_view()Warningrules.module40rules_entity_view()
Missing argument 5 for rules_entity_view()Warningrules.module40rules_entity_view()
Missing argument 5 for rules_entity_view()Warningrules.module40rules_entity_view()
Missing argument 5 for rules_entity_view()Warningrules.module40rules_entity_view()
Missing argument 5 for rules_entity_view()Warningrules.module40rules_entity_view()
Missing argument 5 for rules_entity_view()Warningrules.module40rules_entity_view()
Missing argument 5 for rules_entity_view()Warningrules.module40rules_entity_view()
Missing argument 5 for rules_entity_view()Warningrules.module40rules_entity_view()
Missing argument 5 for rules_entity_view()Warningrules.module40rules_entity_view()
Missing argument 5 for rules_entity_view()Warningrules.module40rules_entity_view()
Missing argument 5 for rules_entity_view()Warningrules.module40rules_entity_view()
Missing argument 5 for rules_entity_view()Warningrules.module40rules_entity_view()
Missing argument 5 for rules_entity_view()Warningrules.module40rules_entity_view()
Missing argument 5 for rules_entity_view()Warningrules.module40rules_entity_view()
Missing argument 5 for rules_entity_view()Warningrules.module40rules_entity_view()
Missing argument 5 for rules_entity_view()Warningrules.module40rules_entity_view()
Missing argument 5 for rules_entity_view()Warningrules.module40rules_entity_view()
Missing argument 5 for rules_entity_view()Warningrules.module40rules_entity_view()
ExpandDrupal\uc_cart\Tests\CartBlockTest6502
MessageGroupFilenameLineFunctionStatus
Missing argument 5 for rules_entity_view()Warningrules.module40rules_entity_view()
Missing argument 5 for rules_entity_view()Warningrules.module40rules_entity_view()
ExpandDrupal\uc_cart\Tests\CartCheckoutTest496023
MessageGroupFilenameLineFunctionStatus
Missing argument 5 for rules_entity_view()Warningrules.module40rules_entity_view()
Missing argument 5 for rules_entity_view()Warningrules.module40rules_entity_view()
Missing argument 5 for rules_entity_view()Warningrules.module40rules_entity_view()
Missing argument 5 for rules_entity_view()Warningrules.module40rules_entity_view()
Missing argument 5 for rules_entity_view()Warningrules.module40rules_entity_view()
Missing argument 5 for rules_entity_view()Warningrules.module40rules_entity_view()
Missing argument 5 for rules_entity_view()Warningrules.module40rules_entity_view()
Missing argument 5 for rules_entity_view()Warningrules.module40rules_entity_view()
Missing argument 5 for rules_entity_view()Warningrules.module40rules_entity_view()
Missing argument 5 for rules_entity_view()Warningrules.module40rules_entity_view()
Missing argument 5 for rules_entity_view()Warningrules.module40rules_entity_view()
Missing argument 5 for rules_entity_view()Warningrules.module40rules_entity_view()
Missing argument 5 for rules_entity_view()Warningrules.module40rules_entity_view()
Missing argument 5 for rules_entity_view()Warningrules.module40rules_entity_view()
Missing argument 5 for rules_entity_view()Warningrules.module40rules_entity_view()
Missing argument 5 for rules_entity_view()Warningrules.module40rules_entity_view()
Missing argument 5 for rules_entity_view()Warningrules.module40rules_entity_view()
Missing argument 5 for rules_entity_view()Warningrules.module40rules_entity_view()
Missing argument 5 for rules_entity_view()Warningrules.module40rules_entity_view()
Missing argument 5 for rules_entity_view()Warningrules.module40rules_entity_view()
Missing argument 5 for rules_entity_view()Warningrules.module40rules_entity_view()
Missing argument 5 for rules_entity_view()Warningrules.module40rules_entity_view()
Missing argument 5 for rules_entity_view()Warningrules.module40rules_entity_view()
ExpandDrupal\uc_cart\Tests\CartSettingsTest150015
MessageGroupFilenameLineFunctionStatus
Missing argument 5 for rules_entity_view()Warningrules.module40rules_entity_view()
Missing argument 5 for rules_entity_view()Warningrules.module40rules_entity_view()
Missing argument 5 for rules_entity_view()Warningrules.module40rules_entity_view()
Missing argument 5 for rules_entity_view()Warningrules.module40rules_entity_view()
Missing argument 5 for rules_entity_view()Warningrules.module40rules_entity_view()
Missing argument 5 for rules_entity_view()Warningrules.module40rules_entity_view()
Missing argument 5 for rules_entity_view()Warningrules.module40rules_entity_view()
Missing argument 5 for rules_entity_view()Warningrules.module40rules_entity_view()
Missing argument 5 for rules_entity_view()Warningrules.module40rules_entity_view()
Missing argument 5 for rules_entity_view()Warningrules.module40rules_entity_view()
Missing argument 5 for rules_entity_view()Warningrules.module40rules_entity_view()
Missing argument 5 for rules_entity_view()Warningrules.module40rules_entity_view()
Missing argument 5 for rules_entity_view()Warningrules.module40rules_entity_view()
Missing argument 5 for rules_entity_view()Warningrules.module40rules_entity_view()
Missing argument 5 for rules_entity_view()Warningrules.module40rules_entity_view()
ExpandDrupal\uc_cart\Tests\CheckoutSettingsTest5204
MessageGroupFilenameLineFunctionStatus
Missing argument 5 for rules_entity_view()Warningrules.module40rules_entity_view()
Missing argument 5 for rules_entity_view()Warningrules.module40rules_entity_view()
Missing argument 5 for rules_entity_view()Warningrules.module40rules_entity_view()
Missing argument 5 for rules_entity_view()Warningrules.module40rules_entity_view()
ExpandDrupal\uc_cart_links\Tests\CartLinksTest386020
MessageGroupFilenameLineFunctionStatus
Missing argument 5 for rules_entity_view()Warningrules.module40rules_entity_view()
Missing argument 5 for rules_entity_view()Warningrules.module40rules_entity_view()
Missing argument 5 for rules_entity_view()Warningrules.module40rules_entity_view()
Missing argument 5 for rules_entity_view()Warningrules.module40rules_entity_view()
Missing argument 5 for rules_entity_view()Warningrules.module40rules_entity_view()
Missing argument 5 for rules_entity_view()Warningrules.module40rules_entity_view()
Missing argument 5 for rules_entity_view()Warningrules.module40rules_entity_view()
Missing argument 5 for rules_entity_view()Warningrules.module40rules_entity_view()
Missing argument 5 for rules_entity_view()Warningrules.module40rules_entity_view()
Missing argument 5 for rules_entity_view()Warningrules.module40rules_entity_view()
Missing argument 5 for rules_entity_view()Warningrules.module40rules_entity_view()
Missing argument 5 for rules_entity_view()Warningrules.module40rules_entity_view()
Missing argument 5 for rules_entity_view()Warningrules.module40rules_entity_view()
Missing argument 5 for rules_entity_view()Warningrules.module40rules_entity_view()
Missing argument 5 for rules_entity_view()Warningrules.module40rules_entity_view()
Missing argument 5 for rules_entity_view()Warningrules.module40rules_entity_view()
Missing argument 5 for rules_entity_view()Warningrules.module40rules_entity_view()
Missing argument 5 for rules_entity_view()Warningrules.module40rules_entity_view()
Missing argument 5 for rules_entity_view()Warningrules.module40rules_entity_view()
Missing argument 5 for rules_entity_view()Warningrules.module40rules_entity_view()
ExpandDrupal\uc_catalog\Tests\CatalogTest011
MessageGroupFilenameLineFunctionStatus
The test did not complete due to a fatal error.Completion checkCatalogTest.php27Drupal\uc_catalog\Tests\CatalogTest->testCatalog()
Drupal\Core\Config\UnmetDependenciesException: Configuration objects (field.field.node.product.taxonomy_catalog, field.storage.node.taxonomy_catalog) provided by uc_catalog have unmet dependencies in Drupal\Core\Config\UnmetDependenciesException::create() (line 89 of /var/lib/drupaltestbot/sites/default/files/checkout/core/lib/Drupal/Core/Config/UnmetDependenciesException.php). Drupal\Core\Config\UnmetDependenciesException::create('uc_catalog', Array) Drupal\Core\Config\ConfigInstaller->checkConfigurationToInstall('module', 'uc_catalog') Drupal\Core\ProxyClass\Config\ConfigInstaller->checkConfigurationToInstall('module', 'uc_catalog') Drupal\Core\Extension\ModuleInstaller->install(Array, 1) Drupal\Core\ProxyClass\Extension\ModuleInstaller->install(Array, 1) Drupal\simpletest\WebTestBase->installModulesFromClassProperty(Object) Drupal\simpletest\WebTestBase->setUp() Drupal\uc_store\Tests\UbercartTestBase->setUp() Drupal\simpletest\TestBase->run(Array) simpletest_script_run_one_test('11', 'Drupal\uc_catalog\Tests\CatalogTest') Uncaught exceptionUnmetDependenciesException.php89Drupal\Core\Config\UnmetDependenciesException::create()
ExpandDrupal\uc_country\Tests\CountryManagerTest500
MessageGroupFilenameLineFunctionStatus
Array ( ) DebugCountryManagerTest.php44Drupal\uc_country\Tests\CountryManagerTest->testServiceOverride()
Count = 0DebugCountryManagerTest.php45Drupal\uc_country\Tests\CountryManagerTest->testServiceOverride()
LeafDrupal\uc_country\Tests\CountryTest9100
ExpandDrupal\uc_credit\Tests\CreditCardTest314040
MessageGroupFilenameLineFunctionStatus
Missing argument 5 for rules_entity_view()Warningrules.module40rules_entity_view()
Missing argument 5 for rules_entity_view()Warningrules.module40rules_entity_view()
Missing argument 5 for rules_entity_view()Warningrules.module40rules_entity_view()
Missing argument 5 for rules_entity_view()Warningrules.module40rules_entity_view()
Missing argument 5 for rules_entity_view()Warningrules.module40rules_entity_view()
Missing argument 5 for rules_entity_view()Warningrules.module40rules_entity_view()
Missing argument 5 for rules_entity_view()Warningrules.module40rules_entity_view()
Missing argument 5 for rules_entity_view()Warningrules.module40rules_entity_view()
Missing argument 5 for rules_entity_view()Warningrules.module40rules_entity_view()
Missing argument 5 for rules_entity_view()Warningrules.module40rules_entity_view()
Missing argument 5 for rules_entity_view()Warningrules.module40rules_entity_view()
Missing argument 5 for rules_entity_view()Warningrules.module40rules_entity_view()
Missing argument 5 for rules_entity_view()Warningrules.module40rules_entity_view()
Missing argument 5 for rules_entity_view()Warningrules.module40rules_entity_view()
Missing argument 5 for rules_entity_view()Warningrules.module40rules_entity_view()
Missing argument 5 for rules_entity_view()Warningrules.module40rules_entity_view()
Missing argument 5 for rules_entity_view()Warningrules.module40rules_entity_view()
Missing argument 5 for rules_entity_view()Warningrules.module40rules_entity_view()
Missing argument 5 for rules_entity_view()Warningrules.module40rules_entity_view()
Missing argument 5 for rules_entity_view()Warningrules.module40rules_entity_view()
Missing argument 5 for rules_entity_view()Warningrules.module40rules_entity_view()
Missing argument 5 for rules_entity_view()Warningrules.module40rules_entity_view()
Missing argument 5 for rules_entity_view()Warningrules.module40rules_entity_view()
Missing argument 5 for rules_entity_view()Warningrules.module40rules_entity_view()
Missing argument 5 for rules_entity_view()Warningrules.module40rules_entity_view()
Missing argument 5 for rules_entity_view()Warningrules.module40rules_entity_view()
Missing argument 5 for rules_entity_view()Warningrules.module40rules_entity_view()
Missing argument 5 for rules_entity_view()Warningrules.module40rules_entity_view()
Missing argument 5 for rules_entity_view()Warningrules.module40rules_entity_view()
Missing argument 5 for rules_entity_view()Warningrules.module40rules_entity_view()
Missing argument 5 for rules_entity_view()Warningrules.module40rules_entity_view()
Missing argument 5 for rules_entity_view()Warningrules.module40rules_entity_view()
Missing argument 5 for rules_entity_view()Warningrules.module40rules_entity_view()
Missing argument 5 for rules_entity_view()Warningrules.module40rules_entity_view()
Missing argument 5 for rules_entity_view()Warningrules.module40rules_entity_view()
Missing argument 5 for rules_entity_view()Warningrules.module40rules_entity_view()
Missing argument 5 for rules_entity_view()Warningrules.module40rules_entity_view()
Missing argument 5 for rules_entity_view()Warningrules.module40rules_entity_view()
Missing argument 5 for rules_entity_view()Warningrules.module40rules_entity_view()
Missing argument 5 for rules_entity_view()Warningrules.module40rules_entity_view()
ExpandDrupal\uc_order\Tests\OrderTest224010
MessageGroupFilenameLineFunctionStatus
Missing argument 5 for rules_entity_view()Warningrules.module40rules_entity_view()
Missing argument 5 for rules_entity_view()Warningrules.module40rules_entity_view()
Missing argument 5 for rules_entity_view()Warningrules.module40rules_entity_view()
Missing argument 5 for rules_entity_view()Warningrules.module40rules_entity_view()
Missing argument 5 for rules_entity_view()Warningrules.module40rules_entity_view()
Missing argument 5 for rules_entity_view()Warningrules.module40rules_entity_view()
Missing argument 5 for rules_entity_view()Warningrules.module40rules_entity_view()
Missing argument 5 for rules_entity_view()Warningrules.module40rules_entity_view()
Missing argument 5 for rules_entity_view()Warningrules.module40rules_entity_view()
Missing argument 5 for rules_entity_view()Warningrules.module40rules_entity_view()
ExpandDrupal\uc_payment\Tests\PaymentPaneTest11408
MessageGroupFilenameLineFunctionStatus
Missing argument 5 for rules_entity_view()Warningrules.module40rules_entity_view()
Missing argument 5 for rules_entity_view()Warningrules.module40rules_entity_view()
Missing argument 5 for rules_entity_view()Warningrules.module40rules_entity_view()
Missing argument 5 for rules_entity_view()Warningrules.module40rules_entity_view()
Missing argument 5 for rules_entity_view()Warningrules.module40rules_entity_view()
Missing argument 5 for rules_entity_view()Warningrules.module40rules_entity_view()
Missing argument 5 for rules_entity_view()Warningrules.module40rules_entity_view()
Missing argument 5 for rules_entity_view()Warningrules.module40rules_entity_view()
ExpandDrupal\uc_payment_pack\Tests\PaymentPackTest149014
MessageGroupFilenameLineFunctionStatus
Missing argument 5 for rules_entity_view()Warningrules.module40rules_entity_view()
Missing argument 5 for rules_entity_view()Warningrules.module40rules_entity_view()
Missing argument 5 for rules_entity_view()Warningrules.module40rules_entity_view()
Missing argument 5 for rules_entity_view()Warningrules.module40rules_entity_view()
Missing argument 5 for rules_entity_view()Warningrules.module40rules_entity_view()
Missing argument 5 for rules_entity_view()Warningrules.module40rules_entity_view()
Missing argument 5 for rules_entity_view()Warningrules.module40rules_entity_view()
Missing argument 5 for rules_entity_view()Warningrules.module40rules_entity_view()
Missing argument 5 for rules_entity_view()Warningrules.module40rules_entity_view()
Missing argument 5 for rules_entity_view()Warningrules.module40rules_entity_view()
Missing argument 5 for rules_entity_view()Warningrules.module40rules_entity_view()
Missing argument 5 for rules_entity_view()Warningrules.module40rules_entity_view()
Missing argument 5 for rules_entity_view()Warningrules.module40rules_entity_view()
Missing argument 5 for rules_entity_view()Warningrules.module40rules_entity_view()
ExpandDrupal\uc_product\Tests\ProductTest153016
MessageGroupFilenameLineFunctionStatus
Missing argument 5 for rules_entity_view()Warningrules.module40rules_entity_view()
Missing argument 5 for rules_entity_view()Warningrules.module40rules_entity_view()
Missing argument 5 for rules_entity_view()Warningrules.module40rules_entity_view()
Missing argument 5 for rules_entity_view()Warningrules.module40rules_entity_view()
Missing argument 5 for rules_entity_view()Warningrules.module40rules_entity_view()
Missing argument 5 for rules_entity_view()Warningrules.module40rules_entity_view()
Missing argument 5 for rules_entity_view()Warningrules.module40rules_entity_view()
Missing argument 5 for rules_entity_view()Warningrules.module40rules_entity_view()
Missing argument 5 for rules_entity_view()Warningrules.module40rules_entity_view()
Missing argument 5 for rules_entity_view()Warningrules.module40rules_entity_view()
Missing argument 5 for rules_entity_view()Warningrules.module40rules_entity_view()
Missing argument 5 for rules_entity_view()Warningrules.module40rules_entity_view()
Missing argument 5 for rules_entity_view()Warningrules.module40rules_entity_view()
Missing argument 5 for rules_entity_view()Warningrules.module40rules_entity_view()
Missing argument 5 for rules_entity_view()Warningrules.module40rules_entity_view()
Missing argument 5 for rules_entity_view()Warningrules.module40rules_entity_view()
ExpandDrupal\uc_product_kit\Tests\ProductKitTest152012
MessageGroupFilenameLineFunctionStatus
Missing argument 5 for rules_entity_view()Warningrules.module40rules_entity_view()
Missing argument 5 for rules_entity_view()Warningrules.module40rules_entity_view()
Missing argument 5 for rules_entity_view()Warningrules.module40rules_entity_view()
Missing argument 5 for rules_entity_view()Warningrules.module40rules_entity_view()
Missing argument 5 for rules_entity_view()Warningrules.module40rules_entity_view()
Missing argument 5 for rules_entity_view()Warningrules.module40rules_entity_view()
Missing argument 5 for rules_entity_view()Warningrules.module40rules_entity_view()
Missing argument 5 for rules_entity_view()Warningrules.module40rules_entity_view()
Missing argument 5 for rules_entity_view()Warningrules.module40rules_entity_view()
Missing argument 5 for rules_entity_view()Warningrules.module40rules_entity_view()
Missing argument 5 for rules_entity_view()Warningrules.module40rules_entity_view()
Missing argument 5 for rules_entity_view()Warningrules.module40rules_entity_view()
ExpandDrupal\uc_quote\Tests\QuoteTest7805
MessageGroupFilenameLineFunctionStatus
Missing argument 5 for rules_entity_view()Warningrules.module40rules_entity_view()
Missing argument 5 for rules_entity_view()Warningrules.module40rules_entity_view()
Missing argument 5 for rules_entity_view()Warningrules.module40rules_entity_view()
Missing argument 5 for rules_entity_view()Warningrules.module40rules_entity_view()
Missing argument 5 for rules_entity_view()Warningrules.module40rules_entity_view()
ExpandDrupal\uc_role\Tests\RoleCheckoutTest2701
MessageGroupFilenameLineFunctionStatus
Missing argument 5 for rules_entity_view()Warningrules.module40rules_entity_view()
ExpandDrupal\uc_role\Tests\RoleTest3502
MessageGroupFilenameLineFunctionStatus
Missing argument 5 for rules_entity_view()Warningrules.module40rules_entity_view()
Missing argument 5 for rules_entity_view()Warningrules.module40rules_entity_view()
ExpandDrupal\uc_stock\Tests\StockTest10005
MessageGroupFilenameLineFunctionStatus
Missing argument 5 for rules_entity_view()Warningrules.module40rules_entity_view()
Missing argument 5 for rules_entity_view()Warningrules.module40rules_entity_view()
Missing argument 5 for rules_entity_view()Warningrules.module40rules_entity_view()
Missing argument 5 for rules_entity_view()Warningrules.module40rules_entity_view()
Missing argument 5 for rules_entity_view()Warningrules.module40rules_entity_view()
LeafDrupal\uc_store\Tests\AddressTest1600
ExpandDrupal\uc_store\Tests\AjaxTest2702
MessageGroupFilenameLineFunctionStatus
Missing argument 5 for rules_entity_view()Warningrules.module40rules_entity_view()
Missing argument 5 for rules_entity_view()Warningrules.module40rules_entity_view()
ExpandDrupal\uc_store\Tests\StoreTest3501
MessageGroupFilenameLineFunctionStatus
Missing argument 5 for rules_entity_view()Warningrules.module40rules_entity_view()
ExpandDrupal\uc_tax\Tests\InclusiveTaxTest2103
MessageGroupFilenameLineFunctionStatus
Missing argument 5 for rules_entity_view()Warningrules.module40rules_entity_view()
Missing argument 5 for rules_entity_view()Warningrules.module40rules_entity_view()
Missing argument 5 for rules_entity_view()Warningrules.module40rules_entity_view()
ExpandDrupal\uc_tax\Tests\StoredTaxTest9402
MessageGroupFilenameLineFunctionStatus
Missing argument 5 for rules_entity_view()Warningrules.module40rules_entity_view()
Missing argument 5 for rules_entity_view()Warningrules.module40rules_entity_view()