1596594-9-empty-body-exception-fail_0.patch

Test status
StatusResult
Last receivedTue, 10/06/2015 - 10:34:00
Last requestedTue, 10/06/2015 - 10:34:01
Last testedTue, 10/06/2015 - 10:35:23
Test count1
Environment status
MySQLfail
File information
File1596594-9-empty-body-exception-fail_0.patch
BranchEntity API - 7.x-1.x
LinkIssue Link
SummaryFAILED: [[SimpleTest]]: [MySQL] 553 pass(es), 11 fail(s), and 5 exception(s).
Details

MySQL

  1. Setup environment
  2. Detect an invalid patch URL
  3. Detect invalid repository information
  4. Detect invalid patch format
  5. Detect a non-applicable patch
  6. Detect invalid PHP syntax
  7. Detect a Drupal installation failure
  8. Detect a test run failure
  9. Detect a failing test
    Review the test failures below then if necessary run them locally until the problem has been fixed.
  10. Complete test suite with all tests passing
553 pass(es), 11 fail(s), and 5 exception(s)

Non-pass

Test namePassFailException
ExpandEntity CRUD i18n integration (EntityAPIi18nItegrationTestCase) [Entity API]7114
MessageGroupFilenameLineFunctionStatus
The test did not complete due to a fatal error.Completion checkentity.test649EntityAPIi18nItegrationTestCase->testDefaultController()
Enabled modules: entity_test_i18nOtherentity.test604EntityAPIi18nItegrationTestCase->setUp()
Invalid permission administer languages.Roleentity.test605EntityAPIi18nItegrationTestCase->setUp()
Argument 1 passed to DrupalWebTestCase::drupalLogin() must be an instance of stdClass, boolean given, called in /var/lib/drupaltestbot/sites/default/files/checkout/sites/default/modules/entity/entity.test on line 606 and definedRecoverable errordrupal_web_test_case.php1252DrupalWebTestCase->drupalLogin()
Trying to get property of non-objectNoticedrupal_web_test_case.php1258DrupalWebTestCase->drupalLogin()
Trying to get property of non-objectNoticedrupal_web_test_case.php1259DrupalWebTestCase->drupalLogin()
Failed to set field name to Otherentity.test606EntityAPIi18nItegrationTestCase->setUp()
Failed to set field pass to Otherentity.test606EntityAPIi18nItegrationTestCase->setUp()
Found the requested form fields at userOtherentity.test606EntityAPIi18nItegrationTestCase->setUp()
Trying to get property of non-objectNoticedrupal_web_test_case.php1265DrupalWebTestCase->drupalLogin()
User successfully logged in.User loginentity.test606EntityAPIi18nItegrationTestCase->setUp()
Failed to set field langcode to deOtherentity.test623EntityAPIi18nItegrationTestCase->addLanguage()
Found the Add language buttonOtherentity.test623EntityAPIi18nItegrationTestCase->addLanguage()
Found the requested form fields at admin/config/regional/language/addOtherentity.test623EntityAPIi18nItegrationTestCase->addLanguage()
Language was installed successfully.Otherentity.test628EntityAPIi18nItegrationTestCase->addLanguage()
ExpandMetadata Wrapper (EntityMetadataTestCase) [Entity API]6901
MessageGroupFilenameLineFunctionStatus
EntityMetadataWrapperException: Unable to get the data property value as the parent data structure is not set. in EntityStructureWrapper->getPropertyValue() (line 438 of /var/lib/drupaltestbot/sites/default/files/checkout/sites/default/modules/entity/includes/entity.wrapper.inc).Uncaught exceptionentity.wrapper.inc438EntityStructureWrapper->getPropertyValue()

All

Test namePassFailException
LeafEntity API comment node access (EntityAPICommentNodeAccessTestCase) [Entity API]3500
LeafEntity CRUD (EntityAPITestCase) [Entity API]7900
ExpandEntity CRUD i18n integration (EntityAPIi18nItegrationTestCase) [Entity API]7114
MessageGroupFilenameLineFunctionStatus
The test did not complete due to a fatal error.Completion checkentity.test649EntityAPIi18nItegrationTestCase->testDefaultController()
Enabled modules: entity_test_i18nOtherentity.test604EntityAPIi18nItegrationTestCase->setUp()
Invalid permission administer languages.Roleentity.test605EntityAPIi18nItegrationTestCase->setUp()
Argument 1 passed to DrupalWebTestCase::drupalLogin() must be an instance of stdClass, boolean given, called in /var/lib/drupaltestbot/sites/default/files/checkout/sites/default/modules/entity/entity.test on line 606 and definedRecoverable errordrupal_web_test_case.php1252DrupalWebTestCase->drupalLogin()
Trying to get property of non-objectNoticedrupal_web_test_case.php1258DrupalWebTestCase->drupalLogin()
Trying to get property of non-objectNoticedrupal_web_test_case.php1259DrupalWebTestCase->drupalLogin()
Failed to set field name to Otherentity.test606EntityAPIi18nItegrationTestCase->setUp()
Failed to set field pass to Otherentity.test606EntityAPIi18nItegrationTestCase->setUp()
Found the requested form fields at userOtherentity.test606EntityAPIi18nItegrationTestCase->setUp()
Trying to get property of non-objectNoticedrupal_web_test_case.php1265DrupalWebTestCase->drupalLogin()
User successfully logged in.User loginentity.test606EntityAPIi18nItegrationTestCase->setUp()
Failed to set field langcode to deOtherentity.test623EntityAPIi18nItegrationTestCase->addLanguage()
Found the Add language buttonOtherentity.test623EntityAPIi18nItegrationTestCase->addLanguage()
Found the requested form fields at admin/config/regional/language/addOtherentity.test623EntityAPIi18nItegrationTestCase->addLanguage()
Language was installed successfully.Otherentity.test628EntityAPIi18nItegrationTestCase->addLanguage()
LeafEntity Metadata Node Access (EntityMetadataNodeAccessTestCase) [Entity API]3400
LeafEntity Metadata Node Create Access (EntityMetadataNodeCreateAccessTestCase) [Entity API]1500
LeafEntity Metadata Node Revision Access (EntityMetadataNodeRevisionAccessTestCase) [Entity API]2900
LeafEntity tokens (EntityTokenTestCase) [Entity API]600
ExpandMetadata Wrapper (EntityMetadataTestCase) [Entity API]6901
MessageGroupFilenameLineFunctionStatus
EntityMetadataWrapperException: Unable to get the data property value as the parent data structure is not set. in EntityStructureWrapper->getPropertyValue() (line 438 of /var/lib/drupaltestbot/sites/default/files/checkout/sites/default/modules/entity/includes/entity.wrapper.inc).Uncaught exceptionentity.wrapper.inc438EntityStructureWrapper->getPropertyValue()
LeafProperty info core integration (EntityMetadataIntegrationTestCase) [Entity API]27900