use_regular_cache_table-1325288-39.patch

Test status
StatusResult
Last receivedTue, 10/06/2015 - 13:13:00
Last requestedTue, 10/06/2015 - 13:13:01
Last testedTue, 10/06/2015 - 13:14:03
Test count2
Environment status
MySQLfail
File information
Fileuse_regular_cache_table-1325288-39.patch
BranchFeatures - 7.x-2.x
LinkIssue Link
SummaryFAILED: [[SimpleTest]]: [MySQL] 20 pass(es), 2 fail(s), and 3 exception(s).
Details

MySQL

  1. Setup environment
  2. Detect an invalid patch URL
  3. Detect invalid repository information
  4. Detect invalid patch format
  5. Detect a non-applicable patch
  6. Detect invalid PHP syntax
  7. Detect a Drupal installation failure
  8. Detect a test run failure
  9. Detect a failing test
    Review the test failures below then if necessary run them locally until the problem has been fixed.
  10. Complete test suite with all tests passing
20 pass(es), 2 fail(s), and 3 exception(s)

Non-pass

Test namePassFailException
ExpandComponent tests (FeaturesUserTestCase) [Features]923
MessageGroupFilenameLineFunctionStatus
field_instance present.Otherfeatures.test61FeaturesUserTestCase->test()
field_instance state: Default.Otherfeatures.test65FeaturesUserTestCase->test()
Undefined index: field_nameNoticefield.crud.inc555field_update_instance()
Undefined index: field_nameNoticefield.crud.inc557field_update_instance()
FieldException: Attempt to update an instance of a nonexistent field . in field_update_instance() (line 557 of /var/lib/drupaltestbot/sites/default/files/checkout/modules/field/field.crud.inc).Uncaught exceptionfield.crud.inc557field_update_instance()

All

Test namePassFailException
ExpandComponent tests (FeaturesUserTestCase) [Features]923
MessageGroupFilenameLineFunctionStatus
field_instance present.Otherfeatures.test61FeaturesUserTestCase->test()
field_instance state: Default.Otherfeatures.test65FeaturesUserTestCase->test()
Undefined index: field_nameNoticefield.crud.inc555field_update_instance()
Undefined index: field_nameNoticefield.crud.inc557field_update_instance()
FieldException: Attempt to update an instance of a nonexistent field . in field_update_instance() (line 557 of /var/lib/drupaltestbot/sites/default/files/checkout/modules/field/field.crud.inc).Uncaught exceptionfield.crud.inc557field_update_instance()
LeafFeature Detection tests (FeaturesDetectionTestCase) [Features]400
LeafFeatures Chaos Tools integration (FeaturesCtoolsIntegrationTest) [Features]500
LeafFeatures enable tests (FeaturesEnableTestCase) [Features]200