Add_sort_job-items-2573101-3.patch

Test status
StatusResult
Last receivedMon, 10/05/2015 - 15:16:00
Last requestedMon, 10/05/2015 - 17:07:22
Last testedMon, 10/05/2015 - 17:08:00
Test count1
Environment status
PHP 5.5 MySQLfail
File information
FileAdd_sort_job-items-2573101-3.patch
BranchTranslation Management Tool - 8.x-1.x
LinkIssue Link
SummaryFAILED: [[SimpleTest]]: [PHP 5.5 MySQL] 586 pass(es), 20 fail(s), and 21 exception(s).
Details

PHP 5.5 MySQL

  1. Setup environment
  2. Detect an invalid patch URL
  3. Detect invalid repository information
  4. Detect invalid patch format
  5. Detect a non-applicable patch
  6. Detect invalid PHP syntax
  7. Detect a Drupal installation failure
  8. Detect a test run failure
  9. Detect a failing test
    Review the test failures below then if necessary run them locally until the problem has been fixed.
  10. Complete test suite with all tests passing
586 pass(es), 20 fail(s), and 21 exception(s)

Non-pass

Test namePassFailException
ExpandDrupal\tmgmt\Tests\LocalTasksTests011
MessageGroupFilenameLineFunctionStatus
The test did not complete due to a fatal error.Completion checkLocalTasksTests.php38Drupal\tmgmt\Tests\LocalTasksTests->testTranslatorLocalTaks()
Drupal\Core\Config\Schema\SchemaIncompleteException: Schema errors for views.view.tmgmt_job_items with the following errors: views.view.tmgmt_job_items:display.default.display_options.sorts.tjiid.expose missing schema, views.view.tmgmt_job_items:display.default.display_options.sorts.word_count.expose missing schema in Drupal\Core\Config\Testing\ConfigSchemaChecker->onConfigSave() (line 98 of /var/lib/drupaltestbot/sites/default/files/checkout/core/lib/Drupal/Core/Config/Testing/ConfigSchemaChecker.php). Drupal\Core\Config\Testing\ConfigSchemaChecker->onConfigSave(Object, 'config.save', Object) Drupal\Component\EventDispatcher\ContainerAwareEventDispatcher->dispatch('config.save', Object) Drupal\Core\Config\Config->save(1) Drupal\Core\Config\Entity\ConfigEntityStorage->doSave('tmgmt_job_items', Object) Drupal\Core\Entity\EntityStorageBase->save(Object) Drupal\Core\Config\Entity\ConfigEntityStorage->save(Object) Drupal\Core\Entity\Entity->save() Drupal\Core\Config\Entity\ConfigEntityBase->save() Drupal\Core\Config\ConfigInstaller->createConfiguration('', Array) Drupal\Core\Config\ConfigInstaller->installDefaultConfig('module', 'tmgmt') Drupal\Core\ProxyClass\Config\ConfigInstaller->installDefaultConfig('module', 'tmgmt') Drupal\Core\Extension\ModuleInstaller->install(Array, 1) Drupal\Core\ProxyClass\Extension\ModuleInstaller->install(Array, 1) Drupal\simpletest\WebTestBase->installModulesFromClassProperty(Object) Drupal\simpletest\WebTestBase->setUp() Drupal\tmgmt\Tests\TMGMTTestBase->setUp() Drupal\tmgmt\Tests\LocalTasksTests->setUp() Drupal\simpletest\TestBase->run(Array) simpletest_script_run_one_test('16', 'Drupal\tmgmt\Tests\LocalTasksTests') Uncaught exceptionConfigSchemaChecker.php98Drupal\Core\Config\Testing\ConfigSchemaChecker->onConfigSave()
ExpandDrupal\tmgmt\Tests\TMGMTCartTest011
MessageGroupFilenameLineFunctionStatus
The test did not complete due to a fatal error.Completion checkTMGMTCartTest.php43Drupal\tmgmt\Tests\TMGMTCartTest->testCartEnforceSourceLanguage()
Drupal\Core\Config\Schema\SchemaIncompleteException: Schema errors for views.view.tmgmt_job_items with the following errors: views.view.tmgmt_job_items:display.default.display_options.sorts.tjiid.expose missing schema, views.view.tmgmt_job_items:display.default.display_options.sorts.word_count.expose missing schema in Drupal\Core\Config\Testing\ConfigSchemaChecker->onConfigSave() (line 98 of /var/lib/drupaltestbot/sites/default/files/checkout/core/lib/Drupal/Core/Config/Testing/ConfigSchemaChecker.php). Drupal\Core\Config\Testing\ConfigSchemaChecker->onConfigSave(Object, 'config.save', Object) Drupal\Component\EventDispatcher\ContainerAwareEventDispatcher->dispatch('config.save', Object) Drupal\Core\Config\Config->save(1) Drupal\Core\Config\Entity\ConfigEntityStorage->doSave('tmgmt_job_items', Object) Drupal\Core\Entity\EntityStorageBase->save(Object) Drupal\Core\Config\Entity\ConfigEntityStorage->save(Object) Drupal\Core\Entity\Entity->save() Drupal\Core\Config\Entity\ConfigEntityBase->save() Drupal\Core\Config\ConfigInstaller->createConfiguration('', Array) Drupal\Core\Config\ConfigInstaller->installDefaultConfig('module', 'tmgmt') Drupal\Core\ProxyClass\Config\ConfigInstaller->installDefaultConfig('module', 'tmgmt') Drupal\Core\Extension\ModuleInstaller->install(Array, 1) Drupal\Core\ProxyClass\Extension\ModuleInstaller->install(Array, 1) Drupal\simpletest\WebTestBase->installModulesFromClassProperty(Object) Drupal\simpletest\WebTestBase->setUp() Drupal\tmgmt\Tests\TMGMTTestBase->setUp() Drupal\tmgmt\Tests\TMGMTCartTest->setUp() Drupal\simpletest\TestBase->run(Array) simpletest_script_run_one_test('14', 'Drupal\tmgmt\Tests\TMGMTCartTest') Uncaught exceptionConfigSchemaChecker.php98Drupal\Core\Config\Testing\ConfigSchemaChecker->onConfigSave()
ExpandDrupal\tmgmt\Tests\TMGMTUiTest011
MessageGroupFilenameLineFunctionStatus
The test did not complete due to a fatal error.Completion checkTMGMTUiTest.php53Drupal\tmgmt\Tests\TMGMTUiTest->testCheckoutForm()
Drupal\Core\Config\Schema\SchemaIncompleteException: Schema errors for views.view.tmgmt_job_items with the following errors: views.view.tmgmt_job_items:display.default.display_options.sorts.tjiid.expose missing schema, views.view.tmgmt_job_items:display.default.display_options.sorts.word_count.expose missing schema in Drupal\Core\Config\Testing\ConfigSchemaChecker->onConfigSave() (line 98 of /var/lib/drupaltestbot/sites/default/files/checkout/core/lib/Drupal/Core/Config/Testing/ConfigSchemaChecker.php). Drupal\Core\Config\Testing\ConfigSchemaChecker->onConfigSave(Object, 'config.save', Object) Drupal\Component\EventDispatcher\ContainerAwareEventDispatcher->dispatch('config.save', Object) Drupal\Core\Config\Config->save(1) Drupal\Core\Config\Entity\ConfigEntityStorage->doSave('tmgmt_job_items', Object) Drupal\Core\Entity\EntityStorageBase->save(Object) Drupal\Core\Config\Entity\ConfigEntityStorage->save(Object) Drupal\Core\Entity\Entity->save() Drupal\Core\Config\Entity\ConfigEntityBase->save() Drupal\Core\Config\ConfigInstaller->createConfiguration('', Array) Drupal\Core\Config\ConfigInstaller->installDefaultConfig('module', 'tmgmt') Drupal\Core\ProxyClass\Config\ConfigInstaller->installDefaultConfig('module', 'tmgmt') Drupal\Core\Extension\ModuleInstaller->install(Array, 1) Drupal\Core\ProxyClass\Extension\ModuleInstaller->install(Array, 1) Drupal\simpletest\WebTestBase->installModulesFromClassProperty(Object) Drupal\simpletest\WebTestBase->setUp() Drupal\tmgmt\Tests\TMGMTTestBase->setUp() Drupal\tmgmt\Tests\TMGMTUiTest->setUp() Drupal\simpletest\TestBase->run(Array) simpletest_script_run_one_test('13', 'Drupal\tmgmt\Tests\TMGMTUiTest') Uncaught exceptionConfigSchemaChecker.php98Drupal\Core\Config\Testing\ConfigSchemaChecker->onConfigSave()
ExpandDrupal\tmgmt\Tests\TranslatorTest011
MessageGroupFilenameLineFunctionStatus
The test did not complete due to a fatal error.Completion checkTranslatorTest.php40Drupal\tmgmt\Tests\TranslatorTest->testTranslatorHandling()
Drupal\Core\Config\Schema\SchemaIncompleteException: Schema errors for views.view.tmgmt_job_items with the following errors: views.view.tmgmt_job_items:display.default.display_options.sorts.tjiid.expose missing schema, views.view.tmgmt_job_items:display.default.display_options.sorts.word_count.expose missing schema in Drupal\Core\Config\Testing\ConfigSchemaChecker->onConfigSave() (line 98 of /var/lib/drupaltestbot/sites/default/files/checkout/core/lib/Drupal/Core/Config/Testing/ConfigSchemaChecker.php). Drupal\Core\Config\Testing\ConfigSchemaChecker->onConfigSave(Object, 'config.save', Object) Drupal\Component\EventDispatcher\ContainerAwareEventDispatcher->dispatch('config.save', Object) Drupal\Core\Config\Config->save(1) Drupal\Core\Config\Entity\ConfigEntityStorage->doSave('tmgmt_job_items', Object) Drupal\Core\Entity\EntityStorageBase->save(Object) Drupal\Core\Config\Entity\ConfigEntityStorage->save(Object) Drupal\Core\Entity\Entity->save() Drupal\Core\Config\Entity\ConfigEntityBase->save() Drupal\Core\Config\ConfigInstaller->createConfiguration('', Array) Drupal\Core\Config\ConfigInstaller->installDefaultConfig('module', 'tmgmt') Drupal\Core\ProxyClass\Config\ConfigInstaller->installDefaultConfig('module', 'tmgmt') Drupal\Core\Extension\ModuleInstaller->install(Array, 1) Drupal\Core\ProxyClass\Extension\ModuleInstaller->install(Array, 1) Drupal\simpletest\WebTestBase->installModulesFromClassProperty(Object) Drupal\simpletest\WebTestBase->setUp() Drupal\tmgmt\Tests\TMGMTTestBase->setUp() Drupal\tmgmt\Tests\TranslatorTest->setUp() Drupal\simpletest\TestBase->run(Array) simpletest_script_run_one_test('12', 'Drupal\tmgmt\Tests\TranslatorTest') Uncaught exceptionConfigSchemaChecker.php98Drupal\Core\Config\Testing\ConfigSchemaChecker->onConfigSave()
ExpandDrupal\tmgmt\Tests\TranslatorUITest011
MessageGroupFilenameLineFunctionStatus
The test did not complete due to a fatal error.Completion checkTranslatorUITest.php37Drupal\tmgmt\Tests\TranslatorUITest->testTranslatorUI()
Drupal\Core\Config\Schema\SchemaIncompleteException: Schema errors for views.view.tmgmt_job_items with the following errors: views.view.tmgmt_job_items:display.default.display_options.sorts.tjiid.expose missing schema, views.view.tmgmt_job_items:display.default.display_options.sorts.word_count.expose missing schema in Drupal\Core\Config\Testing\ConfigSchemaChecker->onConfigSave() (line 98 of /var/lib/drupaltestbot/sites/default/files/checkout/core/lib/Drupal/Core/Config/Testing/ConfigSchemaChecker.php). Drupal\Core\Config\Testing\ConfigSchemaChecker->onConfigSave(Object, 'config.save', Object) Drupal\Component\EventDispatcher\ContainerAwareEventDispatcher->dispatch('config.save', Object) Drupal\Core\Config\Config->save(1) Drupal\Core\Config\Entity\ConfigEntityStorage->doSave('tmgmt_job_items', Object) Drupal\Core\Entity\EntityStorageBase->save(Object) Drupal\Core\Config\Entity\ConfigEntityStorage->save(Object) Drupal\Core\Entity\Entity->save() Drupal\Core\Config\Entity\ConfigEntityBase->save() Drupal\Core\Config\ConfigInstaller->createConfiguration('', Array) Drupal\Core\Config\ConfigInstaller->installDefaultConfig('module', 'tmgmt') Drupal\Core\ProxyClass\Config\ConfigInstaller->installDefaultConfig('module', 'tmgmt') Drupal\Core\Extension\ModuleInstaller->install(Array, 1) Drupal\Core\ProxyClass\Extension\ModuleInstaller->install(Array, 1) Drupal\simpletest\WebTestBase->installModulesFromClassProperty(Object) Drupal\simpletest\WebTestBase->setUp() Drupal\tmgmt\Tests\TMGMTTestBase->setUp() Drupal\tmgmt\Tests\TranslatorUITest->setUp() Drupal\simpletest\TestBase->run(Array) simpletest_script_run_one_test('11', 'Drupal\tmgmt\Tests\TranslatorUITest') Uncaught exceptionConfigSchemaChecker.php98Drupal\Core\Config\Testing\ConfigSchemaChecker->onConfigSave()
ExpandDrupal\tmgmt_config\Tests\ConfigSourceListTest011
MessageGroupFilenameLineFunctionStatus
The test did not complete due to a fatal error.Completion checkConfigSourceListTest.php56Drupal\tmgmt_config\Tests\ConfigSourceListTest->testNodeTypeSubmissions()
Drupal\Core\Config\Schema\SchemaIncompleteException: Schema errors for views.view.tmgmt_job_items with the following errors: views.view.tmgmt_job_items:display.default.display_options.sorts.tjiid.expose missing schema, views.view.tmgmt_job_items:display.default.display_options.sorts.word_count.expose missing schema in Drupal\Core\Config\Testing\ConfigSchemaChecker->onConfigSave() (line 98 of /var/lib/drupaltestbot/sites/default/files/checkout/core/lib/Drupal/Core/Config/Testing/ConfigSchemaChecker.php). Drupal\Core\Config\Testing\ConfigSchemaChecker->onConfigSave(Object, 'config.save', Object) Drupal\Component\EventDispatcher\ContainerAwareEventDispatcher->dispatch('config.save', Object) Drupal\Core\Config\Config->save(1) Drupal\Core\Config\Entity\ConfigEntityStorage->doSave('tmgmt_job_items', Object) Drupal\Core\Entity\EntityStorageBase->save(Object) Drupal\Core\Config\Entity\ConfigEntityStorage->save(Object) Drupal\Core\Entity\Entity->save() Drupal\Core\Config\Entity\ConfigEntityBase->save() Drupal\Core\Config\ConfigInstaller->createConfiguration('', Array) Drupal\Core\Config\ConfigInstaller->installDefaultConfig('module', 'tmgmt') Drupal\Core\ProxyClass\Config\ConfigInstaller->installDefaultConfig('module', 'tmgmt') Drupal\Core\Extension\ModuleInstaller->install(Array, 1) Drupal\Core\ProxyClass\Extension\ModuleInstaller->install(Array, 1) Drupal\simpletest\WebTestBase->installModulesFromClassProperty(Object) Drupal\simpletest\WebTestBase->setUp() Drupal\tmgmt\Tests\TMGMTTestBase->setUp() Drupal\tmgmt_config\Tests\ConfigSourceListTest->setUp() Drupal\simpletest\TestBase->run(Array) simpletest_script_run_one_test('10', 'Drupal\tmgmt_config\Tests\ConfigSourceListTest') Uncaught exceptionConfigSchemaChecker.php98Drupal\Core\Config\Testing\ConfigSchemaChecker->onConfigSave()
ExpandDrupal\tmgmt_config\Tests\ConfigSourceUiTest011
MessageGroupFilenameLineFunctionStatus
The test did not complete due to a fatal error.Completion checkConfigSourceUiTest.php52Drupal\tmgmt_config\Tests\ConfigSourceUiTest->testNodeTypeTranslateTabSingleCheckout()
Drupal\Core\Config\Schema\SchemaIncompleteException: Schema errors for views.view.tmgmt_job_items with the following errors: views.view.tmgmt_job_items:display.default.display_options.sorts.tjiid.expose missing schema, views.view.tmgmt_job_items:display.default.display_options.sorts.word_count.expose missing schema in Drupal\Core\Config\Testing\ConfigSchemaChecker->onConfigSave() (line 98 of /var/lib/drupaltestbot/sites/default/files/checkout/core/lib/Drupal/Core/Config/Testing/ConfigSchemaChecker.php). Drupal\Core\Config\Testing\ConfigSchemaChecker->onConfigSave(Object, 'config.save', Object) Drupal\Component\EventDispatcher\ContainerAwareEventDispatcher->dispatch('config.save', Object) Drupal\Core\Config\Config->save(1) Drupal\Core\Config\Entity\ConfigEntityStorage->doSave('tmgmt_job_items', Object) Drupal\Core\Entity\EntityStorageBase->save(Object) Drupal\Core\Config\Entity\ConfigEntityStorage->save(Object) Drupal\Core\Entity\Entity->save() Drupal\Core\Config\Entity\ConfigEntityBase->save() Drupal\Core\Config\ConfigInstaller->createConfiguration('', Array) Drupal\Core\Config\ConfigInstaller->installDefaultConfig('module', 'tmgmt') Drupal\Core\ProxyClass\Config\ConfigInstaller->installDefaultConfig('module', 'tmgmt') Drupal\Core\Extension\ModuleInstaller->install(Array, 1) Drupal\Core\ProxyClass\Extension\ModuleInstaller->install(Array, 1) Drupal\simpletest\WebTestBase->installModulesFromClassProperty(Object) Drupal\simpletest\WebTestBase->setUp() Drupal\tmgmt\Tests\TMGMTTestBase->setUp() Drupal\tmgmt_config\Tests\ConfigSourceUiTest->setUp() Drupal\simpletest\TestBase->run(Array) simpletest_script_run_one_test('9', 'Drupal\tmgmt_config\Tests\ConfigSourceUiTest') Uncaught exceptionConfigSchemaChecker.php98Drupal\Core\Config\Testing\ConfigSchemaChecker->onConfigSave()
ExpandDrupal\tmgmt_config\Tests\ConfigSourceUnitTest6189
MessageGroupFilenameLineFunctionStatus
Undefined index: nameDrupal\tmgmt_config\Tests\ConfigSourceUnitTest->testNodeType() Drupal\simpletest\TestBase->run(Array) simpletest_script_run_one_test('8', 'Drupal\tmgmt_config\Tests\ConfigSourceUnitTest') NoticeConfigSourceUnitTest.php75Drupal\tmgmt_config\Tests\ConfigSourceUnitTest->testNodeType()
Value NULL is equal to value 'Name'.OtherConfigSourceUnitTest.php75Drupal\tmgmt_config\Tests\ConfigSourceUnitTest->testNodeType()
Undefined index: nameDrupal\tmgmt_config\Tests\ConfigSourceUnitTest->testNodeType() Drupal\simpletest\TestBase->run(Array) simpletest_script_run_one_test('8', 'Drupal\tmgmt_config\Tests\ConfigSourceUnitTest') NoticeConfigSourceUnitTest.php76Drupal\tmgmt_config\Tests\ConfigSourceUnitTest->testNodeType()
Value NULL is equal to value 'Node type name'.OtherConfigSourceUnitTest.php76Drupal\tmgmt_config\Tests\ConfigSourceUnitTest->testNodeType()
Undefined index: nameDrupal\tmgmt_config\Tests\ConfigSourceUnitTest->testNodeType() Drupal\simpletest\TestBase->run(Array) simpletest_script_run_one_test('8', 'Drupal\tmgmt_config\Tests\ConfigSourceUnitTest') NoticeConfigSourceUnitTest.php77Drupal\tmgmt_config\Tests\ConfigSourceUnitTest->testNodeType()
Value NULL is equal to value true.OtherConfigSourceUnitTest.php77Drupal\tmgmt_config\Tests\ConfigSourceUnitTest->testNodeType()
Undefined index: descriptionDrupal\tmgmt_config\Tests\ConfigSourceUnitTest->testNodeType() Drupal\simpletest\TestBase->run(Array) simpletest_script_run_one_test('8', 'Drupal\tmgmt_config\Tests\ConfigSourceUnitTest') NoticeConfigSourceUnitTest.php78Drupal\tmgmt_config\Tests\ConfigSourceUnitTest->testNodeType()
Value NULL is equal to value 'Description'.OtherConfigSourceUnitTest.php78Drupal\tmgmt_config\Tests\ConfigSourceUnitTest->testNodeType()
Undefined index: descriptionDrupal\tmgmt_config\Tests\ConfigSourceUnitTest->testNodeType() Drupal\simpletest\TestBase->run(Array) simpletest_script_run_one_test('8', 'Drupal\tmgmt_config\Tests\ConfigSourceUnitTest') NoticeConfigSourceUnitTest.php79Drupal\tmgmt_config\Tests\ConfigSourceUnitTest->testNodeType()
Value NULL is equal to value 'Node type description'.OtherConfigSourceUnitTest.php79Drupal\tmgmt_config\Tests\ConfigSourceUnitTest->testNodeType()
Undefined index: descriptionDrupal\tmgmt_config\Tests\ConfigSourceUnitTest->testNodeType() Drupal\simpletest\TestBase->run(Array) simpletest_script_run_one_test('8', 'Drupal\tmgmt_config\Tests\ConfigSourceUnitTest') NoticeConfigSourceUnitTest.php80Drupal\tmgmt_config\Tests\ConfigSourceUnitTest->testNodeType()
Value NULL is equal to value true.OtherConfigSourceUnitTest.php80Drupal\tmgmt_config\Tests\ConfigSourceUnitTest->testNodeType()
Undefined index: nameDrupal\tmgmt_config\Tests\ConfigSourceUnitTest->testNodeType() Drupal\simpletest\TestBase->run(Array) simpletest_script_run_one_test('8', 'Drupal\tmgmt_config\Tests\ConfigSourceUnitTest') NoticeConfigSourceUnitTest.php97Drupal\tmgmt_config\Tests\ConfigSourceUnitTest->testNodeType()
Value 'de_Node type name' is equal to value NULL.OtherConfigSourceUnitTest.php97Drupal\tmgmt_config\Tests\ConfigSourceUnitTest->testNodeType()
Undefined index: descriptionDrupal\tmgmt_config\Tests\ConfigSourceUnitTest->testNodeType() Drupal\simpletest\TestBase->run(Array) simpletest_script_run_one_test('8', 'Drupal\tmgmt_config\Tests\ConfigSourceUnitTest') NoticeConfigSourceUnitTest.php98Drupal\tmgmt_config\Tests\ConfigSourceUnitTest->testNodeType()
Value 'de_Node type description' is equal to value NULL.OtherConfigSourceUnitTest.php98Drupal\tmgmt_config\Tests\ConfigSourceUnitTest->testNodeType()
Drupal\Core\Config\Schema\SchemaIncompleteException: Schema errors for views.view.tmgmt_job_items with the following errors: views.view.tmgmt_job_items:display.default.display_options.sorts.tjiid.expose missing schema, views.view.tmgmt_job_items:display.default.display_options.sorts.word_count.expose missing schema in Drupal\Core\Config\Testing\ConfigSchemaChecker->onConfigSave() (line 98 of /var/lib/drupaltestbot/sites/default/files/checkout/core/lib/Drupal/Core/Config/Testing/ConfigSchemaChecker.php). Drupal\Core\Config\Testing\ConfigSchemaChecker->onConfigSave(Object, 'config.save', Object) Drupal\Component\EventDispatcher\ContainerAwareEventDispatcher->dispatch('config.save', Object) Drupal\Core\Config\Config->save(1) Drupal\Core\Config\Entity\ConfigEntityStorage->doSave('tmgmt_job_items', Object) Drupal\Core\Entity\EntityStorageBase->save(Object) Drupal\Core\Config\Entity\ConfigEntityStorage->save(Object) Drupal\Core\Entity\Entity->save() Drupal\Core\Config\Entity\ConfigEntityBase->save() Drupal\Core\Config\ConfigInstaller->createConfiguration('', Array) Drupal\Core\Config\ConfigInstaller->installDefaultConfig('module', 'tmgmt') Drupal\Core\ProxyClass\Config\ConfigInstaller->installDefaultConfig('module', 'tmgmt') Drupal\simpletest\KernelTestBase->installConfig(Array) Drupal\tmgmt_config\Tests\ConfigSourceUnitTest->testView() Drupal\simpletest\TestBase->run(Array) simpletest_script_run_one_test('8', 'Drupal\tmgmt_config\Tests\ConfigSourceUnitTest') Uncaught exceptionConfigSchemaChecker.php98Drupal\Core\Config\Testing\ConfigSchemaChecker->onConfigSave()
ExpandDrupal\tmgmt_content\Tests\ContentEntitySourceListTest011
MessageGroupFilenameLineFunctionStatus
The test did not complete due to a fatal error.Completion checkContentEntitySourceListTest.php64Drupal\tmgmt_content\Tests\ContentEntitySourceListTest->testTermBundleFilter()
Drupal\Core\Config\Schema\SchemaIncompleteException: Schema errors for views.view.tmgmt_job_items with the following errors: views.view.tmgmt_job_items:display.default.display_options.sorts.tjiid.expose missing schema, views.view.tmgmt_job_items:display.default.display_options.sorts.word_count.expose missing schema in Drupal\Core\Config\Testing\ConfigSchemaChecker->onConfigSave() (line 98 of /var/lib/drupaltestbot/sites/default/files/checkout/core/lib/Drupal/Core/Config/Testing/ConfigSchemaChecker.php). Drupal\Core\Config\Testing\ConfigSchemaChecker->onConfigSave(Object, 'config.save', Object) Drupal\Component\EventDispatcher\ContainerAwareEventDispatcher->dispatch('config.save', Object) Drupal\Core\Config\Config->save(1) Drupal\Core\Config\Entity\ConfigEntityStorage->doSave('tmgmt_job_items', Object) Drupal\Core\Entity\EntityStorageBase->save(Object) Drupal\Core\Config\Entity\ConfigEntityStorage->save(Object) Drupal\Core\Entity\Entity->save() Drupal\Core\Config\Entity\ConfigEntityBase->save() Drupal\Core\Config\ConfigInstaller->createConfiguration('', Array) Drupal\Core\Config\ConfigInstaller->installDefaultConfig('module', 'tmgmt') Drupal\Core\ProxyClass\Config\ConfigInstaller->installDefaultConfig('module', 'tmgmt') Drupal\Core\Extension\ModuleInstaller->install(Array, 1) Drupal\Core\ProxyClass\Extension\ModuleInstaller->install(Array, 1) Drupal\simpletest\WebTestBase->installModulesFromClassProperty(Object) Drupal\simpletest\WebTestBase->setUp() Drupal\tmgmt\Tests\TMGMTTestBase->setUp() Drupal\tmgmt_content\Tests\ContentEntitySourceListTest->setUp() Drupal\simpletest\TestBase->run(Array) simpletest_script_run_one_test('5', 'Drupal\tmgmt_content\Tests\ContentEntitySourceListTest') Uncaught exceptionConfigSchemaChecker.php98Drupal\Core\Config\Testing\ConfigSchemaChecker->onConfigSave()
ExpandDrupal\tmgmt_content\Tests\ContentEntitySourceUiTest011
MessageGroupFilenameLineFunctionStatus
The test did not complete due to a fatal error.Completion checkContentEntitySourceUiTest.php58Drupal\tmgmt_content\Tests\ContentEntitySourceUiTest->testNodeTranslateTabSingleCheckout()
Drupal\Core\Config\Schema\SchemaIncompleteException: Schema errors for views.view.tmgmt_job_items with the following errors: views.view.tmgmt_job_items:display.default.display_options.sorts.tjiid.expose missing schema, views.view.tmgmt_job_items:display.default.display_options.sorts.word_count.expose missing schema in Drupal\Core\Config\Testing\ConfigSchemaChecker->onConfigSave() (line 98 of /var/lib/drupaltestbot/sites/default/files/checkout/core/lib/Drupal/Core/Config/Testing/ConfigSchemaChecker.php). Drupal\Core\Config\Testing\ConfigSchemaChecker->onConfigSave(Object, 'config.save', Object) Drupal\Component\EventDispatcher\ContainerAwareEventDispatcher->dispatch('config.save', Object) Drupal\Core\Config\Config->save(1) Drupal\Core\Config\Entity\ConfigEntityStorage->doSave('tmgmt_job_items', Object) Drupal\Core\Entity\EntityStorageBase->save(Object) Drupal\Core\Config\Entity\ConfigEntityStorage->save(Object) Drupal\Core\Entity\Entity->save() Drupal\Core\Config\Entity\ConfigEntityBase->save() Drupal\Core\Config\ConfigInstaller->createConfiguration('', Array) Drupal\Core\Config\ConfigInstaller->installDefaultConfig('module', 'tmgmt') Drupal\Core\ProxyClass\Config\ConfigInstaller->installDefaultConfig('module', 'tmgmt') Drupal\Core\Extension\ModuleInstaller->install(Array, 1) Drupal\Core\ProxyClass\Extension\ModuleInstaller->install(Array, 1) Drupal\simpletest\WebTestBase->installModulesFromClassProperty(Object) Drupal\simpletest\WebTestBase->setUp() Drupal\tmgmt\Tests\TMGMTTestBase->setUp() Drupal\tmgmt_content\Tests\ContentEntitySourceUiTest->setUp() Drupal\simpletest\TestBase->run(Array) simpletest_script_run_one_test('4', 'Drupal\tmgmt_content\Tests\ContentEntitySourceUiTest') Uncaught exceptionConfigSchemaChecker.php98Drupal\Core\Config\Testing\ConfigSchemaChecker->onConfigSave()
ExpandDrupal\tmgmt_demo\Tests\TMGMTDemoTest011
MessageGroupFilenameLineFunctionStatus
The test did not complete due to a fatal error.Completion checkTMGMTDemoTest.php40Drupal\tmgmt_demo\Tests\TMGMTDemoTest->testInstalled()
Drupal\Core\Config\Schema\SchemaIncompleteException: Schema errors for views.view.tmgmt_job_items with the following errors: views.view.tmgmt_job_items:display.default.display_options.sorts.tjiid.expose missing schema, views.view.tmgmt_job_items:display.default.display_options.sorts.word_count.expose missing schema in Drupal\Core\Config\Testing\ConfigSchemaChecker->onConfigSave() (line 98 of /var/lib/drupaltestbot/sites/default/files/checkout/core/lib/Drupal/Core/Config/Testing/ConfigSchemaChecker.php). Drupal\Core\Config\Testing\ConfigSchemaChecker->onConfigSave(Object, 'config.save', Object) Drupal\Component\EventDispatcher\ContainerAwareEventDispatcher->dispatch('config.save', Object) Drupal\Core\Config\Config->save(1) Drupal\Core\Config\Entity\ConfigEntityStorage->doSave('tmgmt_job_items', Object) Drupal\Core\Entity\EntityStorageBase->save(Object) Drupal\Core\Config\Entity\ConfigEntityStorage->save(Object) Drupal\Core\Entity\Entity->save() Drupal\Core\Config\Entity\ConfigEntityBase->save() Drupal\Core\Config\ConfigInstaller->createConfiguration('', Array) Drupal\Core\Config\ConfigInstaller->installDefaultConfig('module', 'tmgmt') Drupal\Core\ProxyClass\Config\ConfigInstaller->installDefaultConfig('module', 'tmgmt') Drupal\Core\Extension\ModuleInstaller->install(Array, 1) Drupal\Core\ProxyClass\Extension\ModuleInstaller->install(Array, 1) Drupal\simpletest\WebTestBase->installModulesFromClassProperty(Object) Drupal\simpletest\WebTestBase->setUp() Drupal\tmgmt\Tests\TMGMTTestBase->setUp() Drupal\tmgmt_demo\Tests\TMGMTDemoTest->setUp() Drupal\simpletest\TestBase->run(Array) simpletest_script_run_one_test('1', 'Drupal\tmgmt_demo\Tests\TMGMTDemoTest') Uncaught exceptionConfigSchemaChecker.php98Drupal\Core\Config\Testing\ConfigSchemaChecker->onConfigSave()
ExpandDrupal\tmgmt_file\Tests\FileTranslatorTest011
MessageGroupFilenameLineFunctionStatus
The test did not complete due to a fatal error.Completion checkFileTranslatorTest.php42Drupal\tmgmt_file\Tests\FileTranslatorTest->testXLIFFTextProcessing()
Drupal\Core\Config\Schema\SchemaIncompleteException: Schema errors for views.view.tmgmt_job_items with the following errors: views.view.tmgmt_job_items:display.default.display_options.sorts.tjiid.expose missing schema, views.view.tmgmt_job_items:display.default.display_options.sorts.word_count.expose missing schema in Drupal\Core\Config\Testing\ConfigSchemaChecker->onConfigSave() (line 98 of /var/lib/drupaltestbot/sites/default/files/checkout/core/lib/Drupal/Core/Config/Testing/ConfigSchemaChecker.php). Drupal\Core\Config\Testing\ConfigSchemaChecker->onConfigSave(Object, 'config.save', Object) Drupal\Component\EventDispatcher\ContainerAwareEventDispatcher->dispatch('config.save', Object) Drupal\Core\Config\Config->save(1) Drupal\Core\Config\Entity\ConfigEntityStorage->doSave('tmgmt_job_items', Object) Drupal\Core\Entity\EntityStorageBase->save(Object) Drupal\Core\Config\Entity\ConfigEntityStorage->save(Object) Drupal\Core\Entity\Entity->save() Drupal\Core\Config\Entity\ConfigEntityBase->save() Drupal\Core\Config\ConfigInstaller->createConfiguration('', Array) Drupal\Core\Config\ConfigInstaller->installDefaultConfig('module', 'tmgmt') Drupal\Core\ProxyClass\Config\ConfigInstaller->installDefaultConfig('module', 'tmgmt') Drupal\Core\Extension\ModuleInstaller->install(Array, 1) Drupal\Core\ProxyClass\Extension\ModuleInstaller->install(Array, 1) Drupal\simpletest\WebTestBase->installModulesFromClassProperty(Object) Drupal\simpletest\WebTestBase->setUp() Drupal\tmgmt\Tests\TMGMTTestBase->setUp() Drupal\tmgmt_file\Tests\FileTranslatorTest->setUp() Drupal\simpletest\TestBase->run(Array) simpletest_script_run_one_test('19', 'Drupal\tmgmt_file\Tests\FileTranslatorTest') Uncaught exceptionConfigSchemaChecker.php98Drupal\Core\Config\Testing\ConfigSchemaChecker->onConfigSave()
ExpandDrupal\tmgmt_locale\Tests\LocaleSourceUiTest011
MessageGroupFilenameLineFunctionStatus
The test did not complete due to a fatal error.Completion checkLocaleSourceUiTest.php43Drupal\tmgmt_locale\Tests\LocaleSourceUiTest->testOverview()
Drupal\Core\Config\Schema\SchemaIncompleteException: Schema errors for views.view.tmgmt_job_items with the following errors: views.view.tmgmt_job_items:display.default.display_options.sorts.tjiid.expose missing schema, views.view.tmgmt_job_items:display.default.display_options.sorts.word_count.expose missing schema in Drupal\Core\Config\Testing\ConfigSchemaChecker->onConfigSave() (line 98 of /var/lib/drupaltestbot/sites/default/files/checkout/core/lib/Drupal/Core/Config/Testing/ConfigSchemaChecker.php). Drupal\Core\Config\Testing\ConfigSchemaChecker->onConfigSave(Object, 'config.save', Object) Drupal\Component\EventDispatcher\ContainerAwareEventDispatcher->dispatch('config.save', Object) Drupal\Core\Config\Config->save(1) Drupal\Core\Config\Entity\ConfigEntityStorage->doSave('tmgmt_job_items', Object) Drupal\Core\Entity\EntityStorageBase->save(Object) Drupal\Core\Config\Entity\ConfigEntityStorage->save(Object) Drupal\Core\Entity\Entity->save() Drupal\Core\Config\Entity\ConfigEntityBase->save() Drupal\Core\Config\ConfigInstaller->createConfiguration('', Array) Drupal\Core\Config\ConfigInstaller->installDefaultConfig('module', 'tmgmt') Drupal\Core\ProxyClass\Config\ConfigInstaller->installDefaultConfig('module', 'tmgmt') Drupal\Core\Extension\ModuleInstaller->install(Array, 1) Drupal\Core\ProxyClass\Extension\ModuleInstaller->install(Array, 1) Drupal\simpletest\WebTestBase->installModulesFromClassProperty(Object) Drupal\simpletest\WebTestBase->setUp() Drupal\tmgmt\Tests\TMGMTTestBase->setUp() Drupal\tmgmt_locale\Tests\LocaleSourceUiTest->setUp() Drupal\simpletest\TestBase->run(Array) simpletest_script_run_one_test('6', 'Drupal\tmgmt_locale\Tests\LocaleSourceUiTest') Uncaught exceptionConfigSchemaChecker.php98Drupal\Core\Config\Testing\ConfigSchemaChecker->onConfigSave()

All

Test namePassFailException
LeafDrupal\tmgmt\Tests\CrudTest19900
LeafDrupal\tmgmt\Tests\HelperTest4300
ExpandDrupal\tmgmt\Tests\LocalTasksTests011
MessageGroupFilenameLineFunctionStatus
The test did not complete due to a fatal error.Completion checkLocalTasksTests.php38Drupal\tmgmt\Tests\LocalTasksTests->testTranslatorLocalTaks()
Drupal\Core\Config\Schema\SchemaIncompleteException: Schema errors for views.view.tmgmt_job_items with the following errors: views.view.tmgmt_job_items:display.default.display_options.sorts.tjiid.expose missing schema, views.view.tmgmt_job_items:display.default.display_options.sorts.word_count.expose missing schema in Drupal\Core\Config\Testing\ConfigSchemaChecker->onConfigSave() (line 98 of /var/lib/drupaltestbot/sites/default/files/checkout/core/lib/Drupal/Core/Config/Testing/ConfigSchemaChecker.php). Drupal\Core\Config\Testing\ConfigSchemaChecker->onConfigSave(Object, 'config.save', Object) Drupal\Component\EventDispatcher\ContainerAwareEventDispatcher->dispatch('config.save', Object) Drupal\Core\Config\Config->save(1) Drupal\Core\Config\Entity\ConfigEntityStorage->doSave('tmgmt_job_items', Object) Drupal\Core\Entity\EntityStorageBase->save(Object) Drupal\Core\Config\Entity\ConfigEntityStorage->save(Object) Drupal\Core\Entity\Entity->save() Drupal\Core\Config\Entity\ConfigEntityBase->save() Drupal\Core\Config\ConfigInstaller->createConfiguration('', Array) Drupal\Core\Config\ConfigInstaller->installDefaultConfig('module', 'tmgmt') Drupal\Core\ProxyClass\Config\ConfigInstaller->installDefaultConfig('module', 'tmgmt') Drupal\Core\Extension\ModuleInstaller->install(Array, 1) Drupal\Core\ProxyClass\Extension\ModuleInstaller->install(Array, 1) Drupal\simpletest\WebTestBase->installModulesFromClassProperty(Object) Drupal\simpletest\WebTestBase->setUp() Drupal\tmgmt\Tests\TMGMTTestBase->setUp() Drupal\tmgmt\Tests\LocalTasksTests->setUp() Drupal\simpletest\TestBase->run(Array) simpletest_script_run_one_test('16', 'Drupal\tmgmt\Tests\LocalTasksTests') Uncaught exceptionConfigSchemaChecker.php98Drupal\Core\Config\Testing\ConfigSchemaChecker->onConfigSave()
LeafDrupal\tmgmt\Tests\PluginsTest5000
ExpandDrupal\tmgmt\Tests\TMGMTCartTest011
MessageGroupFilenameLineFunctionStatus
The test did not complete due to a fatal error.Completion checkTMGMTCartTest.php43Drupal\tmgmt\Tests\TMGMTCartTest->testCartEnforceSourceLanguage()
Drupal\Core\Config\Schema\SchemaIncompleteException: Schema errors for views.view.tmgmt_job_items with the following errors: views.view.tmgmt_job_items:display.default.display_options.sorts.tjiid.expose missing schema, views.view.tmgmt_job_items:display.default.display_options.sorts.word_count.expose missing schema in Drupal\Core\Config\Testing\ConfigSchemaChecker->onConfigSave() (line 98 of /var/lib/drupaltestbot/sites/default/files/checkout/core/lib/Drupal/Core/Config/Testing/ConfigSchemaChecker.php). Drupal\Core\Config\Testing\ConfigSchemaChecker->onConfigSave(Object, 'config.save', Object) Drupal\Component\EventDispatcher\ContainerAwareEventDispatcher->dispatch('config.save', Object) Drupal\Core\Config\Config->save(1) Drupal\Core\Config\Entity\ConfigEntityStorage->doSave('tmgmt_job_items', Object) Drupal\Core\Entity\EntityStorageBase->save(Object) Drupal\Core\Config\Entity\ConfigEntityStorage->save(Object) Drupal\Core\Entity\Entity->save() Drupal\Core\Config\Entity\ConfigEntityBase->save() Drupal\Core\Config\ConfigInstaller->createConfiguration('', Array) Drupal\Core\Config\ConfigInstaller->installDefaultConfig('module', 'tmgmt') Drupal\Core\ProxyClass\Config\ConfigInstaller->installDefaultConfig('module', 'tmgmt') Drupal\Core\Extension\ModuleInstaller->install(Array, 1) Drupal\Core\ProxyClass\Extension\ModuleInstaller->install(Array, 1) Drupal\simpletest\WebTestBase->installModulesFromClassProperty(Object) Drupal\simpletest\WebTestBase->setUp() Drupal\tmgmt\Tests\TMGMTTestBase->setUp() Drupal\tmgmt\Tests\TMGMTCartTest->setUp() Drupal\simpletest\TestBase->run(Array) simpletest_script_run_one_test('14', 'Drupal\tmgmt\Tests\TMGMTCartTest') Uncaught exceptionConfigSchemaChecker.php98Drupal\Core\Config\Testing\ConfigSchemaChecker->onConfigSave()
ExpandDrupal\tmgmt\Tests\TMGMTUiTest011
MessageGroupFilenameLineFunctionStatus
The test did not complete due to a fatal error.Completion checkTMGMTUiTest.php53Drupal\tmgmt\Tests\TMGMTUiTest->testCheckoutForm()
Drupal\Core\Config\Schema\SchemaIncompleteException: Schema errors for views.view.tmgmt_job_items with the following errors: views.view.tmgmt_job_items:display.default.display_options.sorts.tjiid.expose missing schema, views.view.tmgmt_job_items:display.default.display_options.sorts.word_count.expose missing schema in Drupal\Core\Config\Testing\ConfigSchemaChecker->onConfigSave() (line 98 of /var/lib/drupaltestbot/sites/default/files/checkout/core/lib/Drupal/Core/Config/Testing/ConfigSchemaChecker.php). Drupal\Core\Config\Testing\ConfigSchemaChecker->onConfigSave(Object, 'config.save', Object) Drupal\Component\EventDispatcher\ContainerAwareEventDispatcher->dispatch('config.save', Object) Drupal\Core\Config\Config->save(1) Drupal\Core\Config\Entity\ConfigEntityStorage->doSave('tmgmt_job_items', Object) Drupal\Core\Entity\EntityStorageBase->save(Object) Drupal\Core\Config\Entity\ConfigEntityStorage->save(Object) Drupal\Core\Entity\Entity->save() Drupal\Core\Config\Entity\ConfigEntityBase->save() Drupal\Core\Config\ConfigInstaller->createConfiguration('', Array) Drupal\Core\Config\ConfigInstaller->installDefaultConfig('module', 'tmgmt') Drupal\Core\ProxyClass\Config\ConfigInstaller->installDefaultConfig('module', 'tmgmt') Drupal\Core\Extension\ModuleInstaller->install(Array, 1) Drupal\Core\ProxyClass\Extension\ModuleInstaller->install(Array, 1) Drupal\simpletest\WebTestBase->installModulesFromClassProperty(Object) Drupal\simpletest\WebTestBase->setUp() Drupal\tmgmt\Tests\TMGMTTestBase->setUp() Drupal\tmgmt\Tests\TMGMTUiTest->setUp() Drupal\simpletest\TestBase->run(Array) simpletest_script_run_one_test('13', 'Drupal\tmgmt\Tests\TMGMTUiTest') Uncaught exceptionConfigSchemaChecker.php98Drupal\Core\Config\Testing\ConfigSchemaChecker->onConfigSave()
ExpandDrupal\tmgmt\Tests\TranslatorTest011
MessageGroupFilenameLineFunctionStatus
The test did not complete due to a fatal error.Completion checkTranslatorTest.php40Drupal\tmgmt\Tests\TranslatorTest->testTranslatorHandling()
Drupal\Core\Config\Schema\SchemaIncompleteException: Schema errors for views.view.tmgmt_job_items with the following errors: views.view.tmgmt_job_items:display.default.display_options.sorts.tjiid.expose missing schema, views.view.tmgmt_job_items:display.default.display_options.sorts.word_count.expose missing schema in Drupal\Core\Config\Testing\ConfigSchemaChecker->onConfigSave() (line 98 of /var/lib/drupaltestbot/sites/default/files/checkout/core/lib/Drupal/Core/Config/Testing/ConfigSchemaChecker.php). Drupal\Core\Config\Testing\ConfigSchemaChecker->onConfigSave(Object, 'config.save', Object) Drupal\Component\EventDispatcher\ContainerAwareEventDispatcher->dispatch('config.save', Object) Drupal\Core\Config\Config->save(1) Drupal\Core\Config\Entity\ConfigEntityStorage->doSave('tmgmt_job_items', Object) Drupal\Core\Entity\EntityStorageBase->save(Object) Drupal\Core\Config\Entity\ConfigEntityStorage->save(Object) Drupal\Core\Entity\Entity->save() Drupal\Core\Config\Entity\ConfigEntityBase->save() Drupal\Core\Config\ConfigInstaller->createConfiguration('', Array) Drupal\Core\Config\ConfigInstaller->installDefaultConfig('module', 'tmgmt') Drupal\Core\ProxyClass\Config\ConfigInstaller->installDefaultConfig('module', 'tmgmt') Drupal\Core\Extension\ModuleInstaller->install(Array, 1) Drupal\Core\ProxyClass\Extension\ModuleInstaller->install(Array, 1) Drupal\simpletest\WebTestBase->installModulesFromClassProperty(Object) Drupal\simpletest\WebTestBase->setUp() Drupal\tmgmt\Tests\TMGMTTestBase->setUp() Drupal\tmgmt\Tests\TranslatorTest->setUp() Drupal\simpletest\TestBase->run(Array) simpletest_script_run_one_test('12', 'Drupal\tmgmt\Tests\TranslatorTest') Uncaught exceptionConfigSchemaChecker.php98Drupal\Core\Config\Testing\ConfigSchemaChecker->onConfigSave()
ExpandDrupal\tmgmt\Tests\TranslatorUITest011
MessageGroupFilenameLineFunctionStatus
The test did not complete due to a fatal error.Completion checkTranslatorUITest.php37Drupal\tmgmt\Tests\TranslatorUITest->testTranslatorUI()
Drupal\Core\Config\Schema\SchemaIncompleteException: Schema errors for views.view.tmgmt_job_items with the following errors: views.view.tmgmt_job_items:display.default.display_options.sorts.tjiid.expose missing schema, views.view.tmgmt_job_items:display.default.display_options.sorts.word_count.expose missing schema in Drupal\Core\Config\Testing\ConfigSchemaChecker->onConfigSave() (line 98 of /var/lib/drupaltestbot/sites/default/files/checkout/core/lib/Drupal/Core/Config/Testing/ConfigSchemaChecker.php). Drupal\Core\Config\Testing\ConfigSchemaChecker->onConfigSave(Object, 'config.save', Object) Drupal\Component\EventDispatcher\ContainerAwareEventDispatcher->dispatch('config.save', Object) Drupal\Core\Config\Config->save(1) Drupal\Core\Config\Entity\ConfigEntityStorage->doSave('tmgmt_job_items', Object) Drupal\Core\Entity\EntityStorageBase->save(Object) Drupal\Core\Config\Entity\ConfigEntityStorage->save(Object) Drupal\Core\Entity\Entity->save() Drupal\Core\Config\Entity\ConfigEntityBase->save() Drupal\Core\Config\ConfigInstaller->createConfiguration('', Array) Drupal\Core\Config\ConfigInstaller->installDefaultConfig('module', 'tmgmt') Drupal\Core\ProxyClass\Config\ConfigInstaller->installDefaultConfig('module', 'tmgmt') Drupal\Core\Extension\ModuleInstaller->install(Array, 1) Drupal\Core\ProxyClass\Extension\ModuleInstaller->install(Array, 1) Drupal\simpletest\WebTestBase->installModulesFromClassProperty(Object) Drupal\simpletest\WebTestBase->setUp() Drupal\tmgmt\Tests\TMGMTTestBase->setUp() Drupal\tmgmt\Tests\TranslatorUITest->setUp() Drupal\simpletest\TestBase->run(Array) simpletest_script_run_one_test('11', 'Drupal\tmgmt\Tests\TranslatorUITest') Uncaught exceptionConfigSchemaChecker.php98Drupal\Core\Config\Testing\ConfigSchemaChecker->onConfigSave()
ExpandDrupal\tmgmt_config\Tests\ConfigSourceListTest011
MessageGroupFilenameLineFunctionStatus
The test did not complete due to a fatal error.Completion checkConfigSourceListTest.php56Drupal\tmgmt_config\Tests\ConfigSourceListTest->testNodeTypeSubmissions()
Drupal\Core\Config\Schema\SchemaIncompleteException: Schema errors for views.view.tmgmt_job_items with the following errors: views.view.tmgmt_job_items:display.default.display_options.sorts.tjiid.expose missing schema, views.view.tmgmt_job_items:display.default.display_options.sorts.word_count.expose missing schema in Drupal\Core\Config\Testing\ConfigSchemaChecker->onConfigSave() (line 98 of /var/lib/drupaltestbot/sites/default/files/checkout/core/lib/Drupal/Core/Config/Testing/ConfigSchemaChecker.php). Drupal\Core\Config\Testing\ConfigSchemaChecker->onConfigSave(Object, 'config.save', Object) Drupal\Component\EventDispatcher\ContainerAwareEventDispatcher->dispatch('config.save', Object) Drupal\Core\Config\Config->save(1) Drupal\Core\Config\Entity\ConfigEntityStorage->doSave('tmgmt_job_items', Object) Drupal\Core\Entity\EntityStorageBase->save(Object) Drupal\Core\Config\Entity\ConfigEntityStorage->save(Object) Drupal\Core\Entity\Entity->save() Drupal\Core\Config\Entity\ConfigEntityBase->save() Drupal\Core\Config\ConfigInstaller->createConfiguration('', Array) Drupal\Core\Config\ConfigInstaller->installDefaultConfig('module', 'tmgmt') Drupal\Core\ProxyClass\Config\ConfigInstaller->installDefaultConfig('module', 'tmgmt') Drupal\Core\Extension\ModuleInstaller->install(Array, 1) Drupal\Core\ProxyClass\Extension\ModuleInstaller->install(Array, 1) Drupal\simpletest\WebTestBase->installModulesFromClassProperty(Object) Drupal\simpletest\WebTestBase->setUp() Drupal\tmgmt\Tests\TMGMTTestBase->setUp() Drupal\tmgmt_config\Tests\ConfigSourceListTest->setUp() Drupal\simpletest\TestBase->run(Array) simpletest_script_run_one_test('10', 'Drupal\tmgmt_config\Tests\ConfigSourceListTest') Uncaught exceptionConfigSchemaChecker.php98Drupal\Core\Config\Testing\ConfigSchemaChecker->onConfigSave()
ExpandDrupal\tmgmt_config\Tests\ConfigSourceUiTest011
MessageGroupFilenameLineFunctionStatus
The test did not complete due to a fatal error.Completion checkConfigSourceUiTest.php52Drupal\tmgmt_config\Tests\ConfigSourceUiTest->testNodeTypeTranslateTabSingleCheckout()
Drupal\Core\Config\Schema\SchemaIncompleteException: Schema errors for views.view.tmgmt_job_items with the following errors: views.view.tmgmt_job_items:display.default.display_options.sorts.tjiid.expose missing schema, views.view.tmgmt_job_items:display.default.display_options.sorts.word_count.expose missing schema in Drupal\Core\Config\Testing\ConfigSchemaChecker->onConfigSave() (line 98 of /var/lib/drupaltestbot/sites/default/files/checkout/core/lib/Drupal/Core/Config/Testing/ConfigSchemaChecker.php). Drupal\Core\Config\Testing\ConfigSchemaChecker->onConfigSave(Object, 'config.save', Object) Drupal\Component\EventDispatcher\ContainerAwareEventDispatcher->dispatch('config.save', Object) Drupal\Core\Config\Config->save(1) Drupal\Core\Config\Entity\ConfigEntityStorage->doSave('tmgmt_job_items', Object) Drupal\Core\Entity\EntityStorageBase->save(Object) Drupal\Core\Config\Entity\ConfigEntityStorage->save(Object) Drupal\Core\Entity\Entity->save() Drupal\Core\Config\Entity\ConfigEntityBase->save() Drupal\Core\Config\ConfigInstaller->createConfiguration('', Array) Drupal\Core\Config\ConfigInstaller->installDefaultConfig('module', 'tmgmt') Drupal\Core\ProxyClass\Config\ConfigInstaller->installDefaultConfig('module', 'tmgmt') Drupal\Core\Extension\ModuleInstaller->install(Array, 1) Drupal\Core\ProxyClass\Extension\ModuleInstaller->install(Array, 1) Drupal\simpletest\WebTestBase->installModulesFromClassProperty(Object) Drupal\simpletest\WebTestBase->setUp() Drupal\tmgmt\Tests\TMGMTTestBase->setUp() Drupal\tmgmt_config\Tests\ConfigSourceUiTest->setUp() Drupal\simpletest\TestBase->run(Array) simpletest_script_run_one_test('9', 'Drupal\tmgmt_config\Tests\ConfigSourceUiTest') Uncaught exceptionConfigSchemaChecker.php98Drupal\Core\Config\Testing\ConfigSchemaChecker->onConfigSave()
ExpandDrupal\tmgmt_config\Tests\ConfigSourceUnitTest6189
MessageGroupFilenameLineFunctionStatus
Undefined index: nameDrupal\tmgmt_config\Tests\ConfigSourceUnitTest->testNodeType() Drupal\simpletest\TestBase->run(Array) simpletest_script_run_one_test('8', 'Drupal\tmgmt_config\Tests\ConfigSourceUnitTest') NoticeConfigSourceUnitTest.php75Drupal\tmgmt_config\Tests\ConfigSourceUnitTest->testNodeType()
Value NULL is equal to value 'Name'.OtherConfigSourceUnitTest.php75Drupal\tmgmt_config\Tests\ConfigSourceUnitTest->testNodeType()
Undefined index: nameDrupal\tmgmt_config\Tests\ConfigSourceUnitTest->testNodeType() Drupal\simpletest\TestBase->run(Array) simpletest_script_run_one_test('8', 'Drupal\tmgmt_config\Tests\ConfigSourceUnitTest') NoticeConfigSourceUnitTest.php76Drupal\tmgmt_config\Tests\ConfigSourceUnitTest->testNodeType()
Value NULL is equal to value 'Node type name'.OtherConfigSourceUnitTest.php76Drupal\tmgmt_config\Tests\ConfigSourceUnitTest->testNodeType()
Undefined index: nameDrupal\tmgmt_config\Tests\ConfigSourceUnitTest->testNodeType() Drupal\simpletest\TestBase->run(Array) simpletest_script_run_one_test('8', 'Drupal\tmgmt_config\Tests\ConfigSourceUnitTest') NoticeConfigSourceUnitTest.php77Drupal\tmgmt_config\Tests\ConfigSourceUnitTest->testNodeType()
Value NULL is equal to value true.OtherConfigSourceUnitTest.php77Drupal\tmgmt_config\Tests\ConfigSourceUnitTest->testNodeType()
Undefined index: descriptionDrupal\tmgmt_config\Tests\ConfigSourceUnitTest->testNodeType() Drupal\simpletest\TestBase->run(Array) simpletest_script_run_one_test('8', 'Drupal\tmgmt_config\Tests\ConfigSourceUnitTest') NoticeConfigSourceUnitTest.php78Drupal\tmgmt_config\Tests\ConfigSourceUnitTest->testNodeType()
Value NULL is equal to value 'Description'.OtherConfigSourceUnitTest.php78Drupal\tmgmt_config\Tests\ConfigSourceUnitTest->testNodeType()
Undefined index: descriptionDrupal\tmgmt_config\Tests\ConfigSourceUnitTest->testNodeType() Drupal\simpletest\TestBase->run(Array) simpletest_script_run_one_test('8', 'Drupal\tmgmt_config\Tests\ConfigSourceUnitTest') NoticeConfigSourceUnitTest.php79Drupal\tmgmt_config\Tests\ConfigSourceUnitTest->testNodeType()
Value NULL is equal to value 'Node type description'.OtherConfigSourceUnitTest.php79Drupal\tmgmt_config\Tests\ConfigSourceUnitTest->testNodeType()
Undefined index: descriptionDrupal\tmgmt_config\Tests\ConfigSourceUnitTest->testNodeType() Drupal\simpletest\TestBase->run(Array) simpletest_script_run_one_test('8', 'Drupal\tmgmt_config\Tests\ConfigSourceUnitTest') NoticeConfigSourceUnitTest.php80Drupal\tmgmt_config\Tests\ConfigSourceUnitTest->testNodeType()
Value NULL is equal to value true.OtherConfigSourceUnitTest.php80Drupal\tmgmt_config\Tests\ConfigSourceUnitTest->testNodeType()
Undefined index: nameDrupal\tmgmt_config\Tests\ConfigSourceUnitTest->testNodeType() Drupal\simpletest\TestBase->run(Array) simpletest_script_run_one_test('8', 'Drupal\tmgmt_config\Tests\ConfigSourceUnitTest') NoticeConfigSourceUnitTest.php97Drupal\tmgmt_config\Tests\ConfigSourceUnitTest->testNodeType()
Value 'de_Node type name' is equal to value NULL.OtherConfigSourceUnitTest.php97Drupal\tmgmt_config\Tests\ConfigSourceUnitTest->testNodeType()
Undefined index: descriptionDrupal\tmgmt_config\Tests\ConfigSourceUnitTest->testNodeType() Drupal\simpletest\TestBase->run(Array) simpletest_script_run_one_test('8', 'Drupal\tmgmt_config\Tests\ConfigSourceUnitTest') NoticeConfigSourceUnitTest.php98Drupal\tmgmt_config\Tests\ConfigSourceUnitTest->testNodeType()
Value 'de_Node type description' is equal to value NULL.OtherConfigSourceUnitTest.php98Drupal\tmgmt_config\Tests\ConfigSourceUnitTest->testNodeType()
Drupal\Core\Config\Schema\SchemaIncompleteException: Schema errors for views.view.tmgmt_job_items with the following errors: views.view.tmgmt_job_items:display.default.display_options.sorts.tjiid.expose missing schema, views.view.tmgmt_job_items:display.default.display_options.sorts.word_count.expose missing schema in Drupal\Core\Config\Testing\ConfigSchemaChecker->onConfigSave() (line 98 of /var/lib/drupaltestbot/sites/default/files/checkout/core/lib/Drupal/Core/Config/Testing/ConfigSchemaChecker.php). Drupal\Core\Config\Testing\ConfigSchemaChecker->onConfigSave(Object, 'config.save', Object) Drupal\Component\EventDispatcher\ContainerAwareEventDispatcher->dispatch('config.save', Object) Drupal\Core\Config\Config->save(1) Drupal\Core\Config\Entity\ConfigEntityStorage->doSave('tmgmt_job_items', Object) Drupal\Core\Entity\EntityStorageBase->save(Object) Drupal\Core\Config\Entity\ConfigEntityStorage->save(Object) Drupal\Core\Entity\Entity->save() Drupal\Core\Config\Entity\ConfigEntityBase->save() Drupal\Core\Config\ConfigInstaller->createConfiguration('', Array) Drupal\Core\Config\ConfigInstaller->installDefaultConfig('module', 'tmgmt') Drupal\Core\ProxyClass\Config\ConfigInstaller->installDefaultConfig('module', 'tmgmt') Drupal\simpletest\KernelTestBase->installConfig(Array) Drupal\tmgmt_config\Tests\ConfigSourceUnitTest->testView() Drupal\simpletest\TestBase->run(Array) simpletest_script_run_one_test('8', 'Drupal\tmgmt_config\Tests\ConfigSourceUnitTest') Uncaught exceptionConfigSchemaChecker.php98Drupal\Core\Config\Testing\ConfigSchemaChecker->onConfigSave()
ExpandDrupal\tmgmt_content\Tests\ContentEntitySourceListTest011
MessageGroupFilenameLineFunctionStatus
The test did not complete due to a fatal error.Completion checkContentEntitySourceListTest.php64Drupal\tmgmt_content\Tests\ContentEntitySourceListTest->testTermBundleFilter()
Drupal\Core\Config\Schema\SchemaIncompleteException: Schema errors for views.view.tmgmt_job_items with the following errors: views.view.tmgmt_job_items:display.default.display_options.sorts.tjiid.expose missing schema, views.view.tmgmt_job_items:display.default.display_options.sorts.word_count.expose missing schema in Drupal\Core\Config\Testing\ConfigSchemaChecker->onConfigSave() (line 98 of /var/lib/drupaltestbot/sites/default/files/checkout/core/lib/Drupal/Core/Config/Testing/ConfigSchemaChecker.php). Drupal\Core\Config\Testing\ConfigSchemaChecker->onConfigSave(Object, 'config.save', Object) Drupal\Component\EventDispatcher\ContainerAwareEventDispatcher->dispatch('config.save', Object) Drupal\Core\Config\Config->save(1) Drupal\Core\Config\Entity\ConfigEntityStorage->doSave('tmgmt_job_items', Object) Drupal\Core\Entity\EntityStorageBase->save(Object) Drupal\Core\Config\Entity\ConfigEntityStorage->save(Object) Drupal\Core\Entity\Entity->save() Drupal\Core\Config\Entity\ConfigEntityBase->save() Drupal\Core\Config\ConfigInstaller->createConfiguration('', Array) Drupal\Core\Config\ConfigInstaller->installDefaultConfig('module', 'tmgmt') Drupal\Core\ProxyClass\Config\ConfigInstaller->installDefaultConfig('module', 'tmgmt') Drupal\Core\Extension\ModuleInstaller->install(Array, 1) Drupal\Core\ProxyClass\Extension\ModuleInstaller->install(Array, 1) Drupal\simpletest\WebTestBase->installModulesFromClassProperty(Object) Drupal\simpletest\WebTestBase->setUp() Drupal\tmgmt\Tests\TMGMTTestBase->setUp() Drupal\tmgmt_content\Tests\ContentEntitySourceListTest->setUp() Drupal\simpletest\TestBase->run(Array) simpletest_script_run_one_test('5', 'Drupal\tmgmt_content\Tests\ContentEntitySourceListTest') Uncaught exceptionConfigSchemaChecker.php98Drupal\Core\Config\Testing\ConfigSchemaChecker->onConfigSave()
ExpandDrupal\tmgmt_content\Tests\ContentEntitySourceUiTest011
MessageGroupFilenameLineFunctionStatus
The test did not complete due to a fatal error.Completion checkContentEntitySourceUiTest.php58Drupal\tmgmt_content\Tests\ContentEntitySourceUiTest->testNodeTranslateTabSingleCheckout()
Drupal\Core\Config\Schema\SchemaIncompleteException: Schema errors for views.view.tmgmt_job_items with the following errors: views.view.tmgmt_job_items:display.default.display_options.sorts.tjiid.expose missing schema, views.view.tmgmt_job_items:display.default.display_options.sorts.word_count.expose missing schema in Drupal\Core\Config\Testing\ConfigSchemaChecker->onConfigSave() (line 98 of /var/lib/drupaltestbot/sites/default/files/checkout/core/lib/Drupal/Core/Config/Testing/ConfigSchemaChecker.php). Drupal\Core\Config\Testing\ConfigSchemaChecker->onConfigSave(Object, 'config.save', Object) Drupal\Component\EventDispatcher\ContainerAwareEventDispatcher->dispatch('config.save', Object) Drupal\Core\Config\Config->save(1) Drupal\Core\Config\Entity\ConfigEntityStorage->doSave('tmgmt_job_items', Object) Drupal\Core\Entity\EntityStorageBase->save(Object) Drupal\Core\Config\Entity\ConfigEntityStorage->save(Object) Drupal\Core\Entity\Entity->save() Drupal\Core\Config\Entity\ConfigEntityBase->save() Drupal\Core\Config\ConfigInstaller->createConfiguration('', Array) Drupal\Core\Config\ConfigInstaller->installDefaultConfig('module', 'tmgmt') Drupal\Core\ProxyClass\Config\ConfigInstaller->installDefaultConfig('module', 'tmgmt') Drupal\Core\Extension\ModuleInstaller->install(Array, 1) Drupal\Core\ProxyClass\Extension\ModuleInstaller->install(Array, 1) Drupal\simpletest\WebTestBase->installModulesFromClassProperty(Object) Drupal\simpletest\WebTestBase->setUp() Drupal\tmgmt\Tests\TMGMTTestBase->setUp() Drupal\tmgmt_content\Tests\ContentEntitySourceUiTest->setUp() Drupal\simpletest\TestBase->run(Array) simpletest_script_run_one_test('4', 'Drupal\tmgmt_content\Tests\ContentEntitySourceUiTest') Uncaught exceptionConfigSchemaChecker.php98Drupal\Core\Config\Testing\ConfigSchemaChecker->onConfigSave()
LeafDrupal\tmgmt_content\Tests\ContentEntitySourceUnitTest14600
LeafDrupal\tmgmt_content\Tests\ContentEntitySuggestionsTest2400
ExpandDrupal\tmgmt_demo\Tests\TMGMTDemoTest011
MessageGroupFilenameLineFunctionStatus
The test did not complete due to a fatal error.Completion checkTMGMTDemoTest.php40Drupal\tmgmt_demo\Tests\TMGMTDemoTest->testInstalled()
Drupal\Core\Config\Schema\SchemaIncompleteException: Schema errors for views.view.tmgmt_job_items with the following errors: views.view.tmgmt_job_items:display.default.display_options.sorts.tjiid.expose missing schema, views.view.tmgmt_job_items:display.default.display_options.sorts.word_count.expose missing schema in Drupal\Core\Config\Testing\ConfigSchemaChecker->onConfigSave() (line 98 of /var/lib/drupaltestbot/sites/default/files/checkout/core/lib/Drupal/Core/Config/Testing/ConfigSchemaChecker.php). Drupal\Core\Config\Testing\ConfigSchemaChecker->onConfigSave(Object, 'config.save', Object) Drupal\Component\EventDispatcher\ContainerAwareEventDispatcher->dispatch('config.save', Object) Drupal\Core\Config\Config->save(1) Drupal\Core\Config\Entity\ConfigEntityStorage->doSave('tmgmt_job_items', Object) Drupal\Core\Entity\EntityStorageBase->save(Object) Drupal\Core\Config\Entity\ConfigEntityStorage->save(Object) Drupal\Core\Entity\Entity->save() Drupal\Core\Config\Entity\ConfigEntityBase->save() Drupal\Core\Config\ConfigInstaller->createConfiguration('', Array) Drupal\Core\Config\ConfigInstaller->installDefaultConfig('module', 'tmgmt') Drupal\Core\ProxyClass\Config\ConfigInstaller->installDefaultConfig('module', 'tmgmt') Drupal\Core\Extension\ModuleInstaller->install(Array, 1) Drupal\Core\ProxyClass\Extension\ModuleInstaller->install(Array, 1) Drupal\simpletest\WebTestBase->installModulesFromClassProperty(Object) Drupal\simpletest\WebTestBase->setUp() Drupal\tmgmt\Tests\TMGMTTestBase->setUp() Drupal\tmgmt_demo\Tests\TMGMTDemoTest->setUp() Drupal\simpletest\TestBase->run(Array) simpletest_script_run_one_test('1', 'Drupal\tmgmt_demo\Tests\TMGMTDemoTest') Uncaught exceptionConfigSchemaChecker.php98Drupal\Core\Config\Testing\ConfigSchemaChecker->onConfigSave()
ExpandDrupal\tmgmt_file\Tests\FileTranslatorTest011
MessageGroupFilenameLineFunctionStatus
The test did not complete due to a fatal error.Completion checkFileTranslatorTest.php42Drupal\tmgmt_file\Tests\FileTranslatorTest->testXLIFFTextProcessing()
Drupal\Core\Config\Schema\SchemaIncompleteException: Schema errors for views.view.tmgmt_job_items with the following errors: views.view.tmgmt_job_items:display.default.display_options.sorts.tjiid.expose missing schema, views.view.tmgmt_job_items:display.default.display_options.sorts.word_count.expose missing schema in Drupal\Core\Config\Testing\ConfigSchemaChecker->onConfigSave() (line 98 of /var/lib/drupaltestbot/sites/default/files/checkout/core/lib/Drupal/Core/Config/Testing/ConfigSchemaChecker.php). Drupal\Core\Config\Testing\ConfigSchemaChecker->onConfigSave(Object, 'config.save', Object) Drupal\Component\EventDispatcher\ContainerAwareEventDispatcher->dispatch('config.save', Object) Drupal\Core\Config\Config->save(1) Drupal\Core\Config\Entity\ConfigEntityStorage->doSave('tmgmt_job_items', Object) Drupal\Core\Entity\EntityStorageBase->save(Object) Drupal\Core\Config\Entity\ConfigEntityStorage->save(Object) Drupal\Core\Entity\Entity->save() Drupal\Core\Config\Entity\ConfigEntityBase->save() Drupal\Core\Config\ConfigInstaller->createConfiguration('', Array) Drupal\Core\Config\ConfigInstaller->installDefaultConfig('module', 'tmgmt') Drupal\Core\ProxyClass\Config\ConfigInstaller->installDefaultConfig('module', 'tmgmt') Drupal\Core\Extension\ModuleInstaller->install(Array, 1) Drupal\Core\ProxyClass\Extension\ModuleInstaller->install(Array, 1) Drupal\simpletest\WebTestBase->installModulesFromClassProperty(Object) Drupal\simpletest\WebTestBase->setUp() Drupal\tmgmt\Tests\TMGMTTestBase->setUp() Drupal\tmgmt_file\Tests\FileTranslatorTest->setUp() Drupal\simpletest\TestBase->run(Array) simpletest_script_run_one_test('19', 'Drupal\tmgmt_file\Tests\FileTranslatorTest') Uncaught exceptionConfigSchemaChecker.php98Drupal\Core\Config\Testing\ConfigSchemaChecker->onConfigSave()
LeafDrupal\tmgmt_locale\Tests\LocaleSourceTest6300
ExpandDrupal\tmgmt_locale\Tests\LocaleSourceUiTest011
MessageGroupFilenameLineFunctionStatus
The test did not complete due to a fatal error.Completion checkLocaleSourceUiTest.php43Drupal\tmgmt_locale\Tests\LocaleSourceUiTest->testOverview()
Drupal\Core\Config\Schema\SchemaIncompleteException: Schema errors for views.view.tmgmt_job_items with the following errors: views.view.tmgmt_job_items:display.default.display_options.sorts.tjiid.expose missing schema, views.view.tmgmt_job_items:display.default.display_options.sorts.word_count.expose missing schema in Drupal\Core\Config\Testing\ConfigSchemaChecker->onConfigSave() (line 98 of /var/lib/drupaltestbot/sites/default/files/checkout/core/lib/Drupal/Core/Config/Testing/ConfigSchemaChecker.php). Drupal\Core\Config\Testing\ConfigSchemaChecker->onConfigSave(Object, 'config.save', Object) Drupal\Component\EventDispatcher\ContainerAwareEventDispatcher->dispatch('config.save', Object) Drupal\Core\Config\Config->save(1) Drupal\Core\Config\Entity\ConfigEntityStorage->doSave('tmgmt_job_items', Object) Drupal\Core\Entity\EntityStorageBase->save(Object) Drupal\Core\Config\Entity\ConfigEntityStorage->save(Object) Drupal\Core\Entity\Entity->save() Drupal\Core\Config\Entity\ConfigEntityBase->save() Drupal\Core\Config\ConfigInstaller->createConfiguration('', Array) Drupal\Core\Config\ConfigInstaller->installDefaultConfig('module', 'tmgmt') Drupal\Core\ProxyClass\Config\ConfigInstaller->installDefaultConfig('module', 'tmgmt') Drupal\Core\Extension\ModuleInstaller->install(Array, 1) Drupal\Core\ProxyClass\Extension\ModuleInstaller->install(Array, 1) Drupal\simpletest\WebTestBase->installModulesFromClassProperty(Object) Drupal\simpletest\WebTestBase->setUp() Drupal\tmgmt\Tests\TMGMTTestBase->setUp() Drupal\tmgmt_locale\Tests\LocaleSourceUiTest->setUp() Drupal\simpletest\TestBase->run(Array) simpletest_script_run_one_test('6', 'Drupal\tmgmt_locale\Tests\LocaleSourceUiTest') Uncaught exceptionConfigSchemaChecker.php98Drupal\Core\Config\Testing\ConfigSchemaChecker->onConfigSave()