check_user_privileges-2577187-9.patch

Test status
StatusResult
Last receivedMon, 10/05/2015 - 14:20:00
Last requestedMon, 10/05/2015 - 16:20:57
Last testedMon, 10/05/2015 - 16:26:55
Test count1
Environment status
PHP 5.5 MySQLfail
File information
Filecheck_user_privileges-2577187-9.patch
BranchMonitoring - 8.x-1.x
LinkIssue Link
SummaryFAILED: [[SimpleTest]]: [PHP 5.5 MySQL] 1,940 pass(es), 1 fail(s), and 1 exception(s).
Details

PHP 5.5 MySQL

  1. Setup environment
  2. Detect an invalid patch URL
  3. Detect invalid repository information
  4. Detect invalid patch format
  5. Detect a non-applicable patch
  6. Detect invalid PHP syntax
  7. Detect a Drupal installation failure
  8. Detect a test run failure
  9. Detect a failing test
    Review the test failures below then if necessary run them locally until the problem has been fixed.
  10. Complete test suite with all tests passing
1,940 pass(es), 1 fail(s), and 1 exception(s)

Non-pass

Test namePassFailException
ExpandDrupal\monitoring\Tests\MonitoringCoreWebTest10701
MessageGroupFilenameLineFunctionStatus
Drupal\Core\Entity\EntityStorageException: SQLSTATE[23000]: Integrity constraint violation: 1062 Duplicate entry 'changed-en' for key 'user__name': INSERT INTO {users_field_data} (uid, langcode, preferred_langcode, preferred_admin_langcode, name, pass, mail, timezone, status, created, changed, access, login, init, default_langcode) VALUES (:db_insert_placeholder_0, :db_insert_placeholder_1, :db_insert_placeholder_2, :db_insert_placeholder_3, :db_insert_placeholder_4, :db_insert_placeholder_5, :db_insert_placeholder_6, :db_insert_placeholder_7, :db_insert_placeholder_8, :db_insert_placeholder_9, :db_insert_placeholder_10, :db_insert_placeholder_11, :db_insert_placeholder_12, :db_insert_placeholder_13, :db_insert_placeholder_14); Array ( [:db_insert_placeholder_0] => 4 [:db_insert_placeholder_1] => en [:db_insert_placeholder_2] => en [:db_insert_placeholder_3] => [:db_insert_placeholder_4] => changed [:db_insert_placeholder_5] => $S$E1aZ0RV9qajadabX1od1Rac/9/pHSE/iXkqwe3/GQ/XdcsQHwySk [:db_insert_placeholder_6] => test_user_3@example.com [:db_insert_placeholder_7] => Australia/Sydney [:db_insert_placeholder_8] => 1 [:db_insert_placeholder_9] => 1444062181 [:db_insert_placeholder_10] => 1444062181 [:db_insert_placeholder_11] => 0 [:db_insert_placeholder_12] => 0 [:db_insert_placeholder_13] => [:db_insert_placeholder_14] => 1 ) in Drupal\Core\Entity\Sql\SqlContentEntityStorage->save() (line 757 of /var/lib/drupaltestbot/sites/default/files/checkout/core/lib/Drupal/Core/Entity/Sql/SqlContentEntityStorage.php). Drupal\Core\Entity\Sql\SqlContentEntityStorage->save(Object) Drupal\Core\Entity\Entity->save() Drupal\monitoring\Tests\MonitoringCoreWebTest->doTestUserIntegritySensorPlugin() Drupal\monitoring\Tests\MonitoringCoreWebTest->testSensors() Drupal\simpletest\TestBase->run(Array) simpletest_script_run_one_test('4', 'Drupal\monitoring\Tests\MonitoringCoreWebTest') Uncaught exceptionSqlContentEntityStorage.php757Drupal\Core\Entity\Sql\SqlContentEntityStorage->save()
ExpandDrupal\monitoring\Tests\MonitoringUITest83110
MessageGroupFilenameLineFunctionStatus
"1444062181" foundOtherMonitoringUITest.php154Drupal\monitoring\Tests\MonitoringUITest->testSensorCreation()

All

Test namePassFailException
LeafDrupal\monitoring\Tests\MonitoringApiTest8100
LeafDrupal\monitoring\Tests\MonitoringCaptchaTest1900
LeafDrupal\monitoring\Tests\MonitoringCoreKernelTest16200
ExpandDrupal\monitoring\Tests\MonitoringCoreWebTest10701
MessageGroupFilenameLineFunctionStatus
Drupal\Core\Entity\EntityStorageException: SQLSTATE[23000]: Integrity constraint violation: 1062 Duplicate entry 'changed-en' for key 'user__name': INSERT INTO {users_field_data} (uid, langcode, preferred_langcode, preferred_admin_langcode, name, pass, mail, timezone, status, created, changed, access, login, init, default_langcode) VALUES (:db_insert_placeholder_0, :db_insert_placeholder_1, :db_insert_placeholder_2, :db_insert_placeholder_3, :db_insert_placeholder_4, :db_insert_placeholder_5, :db_insert_placeholder_6, :db_insert_placeholder_7, :db_insert_placeholder_8, :db_insert_placeholder_9, :db_insert_placeholder_10, :db_insert_placeholder_11, :db_insert_placeholder_12, :db_insert_placeholder_13, :db_insert_placeholder_14); Array ( [:db_insert_placeholder_0] => 4 [:db_insert_placeholder_1] => en [:db_insert_placeholder_2] => en [:db_insert_placeholder_3] => [:db_insert_placeholder_4] => changed [:db_insert_placeholder_5] => $S$E1aZ0RV9qajadabX1od1Rac/9/pHSE/iXkqwe3/GQ/XdcsQHwySk [:db_insert_placeholder_6] => test_user_3@example.com [:db_insert_placeholder_7] => Australia/Sydney [:db_insert_placeholder_8] => 1 [:db_insert_placeholder_9] => 1444062181 [:db_insert_placeholder_10] => 1444062181 [:db_insert_placeholder_11] => 0 [:db_insert_placeholder_12] => 0 [:db_insert_placeholder_13] => [:db_insert_placeholder_14] => 1 ) in Drupal\Core\Entity\Sql\SqlContentEntityStorage->save() (line 757 of /var/lib/drupaltestbot/sites/default/files/checkout/core/lib/Drupal/Core/Entity/Sql/SqlContentEntityStorage.php). Drupal\Core\Entity\Sql\SqlContentEntityStorage->save(Object) Drupal\Core\Entity\Entity->save() Drupal\monitoring\Tests\MonitoringCoreWebTest->doTestUserIntegritySensorPlugin() Drupal\monitoring\Tests\MonitoringCoreWebTest->testSensors() Drupal\simpletest\TestBase->run(Array) simpletest_script_run_one_test('4', 'Drupal\monitoring\Tests\MonitoringCoreWebTest') Uncaught exceptionSqlContentEntityStorage.php757Drupal\Core\Entity\Sql\SqlContentEntityStorage->save()
LeafDrupal\monitoring\Tests\MonitoringPastTest1300
LeafDrupal\monitoring\Tests\MonitoringSearchAPITest1100
LeafDrupal\monitoring\Tests\MonitoringServicesTest58500
ExpandDrupal\monitoring\Tests\MonitoringUITest83110
MessageGroupFilenameLineFunctionStatus
"1444062181" foundOtherMonitoringUITest.php154Drupal\monitoring\Tests\MonitoringUITest->testSensorCreation()
LeafDrupal\monitoring\Tests\MonitoringViewDisplayTest2900
LeafDrupal\monitoring_demo\Tests\MonitoringDemoTest1200
LeafDrupal\monitoring_multigraph\Tests\MultigraphServicesTest2600
LeafDrupal\monitoring_multigraph\Tests\MultigraphWebTest6400