update-deprecated-code-2578545-0-8.x-1.x.patch

Test status
StatusResult
Last receivedThu, 10/01/2015 - 18:32:00
Last requestedThu, 10/01/2015 - 23:43:11
Last testedThu, 10/01/2015 - 23:47:36
Test count1
Environment status
PHP 5.5 MySQLfail
File information
Fileupdate-deprecated-code-2578545-0-8.x-1.x.patch
BranchRELAXed Web Services - 8.x-1.x
LinkIssue Link
SummaryFAILED: [[SimpleTest]]: [PHP 5.5 MySQL] 723 pass(es), 33 fail(s), and 8 exception(s).
Details

PHP 5.5 MySQL

  1. Setup environment
  2. Detect an invalid patch URL
  3. Detect invalid repository information
  4. Detect invalid patch format
  5. Detect a non-applicable patch
  6. Detect invalid PHP syntax
  7. Detect a Drupal installation failure
  8. Detect a test run failure
  9. Detect a failing test
    Review the test failures below then if necessary run them locally until the problem has been fixed.
  10. Complete test suite with all tests passing
723 pass(es), 33 fail(s), and 8 exception(s)

Non-pass

Test namePassFailException
ExpandDrupal\relaxed\Tests\AllDocsResourceTest1462
MessageGroupFilenameLineFunctionStatus
HTTP response code is correct.BrowserAllDocsResourceTest.php64Drupal\relaxed\Tests\AllDocsResourceTest->testGet()
Undefined index: messageDrupal\relaxed\Tests\AllDocsResourceTest->testGet() Drupal\simpletest\TestBase->run(Array) simpletest_script_run_one_test('19', 'Drupal\relaxed\Tests\AllDocsResourceTest') NoticeAllDocsResourceTest.php68Drupal\relaxed\Tests\AllDocsResourceTest->testGet()
Correct value for message key when not including docs. Value NULL is equal to value 'A fatal error occurred: Settings can not be serialized. This probably means you are serializing an object that has an indirect reference to the Settings object. Adjust your code so that is not necessary.'.OtherAllDocsResourceTest.php68Drupal\relaxed\Tests\AllDocsResourceTest->testGet()
HTTP response code is correct.BrowserAllDocsResourceTest.php100Drupal\relaxed\Tests\AllDocsResourceTest->testGet()
Undefined index: messageDrupal\relaxed\Tests\AllDocsResourceTest->testGet() Drupal\simpletest\TestBase->run(Array) simpletest_script_run_one_test('19', 'Drupal\relaxed\Tests\AllDocsResourceTest') NoticeAllDocsResourceTest.php104Drupal\relaxed\Tests\AllDocsResourceTest->testGet()
Correct value for message key when including docs. Value NULL is equal to value 'A fatal error occurred: Settings can not be serialized. This probably means you are serializing an object that has an indirect reference to the Settings object. Adjust your code so that is not necessary.'.OtherAllDocsResourceTest.php104Drupal\relaxed\Tests\AllDocsResourceTest->testGet()
[02-Oct-2015 09:45:07 Australia/Sydney] Uncaught PHP Exception LogicException: "Settings can not be serialized. This probably means you are serializing an object that has an indirect reference to the Settings object. Adjust your code so that is not necessary." at /var/lib/drupaltestbot/sites/default/files/checkout/core/lib/Drupal/Core/Site/Settings.php line 67 Fatal errorUnknown0Unknown
[02-Oct-2015 09:45:07 Australia/Sydney] Uncaught PHP Exception LogicException: "Settings can not be serialized. This probably means you are serializing an object that has an indirect reference to the Settings object. Adjust your code so that is not necessary." at /var/lib/drupaltestbot/sites/default/files/checkout/core/lib/Drupal/Core/Site/Settings.php line 67 Fatal errorUnknown0Unknown
ExpandDrupal\relaxed\Tests\ChangesResourceTest20150
MessageGroupFilenameLineFunctionStatus
HTTP response code is correct when not including docs.BrowserChangesResourceTest.php101Drupal\relaxed\Tests\ChangesResourceTest->testGet()
The result is correct when not including docs. Value array ( 'message' => 'A fatal error occurred: Settings can not be serialized. This probably means you are serializing an object that has an indirect reference to the Settings object. Adjust your code so that is not necessary.', ) is equal to value array ( 'last_seq' => 1443743114694740, 'results' => array ( 0 => array ( 'changes' => array ( 0 => array ( 'rev' => '1-676121a32fade36ce2988b874bc6a65e', ), ), 'id' => '053e922e-d272-4f8f-ac49-73c946de19dc', 'seq' => 1443743113599350, ), 1 => array ( 'changes' => array ( 0 => array ( 'rev' => '4-84f389674858a3d14f1a46a6ae4cb3f3', ), ), 'id' => 'e7c195bf-46e2-4828-9500-a3b9c3f806b2', 'seq' => 1443743114527305, ), 2 => array ( 'changes' => array ( 0 => array ( 'rev' => '3-5c8f5f220326b659461b72e99c5fd5ad', ), ), 'id' => '1fe4c201-a416-45b8-8300-b1e88ee277d5', 'seq' => 1443743114694740, 'deleted' => true, ), ), ).OtherChangesResourceTest.php105Drupal\relaxed\Tests\ChangesResourceTest->testGet()
HTTP response code is correct when including docs.BrowserChangesResourceTest.php108Drupal\relaxed\Tests\ChangesResourceTest->testGet()
The result is correct when including docs. Value array ( 'message' => 'A fatal error occurred: Settings can not be serialized. This probably means you are serializing an object that has an indirect reference to the Settings object. Adjust your code so that is not necessary.', ) is equal to value array ( 'last_seq' => 1443743114694740, 'results' => array ( 0 => array ( 'changes' => array ( 0 => array ( 'rev' => '1-676121a32fade36ce2988b874bc6a65e', ), ), 'id' => '053e922e-d272-4f8f-ac49-73c946de19dc', 'seq' => 1443743113599350, 'doc' => array ( '@context' => array ( '_id' => '@id', 'user' => 'http://ec2-52-88-139-13.us-west-2.compute.amazonaws.com/checkout/rest/type/user/user', ), '@type' => 'user', '_id' => '053e922e-d272-4f8f-ac49-73c946de19dc', 'langcode' => array ( 0 => array ( 'value' => 'en', ), ), 'preferred_langcode' => array ( 0 => array ( 'value' => 'en', ), ), 'preferred_admin_langcode' => array ( ), 'name' => array ( 0 => array ( 'value' => 'zIyR6aYN', ), ), 'pass' => array ( 0 => NULL, ), 'mail' => array ( 0 => array ( 'value' => 'zIyR6aYN@example.com', ), ), 'timezone' => array ( 0 => array ( 'value' => 'Australia/Sydney', ), ), 'status' => array ( 0 => array ( 'value' => '1', ), ), 'created' => array ( 0 => array ( 'value' => '1443743020', ), ), 'changed' => array ( 0 => array ( 'value' => '1443743020', ), ), 'access' => array ( 0 => array ( 'value' => '1443743113', ), ), 'login' => array ( 0 => array ( 'value' => '1443743113', ), ), 'init' => array ( ), 'roles' => array ( 0 => array ( 'target_id' => 'dqmvcdfj', ), ), 'default_langcode' => array ( 0 => array ( 'value' => '1', ), ), '_rev' => '1-676121a32fade36ce2988b874bc6a65e', ), ), 1 => array ( 'changes' => array ( 0 => array ( 'rev' => '4-84f389674858a3d14f1a46a6ae4cb3f3', ), ), 'id' => 'e7c195bf-46e2-4828-9500-a3b9c3f806b2', 'seq' => 1443743114527305, 'doc' => array ( '@context' => array ( '_id' => '@id', 'entity_test_rev' => 'http://ec2-52-88-139-13.us-west-2.compute.amazonaws.com/checkout/rest/type/entity_test_rev/entity_test_rev', ), '@type' => 'entity_test_rev', '_id' => 'e7c195bf-46e2-4828-9500-a3b9c3f806b2', 'langcode' => array ( 0 => array ( 'value' => 'en', ), ), 'name' => array ( 0 => array ( 'value' => '!q4T=*:nR%By>&5l14gG<^~V2', ), ), 'type' => array ( 0 => array ( 'value' => 'entity_test_rev', ), ), 'created' => array ( 0 => array ( 'value' => 1443743020, ), ), 'user_id' => array ( 0 => array ( 'target_id' => 1, ), ), '_rev' => '4-84f389674858a3d14f1a46a6ae4cb3f3', 'field_test_text' => array ( 0 => array ( 'value' => '`*0\'>&AB', 'format' => 'plain_text', ), ), ), ), 2 => array ( 'changes' => array ( 0 => array ( 'rev' => '3-5c8f5f220326b659461b72e99c5fd5ad', ), ), 'id' => '1fe4c201-a416-45b8-8300-b1e88ee277d5', 'seq' => 1443743114694740, 'doc' => array ( '@context' => array ( '_id' => '@id', 'entity_test_rev' => 'http://ec2-52-88-139-13.us-west-2.compute.amazonaws.com/checkout/rest/type/entity_test_rev/entity_test_rev', ), '@type' => 'entity_test_rev', '_id' => '1fe4c201-a416-45b8-8300-b1e88ee277d5', 'langcode' => array ( 0 => array ( 'value' => 'en', ), ), 'name' => array ( ), 'type' => array ( 0 => array ( 'value' => 'entity_test_rev', ), ), 'created' => array ( 0 => array ( 'value' => 1443743020, ), ), 'user_id' => array ( 0 => array ( 'target_id' => 1, ), ), '_deleted' => true, '_rev' => '3-5c8f5f220326b659461b72e99c5fd5ad', 'field_test_text' => array ( 0 => array ( 'value' => 'I,RA>&Je', 'format' => 'plain_text', ), ), ), 'deleted' => true, ), ), ).OtherChangesResourceTest.php112Drupal\relaxed\Tests\ChangesResourceTest->testGet()
HTTP response code is correct when not including docs.BrowserChangesResourceTest.php116Drupal\relaxed\Tests\ChangesResourceTest->testGet()
The result is correct when not including docs. Value array ( 'message' => 'A fatal error occurred: Settings can not be serialized. This probably means you are serializing an object that has an indirect reference to the Settings object. Adjust your code so that is not necessary.', ) is equal to value array ( 'last_seq' => 1443743114694740, 'results' => array ( 0 => array ( 'changes' => array ( 0 => array ( 'rev' => '1-676121a32fade36ce2988b874bc6a65e', ), ), 'id' => '053e922e-d272-4f8f-ac49-73c946de19dc', 'seq' => 1443743113599350, ), 1 => array ( 'changes' => array ( 0 => array ( 'rev' => '4-84f389674858a3d14f1a46a6ae4cb3f3', ), ), 'id' => 'e7c195bf-46e2-4828-9500-a3b9c3f806b2', 'seq' => 1443743114527305, ), 2 => array ( 'changes' => array ( 0 => array ( 'rev' => '3-5c8f5f220326b659461b72e99c5fd5ad', ), ), 'id' => '1fe4c201-a416-45b8-8300-b1e88ee277d5', 'seq' => 1443743114694740, 'deleted' => true, ), ), ).OtherChangesResourceTest.php120Drupal\relaxed\Tests\ChangesResourceTest->testGet()
HTTP response code is correct when not including docs.BrowserChangesResourceTest.php123Drupal\relaxed\Tests\ChangesResourceTest->testGet()
The result is correct when not including docs. Value array ( 'message' => 'A fatal error occurred: Settings can not be serialized. This probably means you are serializing an object that has an indirect reference to the Settings object. Adjust your code so that is not necessary.', ) is equal to value array ( 'last_seq' => 1443743114694740, 'results' => array ( 0 => array ( 'changes' => array ( 0 => array ( 'rev' => '3-5c8f5f220326b659461b72e99c5fd5ad', ), ), 'id' => '1fe4c201-a416-45b8-8300-b1e88ee277d5', 'seq' => 1443743114694740, 'deleted' => true, ), ), ).OtherChangesResourceTest.php132Drupal\relaxed\Tests\ChangesResourceTest->testGet()
HTTP response code is correct when not including docs.BrowserChangesResourceTest.php135Drupal\relaxed\Tests\ChangesResourceTest->testGet()
The result is correct when not including docs. Value array ( 'message' => 'A fatal error occurred: Settings can not be serialized. This probably means you are serializing an object that has an indirect reference to the Settings object. Adjust your code so that is not necessary.', ) is equal to value array ( 'last_seq' => 1443743114694740, 'results' => array ( ), ).OtherChangesResourceTest.php141Drupal\relaxed\Tests\ChangesResourceTest->testGet()
[02-Oct-2015 09:45:14 Australia/Sydney] Uncaught PHP Exception LogicException: "Settings can not be serialized. This probably means you are serializing an object that has an indirect reference to the Settings object. Adjust your code so that is not necessary." at /var/lib/drupaltestbot/sites/default/files/checkout/core/lib/Drupal/Core/Site/Settings.php line 67 Fatal errorUnknown0Unknown
[02-Oct-2015 09:45:14 Australia/Sydney] Uncaught PHP Exception LogicException: "Settings can not be serialized. This probably means you are serializing an object that has an indirect reference to the Settings object. Adjust your code so that is not necessary." at /var/lib/drupaltestbot/sites/default/files/checkout/core/lib/Drupal/Core/Site/Settings.php line 67 Fatal errorUnknown0Unknown
[02-Oct-2015 09:45:15 Australia/Sydney] Uncaught PHP Exception LogicException: "Settings can not be serialized. This probably means you are serializing an object that has an indirect reference to the Settings object. Adjust your code so that is not necessary." at /var/lib/drupaltestbot/sites/default/files/checkout/core/lib/Drupal/Core/Site/Settings.php line 67 Fatal errorUnknown0Unknown
[02-Oct-2015 09:45:15 Australia/Sydney] Uncaught PHP Exception LogicException: "Settings can not be serialized. This probably means you are serializing an object that has an indirect reference to the Settings object. Adjust your code so that is not necessary." at /var/lib/drupaltestbot/sites/default/files/checkout/core/lib/Drupal/Core/Site/Settings.php line 67 Fatal errorUnknown0Unknown
[02-Oct-2015 09:45:15 Australia/Sydney] Uncaught PHP Exception LogicException: "Settings can not be serialized. This probably means you are serializing an object that has an indirect reference to the Settings object. Adjust your code so that is not necessary." at /var/lib/drupaltestbot/sites/default/files/checkout/core/lib/Drupal/Core/Site/Settings.php line 67 Fatal errorUnknown0Unknown
ExpandDrupal\relaxed\Tests\DocResourceTest13093
MessageGroupFilenameLineFunctionStatus
HTTP response header x-relaxed-etag with value 2-f6c080537fa336f29aa858e2cf4094a8 found, actual value: 1-a6072ff733211c641fe3d73d914b08eeBrowserDocResourceTest.php56Drupal\relaxed\Tests\DocResourceTest->testHead()
HTTP response code is correct.BrowserDocResourceTest.php64Drupal\relaxed\Tests\DocResourceTest->testHead()
HTTP response header x-relaxed-etag with value 2-f6c080537fa336f29aa858e2cf4094a8 found, actual value: 1-a6072ff733211c641fe3d73d914b08eeBrowserDocResourceTest.php72Drupal\relaxed\Tests\DocResourceTest->testHead()
HTTP response code is correct.BrowserDocResourceTest.php76Drupal\relaxed\Tests\DocResourceTest->testHead()
Undefined index: _revisionsDrupal\relaxed\Tests\DocResourceTest->testGet() Drupal\simpletest\TestBase->run(Array) simpletest_script_run_one_test('14', 'Drupal\relaxed\Tests\DocResourceTest') NoticeDocResourceTest.php113Drupal\relaxed\Tests\DocResourceTest->testGet()
Undefined index: _revisionsDrupal\relaxed\Tests\DocResourceTest->testGet() Drupal\simpletest\TestBase->run(Array) simpletest_script_run_one_test('14', 'Drupal\relaxed\Tests\DocResourceTest') NoticeDocResourceTest.php113Drupal\relaxed\Tests\DocResourceTest->testGet()
GET request returned correct revision list after first revision. Value '-' is equal to value '1-a6072ff733211c641fe3d73d914b08ee'.OtherDocResourceTest.php114Drupal\relaxed\Tests\DocResourceTest->testGet()
Undefined index: _revisionsDrupal\relaxed\Tests\DocResourceTest->testGet() Drupal\simpletest\TestBase->run(Array) simpletest_script_run_one_test('14', 'Drupal\relaxed\Tests\DocResourceTest') NoticeDocResourceTest.php121Drupal\relaxed\Tests\DocResourceTest->testGet()
GET request returned correct revision list after second revision. Value 0 is equal to value 2.OtherDocResourceTest.php122Drupal\relaxed\Tests\DocResourceTest->testGet()
HTTP response code is correct.BrowserDocResourceTest.php126Drupal\relaxed\Tests\DocResourceTest->testGet()
HTTP response header x-relaxed-etag with value 2-37bbab0f1fb34b1d6ad3851364c27536 found, actual value: 1-a6072ff733211c641fe3d73d914b08eeBrowserDocResourceTest.php141Drupal\relaxed\Tests\DocResourceTest->testGet()
HTTP response code is correct.BrowserDocResourceTest.php145Drupal\relaxed\Tests\DocResourceTest->testGet()
ExpandDrupal\relaxed\Tests\Normalizer\FileItemNormalizerTest2813
MessageGroupFilenameLineFunctionStatus
Field _attachments is normalized correctly. Value array ( 'field_test_file/0/3064a946-b481-4ae2-8700-f15d79ec6cd0/public/example1.txt' => array ( 'content_type' => 'text/plain', 'digest' => 'md5-NGJiOTZjMGMzZWZkMTQ2NDU3MWMwYzBhNzM3YTM1NTQ=', 'length' => 8, 'data' => 'aUlTbUZYdEM=', ), 'field_test_file/1/f1b0c29a-ff4b-409c-8256-8696570c5d5e/public/example2.txt' => array ( 'content_type' => 'text/plain', 'digest' => 'md5-NDZhNDgxOTI0NmU5OTY4MjQyY2U4MzZmMTYxYzc1M2I=', 'length' => 8, 'data' => 'clNPVFM4TFI=', ), 'field_test_image/0/dae503b6-f68a-45ae-ae00-c2166dc90e30/public/example.jpg' => array ( 'content_type' => 'image/jpeg', 'digest' => 'md5-ZTBlM2JmOWQwM2YwMjExNTgxMTVlMmUzNGExODA2OTk=', 'length' => 3905, 'data' => 'iVBORw0KGgoAAAANSUhEUgAAAFgAAABkCAYAAAACLffiAAAPCElEQVR42u1dCVBUVxZ9gIlGzabJxKSSVGUyqdTETCqT1CSVyTqlqUwSEZBNFjFq1LjEBXdBNsMqOyKbSEBcQUVBBVFExQVFBcEFFJBdZN+hWe7c95wve/O7+zc08E/VLZbm//7/9H3n3XvffR+i8jB0yySmPu8SEcqBuo5NB9G1byGm2ycSEQLD1Hfyfx0i4JWV+4DoO1cREQLDxHuVXdR1+GV/BhAzPyCz3bKICAEx2/3S8fRiCE0pBrLmFBAjDzTPU0SEQJj1R2tRTTMk5VY/Idg8DoiBCxBjL28iQkGY+Mz6ynofUGQ8qmcEM1t9AoiuAxBTbwMiQgEYuhZG3igAisyyRtBYF99J8spoINo2gBq9noiQb3J7d9kOaO/oAIrb6MFjN5ym5HYnWdeekryOiJBJGsaNN3JuSy2sAQ7HbpdRUnvbquOAOk01OYSI4AHT7X9T17VvPYzSwKG6qRWWR2X2STCnySgnT0K4Ob4aRES/nqv9golze+ydR8Chpa0D9qWWwgculyiZUo3FybO2tqJkWBER3bx2Anpg1ifrQyC7vAE4VDW2Qsi1EjAMT5dGbC9dZrGyvlMN1i++J6MeJt4rJxo5tXnHZ+CEBgwNknZIzK4C30tF8GvEHVBbS8mT0ZYfAaLnSGPmx0j0j2TUYc72F9Brs3+w2wt5lY3AoaC6GYktBJ+LT2ya/3VKmPy25CAlmXp0LUrQIjIqYOztMsnYEf5MyoK+cKuk/inBrufyKVGK28oYQIJpgtKMEce2kSoHG8YaOTevDr8AZfUt0A+YRHAE28TnUoKEsxXHACUDiJZ1B2p17EiJDhaMMXRuWBgYD4XVTTAQbhbVPSX4h8AbQpHbO3423Q6szmzibT5co4M3iOG2Qm3XKLj3qA54AD1bAn6Xixi5jgkP4bmNLHtTnq04SuNnoNeJ1/vaMJnAdmgQI/cLH5sHQk55PfAEi3l333jEyPVOKoT3nC5SEgbHlkYA0bEDYuy5V9V11mSsoZNk69EbIEHC+EKCMdqh9MdPpeHn4JuDRy5nq0/SlJuunFTTjFLV5GA8DrW7n28KhYziWpAFjTipHUjrJNdkbwao0RseKlu0B8hMK1pEslEVcj9U03NocYy5CVj8kgm1zW2cLDBbGHEX1NfGDxaZ0usb+k5UMmKHOkKY97yJS0c0LuvIiooGCUuFOXJXH8uCMVzNVxXMPI4uT9FCUg7ep/oQJAxeQe8s8YXbJbUgK0pqWyAoufgpuYsi78Kz61nEoHo21596czVKxrhBJNcz4murPawgIytyKppYnYEj12B3OqizeoMK26+hdPKrRZLHDAa5YbM9o2lxRiY0tbZDXGbFU2K90aYHsERieNj8XZTkSkz11ZUpC/6m208gubKx+6C8EYKvdkqCV1IBfOJxZfiQy5kZk4siZcW47oZex6FNBtdtwhAsttNrmW04/gBeszk37MjljE182ta7BQ7FfLS+t4+kw1xur/VGmxWaxkUKw9ji2Io2rp4sFao/7OW3Fvu2Fdc080wcenutQ8JDbtlnRBib9DQtmpFkxbs+x8/xLD17vwIGQitKx/XCWgy/umutXtgtmLDpzIghl6tdoBZTkovIj+vUFJnUwucGJ0GzFGmgmpxWXIdyUNLNa5cevgdTVE9rhSvgG7k/kYqZWyLl1d0f3vrNl5UP+wAj/Up+DfhfKepG7JbYHJi6jcnByDZjzyelzhmb2omO7TdEZujaNy+JSGeknb5fCaV1LZBd0QgpBbUQcYsVZ7qZS2Ie/MfvOtfiNPJtrt8TLzZwpl78WFZpcBs7PxA8LhRQ8qQZ01lDzMYmbmY6O3rMjBHMDD2YRhXLCW/oOUretD0rlVhPJH/Ovgx43Zbp7OizOb4cwUwq0IvL+HpvAK5KwLPYbOd2Pr8XsTancuH7gBtcZDB6zdSHktvdi7Vt1vJpem4jq2LYSV60TICvfa/BjOBU+NQzGSZtOUt/Lxo3yXUleLYrTnibq6WGbXhQONY+RfJ4LP8jqb1Ny5pKxRbSL3Ts2vFgkcCB7Lf9fRNs4EK9uKK/Ys56LGSI5PEsXSKhfdtMSxpRfEd6AtkvJssOieTxWUoy8eqfYH1HKhPxPRcunyHath2jnjw+hk6IREo1zO4aezbkOWEsJ5LHSx6CByaYyYTd9K47eu6TBSEiebyKPB4DEowaTCOKvV1jX4kYPQjkvVx9QtMij9PflzA8E8njF/vyt583trGkA8MzC9RgkcCBbF6QLARzOvwVQU05iUsgIoHSbFmkbORyOqxts4XQ1iDMTEQS+7NVMVzcK5OxTThaVocJflNHlh8Wiew7qeAK67IbK8RbptP6QxuGHyKZfdmCEEqWfGa4jdYlygnbEGIeJ5LZ0xbvkZtcrgjPMjoxRZZSLVPQkOAWmmSIhHa1pQeFIRcNJaKVTnIiqZzRyd7IQ0iC25Fgp6G4GdYTbBCWBmuOZYL7uYdwIPURxN4rB79LBWBx4j6Y4YLqNP+UQZYFRq5wpmkJlOBB1eBvcI0v/HoxNEragA8eVjbBtsSH8LlXsvI2xywMk5m8jzbshjeWBgxEcAfBHqv2wSD2E/crzEMVQUpBDfy084aAcW4spsA7eZP61vIgCE+6C61t7cChuqEZzHefAzXjPgmWUA9uVa4UxIN13APWtC0UMnDn6Ffbryq+k8iMXxLxwvztEHb+Dki7haCE9N4ka1o00kmuWVlx8IsWCZCUUwXKQui1IphsdVa+9NfUhxe5xj4n4HFNI/DB1sNXehJcRyWiivweJTi547Bx5Vx2JSgblQ0S0A9L4988vWgPr8ns7d+D4PjNHJAFjS2t8OIC365RRCV9fGEqvqngshCR9ggGE4dulcKr1onSvXau/0DEsmG+Jvwcdo+2gTxYvPP0/1NlF1qLuENbpTzJL0GCEvz7kbswBGAdoDohqX0nD8YDV8Q+XB8Gl+8XgyKITc3tWk07SndrTsUhIxi5r1knsv1zQ4mwlGJ4yTKBbvDmtcwzzsyL6WcL9jwrintFlV3rwTaEQc9BqFCNJQqqgIqGFjD2jR2Q3C9t9kPu4xoQCvXNks42Kh27aYQBt4oKMdGN23iaPUhOlXAjtxSm2/dakWC/S7wjvDMUV9VzEYSEGDhpEAqUiHhsB1KYYL3QNFBVtLa3Q1JmERy+eh8kmCgoCxfuFbFaMCYZD7t29kwlhoo3ngRcLoDRjtDzt9lDS1EiQkknmEw04cOCFCL4VGY5jHZYR1yi0QPV329JJ5hMRJN5wQoRnFXWAKqM7NJqSLidD8oE7uWmCUZ9X08umaJobTi7vBFUDWl5ZaDtdhTUTTqzt2fneMGGfRfYHj+h8a/1u6gHR5E+oe9cocgK89X8GlAVnM7Igy+tpS/9vLkskIZogkYQ6lpbOlAePuhv8+FsRSa7k3fLYKiRgzIwy513mxMj+XahMHOH36lUGp4VE6nAx1rJ6cWsLDlEYAG+xYGLmJV5y1w8n7zID5IflICimGYVCriIvHqgBx3pytsr/LHbZRhsYI2WFcHRExVa3pk4zwfi0/NAXiRjDUNN06KS8AF7dMrSCLlIziipg8FCXnkt/JvTWQFM3dgDolIeKOC9NuaEF0y8vsF9Bm1kRbTMBH/hncxWL5SJ9PwymOl6VCpZE37xASOf42CFcekfR5LBISoZVoUlgqnvSRhj4tnvcc+YesLBK5kgC07czKHaW0NkgpZ1AKsILTkgM8lOZ3KVM4E9roY5O05yIVef9jouREYmZ4EUsDW1jfsu9HsO/ACY7PBBCUYOU8ycMXKw1SMyQ9OymObVbF/uctl2IFnFCjfhPapugOUhCTR+lea1bPGxWcK/UL4wKL7fc2ngh7grMQOkgI3U76zCAUd7krz/S+ifSHI7TnrsTVkb54JdwPR5ZTStt/b/oE18fYbfRXhc2yR/ybGuCawjLw1I7Bgc1v6nuxeaMgrK2erCj85H4B9YSP/W7iDM84+DI9fuM2K4JZ5XF/sN9KH1kjzu2J+cDtGsrQlH+ktEXqBU2GJm0iF1gjDxBswEe+/fRXturjeY7YilKSqvzCmzuBJcY1Lg0838m++ir2cDh8r6ZtD1iJb695v3JwEH1OiBzs8+nFO38hjRKAns/d5bvYv1PWBYZkoUBQ6BRPRmQWZq7C2gRW70rMOg5xkN8wPiYIZLFPx97Z90WMp6PnYsB4xlqUfyWnc7f7cQKCKuZMl1H6i5tGK2nwgC3T/UkeR8rLjRk6uUfbQhjI0MjBKoVPA+7p0Vwaw+/P6aEDm61x3ogmYWERR6js/jkCjFraIqR/JYM6/Bez90MtTdGhzRzxHBoWP3Cp68ivPkUWbco7xqcffQ20Rp0LJ6ExuL63EPwugiF+8XnasOneyvg/GvICehBuWjNo8I8jBFllrLYHVy5rlbJ5HBAgq9BnrzZZxNlaetGP8uCT4DUdceIAFBSnkPfc8YyMeaRmZJZf/73TQt8/HrZDIkwJQavbkDMz7Bb94+Krlb1oTNIbTTUeHzPo/nWLwzHlJySoEDxuk9/s4N0IFolnaeOdOQQttmFtUnvBBBCTbfndhXeZKt3K7G1zABoPVfXvXenzCjs4m8TEuSvTKzJFxqn/Kbf89IQYL3ZUlUBajHE/ATP8+yvtmuQhDM4lqHKKnVOSS8g2VvD8tqWJXtYmYRbShhLUylNQ3s9f6A6TRNpXtIgh2VhAKczN4nqgi8MD2cEKrwK3A1DEXtM8u9EJsmSIWOJSXHrmfTDLB75qhrT722DSVvF1F14AWr4YV6kJ83tSDRQkkG5v8hsAi1E7vN6RI8344e1j4VcOYW/BoYTyfL3hECI9YqFieyl8mwgoHTeNSxQPToBko0Jx1C2V8W+8PUdaHMw7/bepDprJbrUbbK8cHaUNykEthPJc6NeSxeVzsSG8eqYcMZ6CUaRNvagaXaODPjz0OXLGjb0B2YTXgde5HYV8mIwyy7L1A+YogmzYpsaeFEXq3mX5hhpG5uwZArBcuLC5FYdTIagJ78Gd40km1RyLY8IeEYjbAwSea42tCVHYfHU0LZ8EejIyYeR48dEYEwcJ6OHuaApMcjObnsYZszLevx5xY06DRLJJCaRStaI61u4c/Z+FoCjg43/KB02ESrAvgfBn5JXUUR7bgAAAAASUVORK5CYII=', ), ) is equal to value array ( 'target_id' => '3', 'display' => 1, 'description' => 'wH9uRq5y', 'url' => 'http://ec2-52-88-139-13.us-west-2.compute.amazonaws.com/checkout/sites/simpletest/370603/files/example.jpg', 'alt' => 'aH3oQExD', 'title' => 'lBYV3KZT', 'width' => 200, 'height' => 100, ).OtherFileItemNormalizerTest.php209Drupal\relaxed\Tests\Normalizer\FileItemNormalizerTest->testFileItemNormalize()
Undefined offset: 2Drupal\relaxed\Normalizer\ContentEntityNormalizer->denormalize(Array, 'Drupal\entity_test\Entity\EntityTest', 'json', Array) Symfony\Component\Serializer\Serializer->denormalizeObject(Array, 'Drupal\entity_test\Entity\EntityTest', 'json', Array) Symfony\Component\Serializer\Serializer->denormalize(Array, 'Drupal\entity_test\Entity\EntityTest', 'json') Drupal\relaxed\Tests\Normalizer\FileItemNormalizerTest->testDenormalize() Drupal\simpletest\TestBase->run(Array) simpletest_script_run_one_test('3', 'Drupal\relaxed\Tests\Normalizer\FileItemNormalizerTest') NoticeContentEntityNormalizer.php229Drupal\relaxed\Normalizer\ContentEntityNormalizer->denormalize()
Undefined offset: 1Drupal\relaxed\Normalizer\ContentEntityNormalizer->denormalize(Array, 'Drupal\entity_test\Entity\EntityTest', 'json', Array) Symfony\Component\Serializer\Serializer->denormalizeObject(Array, 'Drupal\entity_test\Entity\EntityTest', 'json', Array) Symfony\Component\Serializer\Serializer->denormalize(Array, 'Drupal\entity_test\Entity\EntityTest', 'json') Drupal\relaxed\Tests\Normalizer\FileItemNormalizerTest->testDenormalize() Drupal\simpletest\TestBase->run(Array) simpletest_script_run_one_test('3', 'Drupal\relaxed\Tests\Normalizer\FileItemNormalizerTest') NoticeContentEntityNormalizer.php229Drupal\relaxed\Normalizer\ContentEntityNormalizer->denormalize()
Drupal\Core\Database\InvalidQueryException: Query condition 'file_managed.uuid IN ()' cannot be empty. in Drupal\Core\Database\Query\Condition->condition() (line 76 of /var/lib/drupaltestbot/sites/default/files/checkout/core/lib/Drupal/Core/Database/Query/Condition.php). Drupal\Core\Database\Query\Condition->condition('file_managed.uuid', Array, 'IN') Drupal\Core\Database\Query\Select->condition('file_managed.uuid', Array, 'IN') Drupal\Core\Entity\Query\Sql\Condition->compile(Object) Drupal\Core\Entity\Query\Sql\Query->compile() Drupal\Core\Entity\Query\Sql\Query->execute() Drupal\Core\Entity\EntityStorageBase->loadByProperties(Array) Drupal\Core\Entity\EntityManager->loadEntityByUuid('file', NULL) Drupal\relaxed\Normalizer\ContentEntityNormalizer->denormalize(Array, 'Drupal\entity_test\Entity\EntityTest', 'json', Array) Symfony\Component\Serializer\Serializer->denormalizeObject(Array, 'Drupal\entity_test\Entity\EntityTest', 'json', Array) Symfony\Component\Serializer\Serializer->denormalize(Array, 'Drupal\entity_test\Entity\EntityTest', 'json') Drupal\relaxed\Tests\Normalizer\FileItemNormalizerTest->testDenormalize() Drupal\simpletest\TestBase->run(Array) simpletest_script_run_one_test('3', 'Drupal\relaxed\Tests\Normalizer\FileItemNormalizerTest') Uncaught exceptionCondition.php76Drupal\Core\Database\Query\Condition->condition()
ExpandDrupal\relaxed\Tests\RootResourceTest1310
MessageGroupFilenameLineFunctionStatus
Correct values in response. Value array ( 'couchdb' => Drupal\Core\StringTranslation\TranslatableMarkup::__set_state(array( 'string' => 'Welcome', 'translatedMarkup' => NULL, 'options' => array ( ), 'stringTranslation' => Drupal\Core\StringTranslation\TranslationManager::__set_state(array( 'translators' => array ( 30 => array ( 0 => Drupal\Core\StringTranslation\Translator\CustomStrings::__set_state(array( 'settings' => Drupal\Core\Site\Settings::__set_state(array( 'storage' => array ( 'hash_salt' => 'TZjFzdjTl8Fa7K3imkonbaN59X39XdvH3u4LA9jsj8BZhAPWGkn6uXTLJzF0K6e5ho3DjiI9Uw', 'update_free_access' => false, 'container_yamls' => array ( 0 => '/var/lib/drupaltestbot/sites/default/files/checkout/sites/simpletest/998086/services.yml', ), 'file_public_path' => 'sites/simpletest/998086/files', 'file_private_path' => 'sites/simpletest/998086/private', 'test_parent_site' => 'sites/default', 'apcu_ensure_unique_prefix' => false, 'install_profile' => 'testing', ), '_serviceId' => 'settings', )), 'translations' => array ( 'en' => array ( ), '' => array ( ), ), '_serviceId' => 'string_translator.custom_strings', )), ), ), 'sortedTranslators' => array ( 0 => Drupal\Core\StringTranslation\Translator\CustomStrings::__set_state(array( 'settings' => Drupal\Core\Site\Settings::__set_state(array( 'storage' => array ( 'hash_salt' => 'TZjFzdjTl8Fa7K3imkonbaN59X39XdvH3u4LA9jsj8BZhAPWGkn6uXTLJzF0K6e5ho3DjiI9Uw', 'update_free_access' => false, 'container_yamls' => array ( 0 => '/var/lib/drupaltestbot/sites/default/files/checkout/sites/simpletest/998086/services.yml', ), 'file_public_path' => 'sites/simpletest/998086/files', 'file_private_path' => 'sites/simpletest/998086/private', 'test_parent_site' => 'sites/default', 'apcu_ensure_unique_prefix' => false, 'install_profile' => 'testing', ), '_serviceId' => 'settings', )), 'translations' => array ( 'en' => array ( ), '' => array ( ), ), '_serviceId' => 'string_translator.custom_strings', )), ), 'defaultLangcode' => 'en', '_serviceId' => 'string_translation', )), 'arguments' => array ( ), )), 'uuid' => 'b96f1d08-977f-46a3-9600-ee2eed1e3984', 'vendor' => array ( 'name' => 'Drupal', 'version' => '8.0.0-dev', ), 'version' => '8.0.0-dev', ) is identical to value array ( 'couchdb' => 'Welcome', 'uuid' => 'b96f1d08-977f-46a3-9600-ee2eed1e3984', 'vendor' => array ( 'name' => 'Drupal', 'version' => '8.0.0-dev', ), 'version' => '8.0.0-dev', ).OtherRootResourceTest.php41Drupal\relaxed\Tests\RootResourceTest->testGet()
ExpandDrupal\relaxed\Tests\SessionResourceTest3010
MessageGroupFilenameLineFunctionStatus
Correct values in response. Value array ( 'info' => array ( ), 'ok' => true, 'userCtx' => array ( 'user' => 'test_user', 'roles' => array ( 0 => 'authenticated', 1 => 'gcqffdld', ), ), ) is identical to value array ( 'info' => array ( ), 'ok' => true, 'userCtx' => array ( 'user' => 'test_admin_user', 'roles' => array ( 0 => 'authenticated', 1 => 'dhteo2x3', 2 => '_admin', ), ), ).OtherSessionResourceTest.php75Drupal\relaxed\Tests\SessionResourceTest->testGet()

All

Test namePassFailException
LeafDrupal\relaxed\Tests\AllDbsResourceTest1400
ExpandDrupal\relaxed\Tests\AllDocsResourceTest1462
MessageGroupFilenameLineFunctionStatus
HTTP response code is correct.BrowserAllDocsResourceTest.php64Drupal\relaxed\Tests\AllDocsResourceTest->testGet()
Undefined index: messageDrupal\relaxed\Tests\AllDocsResourceTest->testGet() Drupal\simpletest\TestBase->run(Array) simpletest_script_run_one_test('19', 'Drupal\relaxed\Tests\AllDocsResourceTest') NoticeAllDocsResourceTest.php68Drupal\relaxed\Tests\AllDocsResourceTest->testGet()
Correct value for message key when not including docs. Value NULL is equal to value 'A fatal error occurred: Settings can not be serialized. This probably means you are serializing an object that has an indirect reference to the Settings object. Adjust your code so that is not necessary.'.OtherAllDocsResourceTest.php68Drupal\relaxed\Tests\AllDocsResourceTest->testGet()
HTTP response code is correct.BrowserAllDocsResourceTest.php100Drupal\relaxed\Tests\AllDocsResourceTest->testGet()
Undefined index: messageDrupal\relaxed\Tests\AllDocsResourceTest->testGet() Drupal\simpletest\TestBase->run(Array) simpletest_script_run_one_test('19', 'Drupal\relaxed\Tests\AllDocsResourceTest') NoticeAllDocsResourceTest.php104Drupal\relaxed\Tests\AllDocsResourceTest->testGet()
Correct value for message key when including docs. Value NULL is equal to value 'A fatal error occurred: Settings can not be serialized. This probably means you are serializing an object that has an indirect reference to the Settings object. Adjust your code so that is not necessary.'.OtherAllDocsResourceTest.php104Drupal\relaxed\Tests\AllDocsResourceTest->testGet()
[02-Oct-2015 09:45:07 Australia/Sydney] Uncaught PHP Exception LogicException: "Settings can not be serialized. This probably means you are serializing an object that has an indirect reference to the Settings object. Adjust your code so that is not necessary." at /var/lib/drupaltestbot/sites/default/files/checkout/core/lib/Drupal/Core/Site/Settings.php line 67 Fatal errorUnknown0Unknown
[02-Oct-2015 09:45:07 Australia/Sydney] Uncaught PHP Exception LogicException: "Settings can not be serialized. This probably means you are serializing an object that has an indirect reference to the Settings object. Adjust your code so that is not necessary." at /var/lib/drupaltestbot/sites/default/files/checkout/core/lib/Drupal/Core/Site/Settings.php line 67 Fatal errorUnknown0Unknown
LeafDrupal\relaxed\Tests\AttachmentResourceTest9200
LeafDrupal\relaxed\Tests\BulkDocsResourceTest5200
ExpandDrupal\relaxed\Tests\ChangesResourceTest20150
MessageGroupFilenameLineFunctionStatus
HTTP response code is correct when not including docs.BrowserChangesResourceTest.php101Drupal\relaxed\Tests\ChangesResourceTest->testGet()
The result is correct when not including docs. Value array ( 'message' => 'A fatal error occurred: Settings can not be serialized. This probably means you are serializing an object that has an indirect reference to the Settings object. Adjust your code so that is not necessary.', ) is equal to value array ( 'last_seq' => 1443743114694740, 'results' => array ( 0 => array ( 'changes' => array ( 0 => array ( 'rev' => '1-676121a32fade36ce2988b874bc6a65e', ), ), 'id' => '053e922e-d272-4f8f-ac49-73c946de19dc', 'seq' => 1443743113599350, ), 1 => array ( 'changes' => array ( 0 => array ( 'rev' => '4-84f389674858a3d14f1a46a6ae4cb3f3', ), ), 'id' => 'e7c195bf-46e2-4828-9500-a3b9c3f806b2', 'seq' => 1443743114527305, ), 2 => array ( 'changes' => array ( 0 => array ( 'rev' => '3-5c8f5f220326b659461b72e99c5fd5ad', ), ), 'id' => '1fe4c201-a416-45b8-8300-b1e88ee277d5', 'seq' => 1443743114694740, 'deleted' => true, ), ), ).OtherChangesResourceTest.php105Drupal\relaxed\Tests\ChangesResourceTest->testGet()
HTTP response code is correct when including docs.BrowserChangesResourceTest.php108Drupal\relaxed\Tests\ChangesResourceTest->testGet()
The result is correct when including docs. Value array ( 'message' => 'A fatal error occurred: Settings can not be serialized. This probably means you are serializing an object that has an indirect reference to the Settings object. Adjust your code so that is not necessary.', ) is equal to value array ( 'last_seq' => 1443743114694740, 'results' => array ( 0 => array ( 'changes' => array ( 0 => array ( 'rev' => '1-676121a32fade36ce2988b874bc6a65e', ), ), 'id' => '053e922e-d272-4f8f-ac49-73c946de19dc', 'seq' => 1443743113599350, 'doc' => array ( '@context' => array ( '_id' => '@id', 'user' => 'http://ec2-52-88-139-13.us-west-2.compute.amazonaws.com/checkout/rest/type/user/user', ), '@type' => 'user', '_id' => '053e922e-d272-4f8f-ac49-73c946de19dc', 'langcode' => array ( 0 => array ( 'value' => 'en', ), ), 'preferred_langcode' => array ( 0 => array ( 'value' => 'en', ), ), 'preferred_admin_langcode' => array ( ), 'name' => array ( 0 => array ( 'value' => 'zIyR6aYN', ), ), 'pass' => array ( 0 => NULL, ), 'mail' => array ( 0 => array ( 'value' => 'zIyR6aYN@example.com', ), ), 'timezone' => array ( 0 => array ( 'value' => 'Australia/Sydney', ), ), 'status' => array ( 0 => array ( 'value' => '1', ), ), 'created' => array ( 0 => array ( 'value' => '1443743020', ), ), 'changed' => array ( 0 => array ( 'value' => '1443743020', ), ), 'access' => array ( 0 => array ( 'value' => '1443743113', ), ), 'login' => array ( 0 => array ( 'value' => '1443743113', ), ), 'init' => array ( ), 'roles' => array ( 0 => array ( 'target_id' => 'dqmvcdfj', ), ), 'default_langcode' => array ( 0 => array ( 'value' => '1', ), ), '_rev' => '1-676121a32fade36ce2988b874bc6a65e', ), ), 1 => array ( 'changes' => array ( 0 => array ( 'rev' => '4-84f389674858a3d14f1a46a6ae4cb3f3', ), ), 'id' => 'e7c195bf-46e2-4828-9500-a3b9c3f806b2', 'seq' => 1443743114527305, 'doc' => array ( '@context' => array ( '_id' => '@id', 'entity_test_rev' => 'http://ec2-52-88-139-13.us-west-2.compute.amazonaws.com/checkout/rest/type/entity_test_rev/entity_test_rev', ), '@type' => 'entity_test_rev', '_id' => 'e7c195bf-46e2-4828-9500-a3b9c3f806b2', 'langcode' => array ( 0 => array ( 'value' => 'en', ), ), 'name' => array ( 0 => array ( 'value' => '!q4T=*:nR%By>&5l14gG<^~V2', ), ), 'type' => array ( 0 => array ( 'value' => 'entity_test_rev', ), ), 'created' => array ( 0 => array ( 'value' => 1443743020, ), ), 'user_id' => array ( 0 => array ( 'target_id' => 1, ), ), '_rev' => '4-84f389674858a3d14f1a46a6ae4cb3f3', 'field_test_text' => array ( 0 => array ( 'value' => '`*0\'>&AB', 'format' => 'plain_text', ), ), ), ), 2 => array ( 'changes' => array ( 0 => array ( 'rev' => '3-5c8f5f220326b659461b72e99c5fd5ad', ), ), 'id' => '1fe4c201-a416-45b8-8300-b1e88ee277d5', 'seq' => 1443743114694740, 'doc' => array ( '@context' => array ( '_id' => '@id', 'entity_test_rev' => 'http://ec2-52-88-139-13.us-west-2.compute.amazonaws.com/checkout/rest/type/entity_test_rev/entity_test_rev', ), '@type' => 'entity_test_rev', '_id' => '1fe4c201-a416-45b8-8300-b1e88ee277d5', 'langcode' => array ( 0 => array ( 'value' => 'en', ), ), 'name' => array ( ), 'type' => array ( 0 => array ( 'value' => 'entity_test_rev', ), ), 'created' => array ( 0 => array ( 'value' => 1443743020, ), ), 'user_id' => array ( 0 => array ( 'target_id' => 1, ), ), '_deleted' => true, '_rev' => '3-5c8f5f220326b659461b72e99c5fd5ad', 'field_test_text' => array ( 0 => array ( 'value' => 'I,RA>&Je', 'format' => 'plain_text', ), ), ), 'deleted' => true, ), ), ).OtherChangesResourceTest.php112Drupal\relaxed\Tests\ChangesResourceTest->testGet()
HTTP response code is correct when not including docs.BrowserChangesResourceTest.php116Drupal\relaxed\Tests\ChangesResourceTest->testGet()
The result is correct when not including docs. Value array ( 'message' => 'A fatal error occurred: Settings can not be serialized. This probably means you are serializing an object that has an indirect reference to the Settings object. Adjust your code so that is not necessary.', ) is equal to value array ( 'last_seq' => 1443743114694740, 'results' => array ( 0 => array ( 'changes' => array ( 0 => array ( 'rev' => '1-676121a32fade36ce2988b874bc6a65e', ), ), 'id' => '053e922e-d272-4f8f-ac49-73c946de19dc', 'seq' => 1443743113599350, ), 1 => array ( 'changes' => array ( 0 => array ( 'rev' => '4-84f389674858a3d14f1a46a6ae4cb3f3', ), ), 'id' => 'e7c195bf-46e2-4828-9500-a3b9c3f806b2', 'seq' => 1443743114527305, ), 2 => array ( 'changes' => array ( 0 => array ( 'rev' => '3-5c8f5f220326b659461b72e99c5fd5ad', ), ), 'id' => '1fe4c201-a416-45b8-8300-b1e88ee277d5', 'seq' => 1443743114694740, 'deleted' => true, ), ), ).OtherChangesResourceTest.php120Drupal\relaxed\Tests\ChangesResourceTest->testGet()
HTTP response code is correct when not including docs.BrowserChangesResourceTest.php123Drupal\relaxed\Tests\ChangesResourceTest->testGet()
The result is correct when not including docs. Value array ( 'message' => 'A fatal error occurred: Settings can not be serialized. This probably means you are serializing an object that has an indirect reference to the Settings object. Adjust your code so that is not necessary.', ) is equal to value array ( 'last_seq' => 1443743114694740, 'results' => array ( 0 => array ( 'changes' => array ( 0 => array ( 'rev' => '3-5c8f5f220326b659461b72e99c5fd5ad', ), ), 'id' => '1fe4c201-a416-45b8-8300-b1e88ee277d5', 'seq' => 1443743114694740, 'deleted' => true, ), ), ).OtherChangesResourceTest.php132Drupal\relaxed\Tests\ChangesResourceTest->testGet()
HTTP response code is correct when not including docs.BrowserChangesResourceTest.php135Drupal\relaxed\Tests\ChangesResourceTest->testGet()
The result is correct when not including docs. Value array ( 'message' => 'A fatal error occurred: Settings can not be serialized. This probably means you are serializing an object that has an indirect reference to the Settings object. Adjust your code so that is not necessary.', ) is equal to value array ( 'last_seq' => 1443743114694740, 'results' => array ( ), ).OtherChangesResourceTest.php141Drupal\relaxed\Tests\ChangesResourceTest->testGet()
[02-Oct-2015 09:45:14 Australia/Sydney] Uncaught PHP Exception LogicException: "Settings can not be serialized. This probably means you are serializing an object that has an indirect reference to the Settings object. Adjust your code so that is not necessary." at /var/lib/drupaltestbot/sites/default/files/checkout/core/lib/Drupal/Core/Site/Settings.php line 67 Fatal errorUnknown0Unknown
[02-Oct-2015 09:45:14 Australia/Sydney] Uncaught PHP Exception LogicException: "Settings can not be serialized. This probably means you are serializing an object that has an indirect reference to the Settings object. Adjust your code so that is not necessary." at /var/lib/drupaltestbot/sites/default/files/checkout/core/lib/Drupal/Core/Site/Settings.php line 67 Fatal errorUnknown0Unknown
[02-Oct-2015 09:45:15 Australia/Sydney] Uncaught PHP Exception LogicException: "Settings can not be serialized. This probably means you are serializing an object that has an indirect reference to the Settings object. Adjust your code so that is not necessary." at /var/lib/drupaltestbot/sites/default/files/checkout/core/lib/Drupal/Core/Site/Settings.php line 67 Fatal errorUnknown0Unknown
[02-Oct-2015 09:45:15 Australia/Sydney] Uncaught PHP Exception LogicException: "Settings can not be serialized. This probably means you are serializing an object that has an indirect reference to the Settings object. Adjust your code so that is not necessary." at /var/lib/drupaltestbot/sites/default/files/checkout/core/lib/Drupal/Core/Site/Settings.php line 67 Fatal errorUnknown0Unknown
[02-Oct-2015 09:45:15 Australia/Sydney] Uncaught PHP Exception LogicException: "Settings can not be serialized. This probably means you are serializing an object that has an indirect reference to the Settings object. Adjust your code so that is not necessary." at /var/lib/drupaltestbot/sites/default/files/checkout/core/lib/Drupal/Core/Site/Settings.php line 67 Fatal errorUnknown0Unknown
LeafDrupal\relaxed\Tests\DbResourceTest7500
ExpandDrupal\relaxed\Tests\DocResourceTest13093
MessageGroupFilenameLineFunctionStatus
HTTP response header x-relaxed-etag with value 2-f6c080537fa336f29aa858e2cf4094a8 found, actual value: 1-a6072ff733211c641fe3d73d914b08eeBrowserDocResourceTest.php56Drupal\relaxed\Tests\DocResourceTest->testHead()
HTTP response code is correct.BrowserDocResourceTest.php64Drupal\relaxed\Tests\DocResourceTest->testHead()
HTTP response header x-relaxed-etag with value 2-f6c080537fa336f29aa858e2cf4094a8 found, actual value: 1-a6072ff733211c641fe3d73d914b08eeBrowserDocResourceTest.php72Drupal\relaxed\Tests\DocResourceTest->testHead()
HTTP response code is correct.BrowserDocResourceTest.php76Drupal\relaxed\Tests\DocResourceTest->testHead()
Undefined index: _revisionsDrupal\relaxed\Tests\DocResourceTest->testGet() Drupal\simpletest\TestBase->run(Array) simpletest_script_run_one_test('14', 'Drupal\relaxed\Tests\DocResourceTest') NoticeDocResourceTest.php113Drupal\relaxed\Tests\DocResourceTest->testGet()
Undefined index: _revisionsDrupal\relaxed\Tests\DocResourceTest->testGet() Drupal\simpletest\TestBase->run(Array) simpletest_script_run_one_test('14', 'Drupal\relaxed\Tests\DocResourceTest') NoticeDocResourceTest.php113Drupal\relaxed\Tests\DocResourceTest->testGet()
GET request returned correct revision list after first revision. Value '-' is equal to value '1-a6072ff733211c641fe3d73d914b08ee'.OtherDocResourceTest.php114Drupal\relaxed\Tests\DocResourceTest->testGet()
Undefined index: _revisionsDrupal\relaxed\Tests\DocResourceTest->testGet() Drupal\simpletest\TestBase->run(Array) simpletest_script_run_one_test('14', 'Drupal\relaxed\Tests\DocResourceTest') NoticeDocResourceTest.php121Drupal\relaxed\Tests\DocResourceTest->testGet()
GET request returned correct revision list after second revision. Value 0 is equal to value 2.OtherDocResourceTest.php122Drupal\relaxed\Tests\DocResourceTest->testGet()
HTTP response code is correct.BrowserDocResourceTest.php126Drupal\relaxed\Tests\DocResourceTest->testGet()
HTTP response header x-relaxed-etag with value 2-37bbab0f1fb34b1d6ad3851364c27536 found, actual value: 1-a6072ff733211c641fe3d73d914b08eeBrowserDocResourceTest.php141Drupal\relaxed\Tests\DocResourceTest->testGet()
HTTP response code is correct.BrowserDocResourceTest.php145Drupal\relaxed\Tests\DocResourceTest->testGet()
LeafDrupal\relaxed\Tests\Encoder\StreamEncoderTest600
LeafDrupal\relaxed\Tests\EnsureFullCommitResourceTest1500
LeafDrupal\relaxed\Tests\LocalDocResourceTest4800
LeafDrupal\relaxed\Tests\Normalizer\AllDocsNormalizerTest1200
LeafDrupal\relaxed\Tests\Normalizer\AttachmentNormalizerTest2200
LeafDrupal\relaxed\Tests\Normalizer\BulkDocsNormalizerTest4400
LeafDrupal\relaxed\Tests\Normalizer\ContentEntityNormalizerTest4900
ExpandDrupal\relaxed\Tests\Normalizer\FileItemNormalizerTest2813
MessageGroupFilenameLineFunctionStatus
Field _attachments is normalized correctly. Value array ( 'field_test_file/0/3064a946-b481-4ae2-8700-f15d79ec6cd0/public/example1.txt' => array ( 'content_type' => 'text/plain', 'digest' => 'md5-NGJiOTZjMGMzZWZkMTQ2NDU3MWMwYzBhNzM3YTM1NTQ=', 'length' => 8, 'data' => 'aUlTbUZYdEM=', ), 'field_test_file/1/f1b0c29a-ff4b-409c-8256-8696570c5d5e/public/example2.txt' => array ( 'content_type' => 'text/plain', 'digest' => 'md5-NDZhNDgxOTI0NmU5OTY4MjQyY2U4MzZmMTYxYzc1M2I=', 'length' => 8, 'data' => 'clNPVFM4TFI=', ), 'field_test_image/0/dae503b6-f68a-45ae-ae00-c2166dc90e30/public/example.jpg' => array ( 'content_type' => 'image/jpeg', 'digest' => 'md5-ZTBlM2JmOWQwM2YwMjExNTgxMTVlMmUzNGExODA2OTk=', 'length' => 3905, 'data' => 'iVBORw0KGgoAAAANSUhEUgAAAFgAAABkCAYAAAACLffiAAAPCElEQVR42u1dCVBUVxZ9gIlGzabJxKSSVGUyqdTETCqT1CSVyTqlqUwSEZBNFjFq1LjEBXdBNsMqOyKbSEBcQUVBBVFExQVFBcEFFJBdZN+hWe7c95wve/O7+zc08E/VLZbm//7/9H3n3XvffR+i8jB0yySmPu8SEcqBuo5NB9G1byGm2ycSEQLD1Hfyfx0i4JWV+4DoO1cREQLDxHuVXdR1+GV/BhAzPyCz3bKICAEx2/3S8fRiCE0pBrLmFBAjDzTPU0SEQJj1R2tRTTMk5VY/Idg8DoiBCxBjL28iQkGY+Mz6ynofUGQ8qmcEM1t9AoiuAxBTbwMiQgEYuhZG3igAisyyRtBYF99J8spoINo2gBq9noiQb3J7d9kOaO/oAIrb6MFjN5ym5HYnWdeekryOiJBJGsaNN3JuSy2sAQ7HbpdRUnvbquOAOk01OYSI4AHT7X9T17VvPYzSwKG6qRWWR2X2STCnySgnT0K4Ob4aRES/nqv9golze+ydR8Chpa0D9qWWwgculyiZUo3FybO2tqJkWBER3bx2Anpg1ifrQyC7vAE4VDW2Qsi1EjAMT5dGbC9dZrGyvlMN1i++J6MeJt4rJxo5tXnHZ+CEBgwNknZIzK4C30tF8GvEHVBbS8mT0ZYfAaLnSGPmx0j0j2TUYc72F9Brs3+w2wt5lY3AoaC6GYktBJ+LT2ya/3VKmPy25CAlmXp0LUrQIjIqYOztMsnYEf5MyoK+cKuk/inBrufyKVGK28oYQIJpgtKMEce2kSoHG8YaOTevDr8AZfUt0A+YRHAE28TnUoKEsxXHACUDiJZ1B2p17EiJDhaMMXRuWBgYD4XVTTAQbhbVPSX4h8AbQpHbO3423Q6szmzibT5co4M3iOG2Qm3XKLj3qA54AD1bAn6Xixi5jgkP4bmNLHtTnq04SuNnoNeJ1/vaMJnAdmgQI/cLH5sHQk55PfAEi3l333jEyPVOKoT3nC5SEgbHlkYA0bEDYuy5V9V11mSsoZNk69EbIEHC+EKCMdqh9MdPpeHn4JuDRy5nq0/SlJuunFTTjFLV5GA8DrW7n28KhYziWpAFjTipHUjrJNdkbwao0RseKlu0B8hMK1pEslEVcj9U03NocYy5CVj8kgm1zW2cLDBbGHEX1NfGDxaZ0usb+k5UMmKHOkKY97yJS0c0LuvIiooGCUuFOXJXH8uCMVzNVxXMPI4uT9FCUg7ep/oQJAxeQe8s8YXbJbUgK0pqWyAoufgpuYsi78Kz61nEoHo21596czVKxrhBJNcz4murPawgIytyKppYnYEj12B3OqizeoMK26+hdPKrRZLHDAa5YbM9o2lxRiY0tbZDXGbFU2K90aYHsERieNj8XZTkSkz11ZUpC/6m208gubKx+6C8EYKvdkqCV1IBfOJxZfiQy5kZk4siZcW47oZex6FNBtdtwhAsttNrmW04/gBeszk37MjljE182ta7BQ7FfLS+t4+kw1xur/VGmxWaxkUKw9ji2Io2rp4sFao/7OW3Fvu2Fdc080wcenutQ8JDbtlnRBib9DQtmpFkxbs+x8/xLD17vwIGQitKx/XCWgy/umutXtgtmLDpzIghl6tdoBZTkovIj+vUFJnUwucGJ0GzFGmgmpxWXIdyUNLNa5cevgdTVE9rhSvgG7k/kYqZWyLl1d0f3vrNl5UP+wAj/Up+DfhfKepG7JbYHJi6jcnByDZjzyelzhmb2omO7TdEZujaNy+JSGeknb5fCaV1LZBd0QgpBbUQcYsVZ7qZS2Ie/MfvOtfiNPJtrt8TLzZwpl78WFZpcBs7PxA8LhRQ8qQZ01lDzMYmbmY6O3rMjBHMDD2YRhXLCW/oOUretD0rlVhPJH/Ovgx43Zbp7OizOb4cwUwq0IvL+HpvAK5KwLPYbOd2Pr8XsTancuH7gBtcZDB6zdSHktvdi7Vt1vJpem4jq2LYSV60TICvfa/BjOBU+NQzGSZtOUt/Lxo3yXUleLYrTnibq6WGbXhQONY+RfJ4LP8jqb1Ny5pKxRbSL3Ts2vFgkcCB7Lf9fRNs4EK9uKK/Ys56LGSI5PEsXSKhfdtMSxpRfEd6AtkvJssOieTxWUoy8eqfYH1HKhPxPRcunyHath2jnjw+hk6IREo1zO4aezbkOWEsJ5LHSx6CByaYyYTd9K47eu6TBSEiebyKPB4DEowaTCOKvV1jX4kYPQjkvVx9QtMij9PflzA8E8njF/vyt583trGkA8MzC9RgkcCBbF6QLARzOvwVQU05iUsgIoHSbFmkbORyOqxts4XQ1iDMTEQS+7NVMVzcK5OxTThaVocJflNHlh8Wiew7qeAK67IbK8RbptP6QxuGHyKZfdmCEEqWfGa4jdYlygnbEGIeJ5LZ0xbvkZtcrgjPMjoxRZZSLVPQkOAWmmSIhHa1pQeFIRcNJaKVTnIiqZzRyd7IQ0iC25Fgp6G4GdYTbBCWBmuOZYL7uYdwIPURxN4rB79LBWBx4j6Y4YLqNP+UQZYFRq5wpmkJlOBB1eBvcI0v/HoxNEragA8eVjbBtsSH8LlXsvI2xywMk5m8jzbshjeWBgxEcAfBHqv2wSD2E/crzEMVQUpBDfy084aAcW4spsA7eZP61vIgCE+6C61t7cChuqEZzHefAzXjPgmWUA9uVa4UxIN13APWtC0UMnDn6Ffbryq+k8iMXxLxwvztEHb+Dki7haCE9N4ka1o00kmuWVlx8IsWCZCUUwXKQui1IphsdVa+9NfUhxe5xj4n4HFNI/DB1sNXehJcRyWiivweJTi547Bx5Vx2JSgblQ0S0A9L4988vWgPr8ns7d+D4PjNHJAFjS2t8OIC365RRCV9fGEqvqngshCR9ggGE4dulcKr1onSvXau/0DEsmG+Jvwcdo+2gTxYvPP0/1NlF1qLuENbpTzJL0GCEvz7kbswBGAdoDohqX0nD8YDV8Q+XB8Gl+8XgyKITc3tWk07SndrTsUhIxi5r1knsv1zQ4mwlGJ4yTKBbvDmtcwzzsyL6WcL9jwrintFlV3rwTaEQc9BqFCNJQqqgIqGFjD2jR2Q3C9t9kPu4xoQCvXNks42Kh27aYQBt4oKMdGN23iaPUhOlXAjtxSm2/dakWC/S7wjvDMUV9VzEYSEGDhpEAqUiHhsB1KYYL3QNFBVtLa3Q1JmERy+eh8kmCgoCxfuFbFaMCYZD7t29kwlhoo3ngRcLoDRjtDzt9lDS1EiQkknmEw04cOCFCL4VGY5jHZYR1yi0QPV329JJ5hMRJN5wQoRnFXWAKqM7NJqSLidD8oE7uWmCUZ9X08umaJobTi7vBFUDWl5ZaDtdhTUTTqzt2fneMGGfRfYHj+h8a/1u6gHR5E+oe9cocgK89X8GlAVnM7Igy+tpS/9vLkskIZogkYQ6lpbOlAePuhv8+FsRSa7k3fLYKiRgzIwy513mxMj+XahMHOH36lUGp4VE6nAx1rJ6cWsLDlEYAG+xYGLmJV5y1w8n7zID5IflICimGYVCriIvHqgBx3pytsr/LHbZRhsYI2WFcHRExVa3pk4zwfi0/NAXiRjDUNN06KS8AF7dMrSCLlIziipg8FCXnkt/JvTWQFM3dgDolIeKOC9NuaEF0y8vsF9Bm1kRbTMBH/hncxWL5SJ9PwymOl6VCpZE37xASOf42CFcekfR5LBISoZVoUlgqnvSRhj4tnvcc+YesLBK5kgC07czKHaW0NkgpZ1AKsILTkgM8lOZ3KVM4E9roY5O05yIVef9jouREYmZ4EUsDW1jfsu9HsO/ACY7PBBCUYOU8ycMXKw1SMyQ9OymObVbF/uctl2IFnFCjfhPapugOUhCTR+lea1bPGxWcK/UL4wKL7fc2ngh7grMQOkgI3U76zCAUd7krz/S+ifSHI7TnrsTVkb54JdwPR5ZTStt/b/oE18fYbfRXhc2yR/ybGuCawjLw1I7Bgc1v6nuxeaMgrK2erCj85H4B9YSP/W7iDM84+DI9fuM2K4JZ5XF/sN9KH1kjzu2J+cDtGsrQlH+ktEXqBU2GJm0iF1gjDxBswEe+/fRXturjeY7YilKSqvzCmzuBJcY1Lg0838m++ir2cDh8r6ZtD1iJb695v3JwEH1OiBzs8+nFO38hjRKAns/d5bvYv1PWBYZkoUBQ6BRPRmQWZq7C2gRW70rMOg5xkN8wPiYIZLFPx97Z90WMp6PnYsB4xlqUfyWnc7f7cQKCKuZMl1H6i5tGK2nwgC3T/UkeR8rLjRk6uUfbQhjI0MjBKoVPA+7p0Vwaw+/P6aEDm61x3ogmYWERR6js/jkCjFraIqR/JYM6/Bez90MtTdGhzRzxHBoWP3Cp68ivPkUWbco7xqcffQ20Rp0LJ6ExuL63EPwugiF+8XnasOneyvg/GvICehBuWjNo8I8jBFllrLYHVy5rlbJ5HBAgq9BnrzZZxNlaetGP8uCT4DUdceIAFBSnkPfc8YyMeaRmZJZf/73TQt8/HrZDIkwJQavbkDMz7Bb94+Krlb1oTNIbTTUeHzPo/nWLwzHlJySoEDxuk9/s4N0IFolnaeOdOQQttmFtUnvBBBCTbfndhXeZKt3K7G1zABoPVfXvXenzCjs4m8TEuSvTKzJFxqn/Kbf89IQYL3ZUlUBajHE/ATP8+yvtmuQhDM4lqHKKnVOSS8g2VvD8tqWJXtYmYRbShhLUylNQ3s9f6A6TRNpXtIgh2VhAKczN4nqgi8MD2cEKrwK3A1DEXtM8u9EJsmSIWOJSXHrmfTDLB75qhrT722DSVvF1F14AWr4YV6kJ83tSDRQkkG5v8hsAi1E7vN6RI8344e1j4VcOYW/BoYTyfL3hECI9YqFieyl8mwgoHTeNSxQPToBko0Jx1C2V8W+8PUdaHMw7/bepDprJbrUbbK8cHaUNykEthPJc6NeSxeVzsSG8eqYcMZ6CUaRNvagaXaODPjz0OXLGjb0B2YTXgde5HYV8mIwyy7L1A+YogmzYpsaeFEXq3mX5hhpG5uwZArBcuLC5FYdTIagJ78Gd40km1RyLY8IeEYjbAwSea42tCVHYfHU0LZ8EejIyYeR48dEYEwcJ6OHuaApMcjObnsYZszLevx5xY06DRLJJCaRStaI61u4c/Z+FoCjg43/KB02ESrAvgfBn5JXUUR7bgAAAAASUVORK5CYII=', ), ) is equal to value array ( 'target_id' => '3', 'display' => 1, 'description' => 'wH9uRq5y', 'url' => 'http://ec2-52-88-139-13.us-west-2.compute.amazonaws.com/checkout/sites/simpletest/370603/files/example.jpg', 'alt' => 'aH3oQExD', 'title' => 'lBYV3KZT', 'width' => 200, 'height' => 100, ).OtherFileItemNormalizerTest.php209Drupal\relaxed\Tests\Normalizer\FileItemNormalizerTest->testFileItemNormalize()
Undefined offset: 2Drupal\relaxed\Normalizer\ContentEntityNormalizer->denormalize(Array, 'Drupal\entity_test\Entity\EntityTest', 'json', Array) Symfony\Component\Serializer\Serializer->denormalizeObject(Array, 'Drupal\entity_test\Entity\EntityTest', 'json', Array) Symfony\Component\Serializer\Serializer->denormalize(Array, 'Drupal\entity_test\Entity\EntityTest', 'json') Drupal\relaxed\Tests\Normalizer\FileItemNormalizerTest->testDenormalize() Drupal\simpletest\TestBase->run(Array) simpletest_script_run_one_test('3', 'Drupal\relaxed\Tests\Normalizer\FileItemNormalizerTest') NoticeContentEntityNormalizer.php229Drupal\relaxed\Normalizer\ContentEntityNormalizer->denormalize()
Undefined offset: 1Drupal\relaxed\Normalizer\ContentEntityNormalizer->denormalize(Array, 'Drupal\entity_test\Entity\EntityTest', 'json', Array) Symfony\Component\Serializer\Serializer->denormalizeObject(Array, 'Drupal\entity_test\Entity\EntityTest', 'json', Array) Symfony\Component\Serializer\Serializer->denormalize(Array, 'Drupal\entity_test\Entity\EntityTest', 'json') Drupal\relaxed\Tests\Normalizer\FileItemNormalizerTest->testDenormalize() Drupal\simpletest\TestBase->run(Array) simpletest_script_run_one_test('3', 'Drupal\relaxed\Tests\Normalizer\FileItemNormalizerTest') NoticeContentEntityNormalizer.php229Drupal\relaxed\Normalizer\ContentEntityNormalizer->denormalize()
Drupal\Core\Database\InvalidQueryException: Query condition 'file_managed.uuid IN ()' cannot be empty. in Drupal\Core\Database\Query\Condition->condition() (line 76 of /var/lib/drupaltestbot/sites/default/files/checkout/core/lib/Drupal/Core/Database/Query/Condition.php). Drupal\Core\Database\Query\Condition->condition('file_managed.uuid', Array, 'IN') Drupal\Core\Database\Query\Select->condition('file_managed.uuid', Array, 'IN') Drupal\Core\Entity\Query\Sql\Condition->compile(Object) Drupal\Core\Entity\Query\Sql\Query->compile() Drupal\Core\Entity\Query\Sql\Query->execute() Drupal\Core\Entity\EntityStorageBase->loadByProperties(Array) Drupal\Core\Entity\EntityManager->loadEntityByUuid('file', NULL) Drupal\relaxed\Normalizer\ContentEntityNormalizer->denormalize(Array, 'Drupal\entity_test\Entity\EntityTest', 'json', Array) Symfony\Component\Serializer\Serializer->denormalizeObject(Array, 'Drupal\entity_test\Entity\EntityTest', 'json', Array) Symfony\Component\Serializer\Serializer->denormalize(Array, 'Drupal\entity_test\Entity\EntityTest', 'json') Drupal\relaxed\Tests\Normalizer\FileItemNormalizerTest->testDenormalize() Drupal\simpletest\TestBase->run(Array) simpletest_script_run_one_test('3', 'Drupal\relaxed\Tests\Normalizer\FileItemNormalizerTest') Uncaught exceptionCondition.php76Drupal\Core\Database\Query\Condition->condition()
LeafDrupal\relaxed\Tests\Normalizer\WorkspaceNormalizerTest2400
LeafDrupal\relaxed\Tests\ReplicationLogTest600
LeafDrupal\relaxed\Tests\RevsDiffResourceTest2900
ExpandDrupal\relaxed\Tests\RootResourceTest1310
MessageGroupFilenameLineFunctionStatus
Correct values in response. Value array ( 'couchdb' => Drupal\Core\StringTranslation\TranslatableMarkup::__set_state(array( 'string' => 'Welcome', 'translatedMarkup' => NULL, 'options' => array ( ), 'stringTranslation' => Drupal\Core\StringTranslation\TranslationManager::__set_state(array( 'translators' => array ( 30 => array ( 0 => Drupal\Core\StringTranslation\Translator\CustomStrings::__set_state(array( 'settings' => Drupal\Core\Site\Settings::__set_state(array( 'storage' => array ( 'hash_salt' => 'TZjFzdjTl8Fa7K3imkonbaN59X39XdvH3u4LA9jsj8BZhAPWGkn6uXTLJzF0K6e5ho3DjiI9Uw', 'update_free_access' => false, 'container_yamls' => array ( 0 => '/var/lib/drupaltestbot/sites/default/files/checkout/sites/simpletest/998086/services.yml', ), 'file_public_path' => 'sites/simpletest/998086/files', 'file_private_path' => 'sites/simpletest/998086/private', 'test_parent_site' => 'sites/default', 'apcu_ensure_unique_prefix' => false, 'install_profile' => 'testing', ), '_serviceId' => 'settings', )), 'translations' => array ( 'en' => array ( ), '' => array ( ), ), '_serviceId' => 'string_translator.custom_strings', )), ), ), 'sortedTranslators' => array ( 0 => Drupal\Core\StringTranslation\Translator\CustomStrings::__set_state(array( 'settings' => Drupal\Core\Site\Settings::__set_state(array( 'storage' => array ( 'hash_salt' => 'TZjFzdjTl8Fa7K3imkonbaN59X39XdvH3u4LA9jsj8BZhAPWGkn6uXTLJzF0K6e5ho3DjiI9Uw', 'update_free_access' => false, 'container_yamls' => array ( 0 => '/var/lib/drupaltestbot/sites/default/files/checkout/sites/simpletest/998086/services.yml', ), 'file_public_path' => 'sites/simpletest/998086/files', 'file_private_path' => 'sites/simpletest/998086/private', 'test_parent_site' => 'sites/default', 'apcu_ensure_unique_prefix' => false, 'install_profile' => 'testing', ), '_serviceId' => 'settings', )), 'translations' => array ( 'en' => array ( ), '' => array ( ), ), '_serviceId' => 'string_translator.custom_strings', )), ), 'defaultLangcode' => 'en', '_serviceId' => 'string_translation', )), 'arguments' => array ( ), )), 'uuid' => 'b96f1d08-977f-46a3-9600-ee2eed1e3984', 'vendor' => array ( 'name' => 'Drupal', 'version' => '8.0.0-dev', ), 'version' => '8.0.0-dev', ) is identical to value array ( 'couchdb' => 'Welcome', 'uuid' => 'b96f1d08-977f-46a3-9600-ee2eed1e3984', 'vendor' => array ( 'name' => 'Drupal', 'version' => '8.0.0-dev', ), 'version' => '8.0.0-dev', ).OtherRootResourceTest.php41Drupal\relaxed\Tests\RootResourceTest->testGet()
ExpandDrupal\relaxed\Tests\SessionResourceTest3010
MessageGroupFilenameLineFunctionStatus
Correct values in response. Value array ( 'info' => array ( ), 'ok' => true, 'userCtx' => array ( 'user' => 'test_user', 'roles' => array ( 0 => 'authenticated', 1 => 'gcqffdld', ), ), ) is identical to value array ( 'info' => array ( ), 'ok' => true, 'userCtx' => array ( 'user' => 'test_admin_user', 'roles' => array ( 0 => 'authenticated', 1 => 'dhteo2x3', 2 => '_admin', ), ), ).OtherSessionResourceTest.php75Drupal\relaxed\Tests\SessionResourceTest->testGet()