1118430-32-new_localize_ui.patch

Test status
StatusResult
Last receivedMon, 09/28/2015 - 11:40:01
Last requestedMon, 09/28/2015 - 11:40:02
Last testedMon, 09/28/2015 - 11:42:36
Test count2
Environment status
MySQLfail
File information
File1118430-32-new_localize_ui.patch
BranchLocalization server - 7.x-1.x
LinkIssue Link
SummaryFAILED: [[SimpleTest]]: [MySQL] 301 pass(es), 332 fail(s), and 114 exception(s).
Details

MySQL

  1. Setup environment
  2. Detect an invalid patch URL
  3. Detect invalid repository information
  4. Detect invalid patch format
  5. Detect a non-applicable patch
  6. Detect invalid PHP syntax
  7. Detect a Drupal installation failure
  8. Detect a test run failure
  9. Detect a failing test
    Review the test failures below then if necessary run them locally until the problem has been fixed.
  10. Complete test suite with all tests passing
301 pass(es), 332 fail(s), and 114 exception(s)

Non-pass

Test namePassFailException
ExpandLocalization server (L10nServerTestCase) [Localization server]301332114
MessageGroupFilenameLineFunctionStatus
Enabled modules: locale, l10n_pconfig, potx, l10n_server, l10n_community, l10n_drupalOtherl10n_community.test27L10nServerTestCase->setUp()
Invalid permission access localization community.Rolel10n_community.test31L10nServerTestCase->setUp()
Invalid permission browse translations.Rolel10n_community.test31L10nServerTestCase->setUp()
Invalid permission access localization community.Rolel10n_community.test32L10nServerTestCase->setUp()
Invalid permission browse translations.Rolel10n_community.test32L10nServerTestCase->setUp()
Invalid permission submit suggestions.Rolel10n_community.test32L10nServerTestCase->setUp()
Invalid permission import gettext files.Rolel10n_community.test32L10nServerTestCase->setUp()
Invalid permission access localization community.Rolel10n_community.test33L10nServerTestCase->setUp()
Invalid permission browse translations.Rolel10n_community.test33L10nServerTestCase->setUp()
Invalid permission submit suggestions.Rolel10n_community.test33L10nServerTestCase->setUp()
Invalid permission import gettext files.Rolel10n_community.test33L10nServerTestCase->setUp()
Invalid permission access localization community.Rolel10n_community.test34L10nServerTestCase->setUp()
Invalid permission browse translations.Rolel10n_community.test34L10nServerTestCase->setUp()
Invalid permission moderate own suggestions.Rolel10n_community.test34L10nServerTestCase->setUp()
Invalid permission moderate suggestions from others.Rolel10n_community.test34L10nServerTestCase->setUp()
Invalid permission import gettext files.Rolel10n_community.test34L10nServerTestCase->setUp()
Invalid permission submit suggestions.Rolel10n_community.test34L10nServerTestCase->setUp()
Invalid permission administer languages.Rolel10n_community.test35L10nServerTestCase->setUp()
Invalid permission administer localization server.Rolel10n_community.test35L10nServerTestCase->setUp()
Invalid permission import gettext files.Rolel10n_community.test35L10nServerTestCase->setUp()
Argument 1 passed to DrupalWebTestCase::drupalLogin() must be an instance of stdClass, boolean given, called in /var/lib/drupaltestbot/sites/default/files/checkout/sites/default/modules/l10n_server/l10n_community/tests/l10n_community.test on line 50 and definedRecoverable errordrupal_web_test_case.php1252DrupalWebTestCase->drupalLogin()
Trying to get property of non-objectNoticedrupal_web_test_case.php1258DrupalWebTestCase->drupalLogin()
Trying to get property of non-objectNoticedrupal_web_test_case.php1259DrupalWebTestCase->drupalLogin()
Failed to set field name to Otherl10n_community.test50L10nServerTestCase->setUp()
Failed to set field pass to Otherl10n_community.test50L10nServerTestCase->setUp()
Found the requested form fields at userOtherl10n_community.test50L10nServerTestCase->setUp()
Trying to get property of non-objectNoticedrupal_web_test_case.php1265DrupalWebTestCase->drupalLogin()
User successfully logged in.User loginl10n_community.test50L10nServerTestCase->setUp()
Failed to set field l10n_server_connector_l10n_drupal_files_directory to /var/lib/drupaltestbot/sites/default/files/checkout/sites/default/files/simpletest/257978/private/temp/l10n_community_testOtherl10n_community.test52L10nServerTestCase->setUp()
Found the Save configuration buttonOtherl10n_community.test52L10nServerTestCase->setUp()
Found the requested form fields at admin/l10n_server/connectors/config/l10n_drupal/filesOtherl10n_community.test52L10nServerTestCase->setUp()
Local package directory set.Otherl10n_community.test53L10nServerTestCase->setUp()
Failed to set field l10n_server_connector_l10n_drupal_files_enabled to 1Otherl10n_community.test57L10nServerTestCase->setUp()
Found the Save configuration buttonOtherl10n_community.test57L10nServerTestCase->setUp()
Found the requested form fields at admin/l10n_server/connectorsOtherl10n_community.test57L10nServerTestCase->setUp()
Drupal connector enabled.Otherl10n_community.test58L10nServerTestCase->setUp()
Failed to set field l10n_community_import_user to eiJN0zqGOtherl10n_community.test62L10nServerTestCase->setUp()
Found the Save configuration buttonOtherl10n_community.test62L10nServerTestCase->setUp()
Found the requested form fields at admin/l10n_server/l10n_communityOtherl10n_community.test62L10nServerTestCase->setUp()
Team user set.Otherl10n_community.test63L10nServerTestCase->setUp()
Argument 1 passed to DrupalWebTestCase::drupalLogin() must be an instance of stdClass, boolean given, called in /var/lib/drupaltestbot/sites/default/files/checkout/sites/default/modules/l10n_server/l10n_community/tests/l10n_community.test on line 82 and definedRecoverable errordrupal_web_test_case.php1252DrupalWebTestCase->drupalLogin()
Trying to get property of non-objectNoticedrupal_web_test_case.php1258DrupalWebTestCase->drupalLogin()
Trying to get property of non-objectNoticedrupal_web_test_case.php1259DrupalWebTestCase->drupalLogin()
Failed to set field name to Otherl10n_community.test82L10nServerTestCase->testWelcome()
Failed to set field pass to Otherl10n_community.test82L10nServerTestCase->testWelcome()
Found the requested form fields at userOtherl10n_community.test82L10nServerTestCase->testWelcome()
Trying to get property of non-objectNoticedrupal_web_test_case.php1265DrupalWebTestCase->drupalLogin()
User successfully logged in.User loginl10n_community.test82L10nServerTestCase->testWelcome()
Welcome screen visible to priviledged user.Otherl10n_community.test84L10nServerTestCase->testWelcome()
Enabled modules: locale, l10n_pconfig, potx, l10n_server, l10n_community, l10n_drupalOtherl10n_community.test27L10nServerTestCase->setUp()
Invalid permission access localization community.Rolel10n_community.test31L10nServerTestCase->setUp()
Invalid permission browse translations.Rolel10n_community.test31L10nServerTestCase->setUp()
Invalid permission access localization community.Rolel10n_community.test32L10nServerTestCase->setUp()
Invalid permission browse translations.Rolel10n_community.test32L10nServerTestCase->setUp()
Invalid permission submit suggestions.Rolel10n_community.test32L10nServerTestCase->setUp()
Invalid permission import gettext files.Rolel10n_community.test32L10nServerTestCase->setUp()
Invalid permission access localization community.Rolel10n_community.test33L10nServerTestCase->setUp()
Invalid permission browse translations.Rolel10n_community.test33L10nServerTestCase->setUp()
Invalid permission submit suggestions.Rolel10n_community.test33L10nServerTestCase->setUp()
Invalid permission import gettext files.Rolel10n_community.test33L10nServerTestCase->setUp()
Invalid permission access localization community.Rolel10n_community.test34L10nServerTestCase->setUp()
Invalid permission browse translations.Rolel10n_community.test34L10nServerTestCase->setUp()
Invalid permission moderate own suggestions.Rolel10n_community.test34L10nServerTestCase->setUp()
Invalid permission moderate suggestions from others.Rolel10n_community.test34L10nServerTestCase->setUp()
Invalid permission import gettext files.Rolel10n_community.test34L10nServerTestCase->setUp()
Invalid permission submit suggestions.Rolel10n_community.test34L10nServerTestCase->setUp()
Invalid permission administer languages.Rolel10n_community.test35L10nServerTestCase->setUp()
Invalid permission administer localization server.Rolel10n_community.test35L10nServerTestCase->setUp()
Invalid permission import gettext files.Rolel10n_community.test35L10nServerTestCase->setUp()
Argument 1 passed to DrupalWebTestCase::drupalLogin() must be an instance of stdClass, boolean given, called in /var/lib/drupaltestbot/sites/default/files/checkout/sites/default/modules/l10n_server/l10n_community/tests/l10n_community.test on line 50 and definedRecoverable errordrupal_web_test_case.php1252DrupalWebTestCase->drupalLogin()
Trying to get property of non-objectNoticedrupal_web_test_case.php1258DrupalWebTestCase->drupalLogin()
Trying to get property of non-objectNoticedrupal_web_test_case.php1259DrupalWebTestCase->drupalLogin()
Failed to set field name to Otherl10n_community.test50L10nServerTestCase->setUp()
Failed to set field pass to Otherl10n_community.test50L10nServerTestCase->setUp()
Found the requested form fields at userOtherl10n_community.test50L10nServerTestCase->setUp()
Trying to get property of non-objectNoticedrupal_web_test_case.php1265DrupalWebTestCase->drupalLogin()
User successfully logged in.User loginl10n_community.test50L10nServerTestCase->setUp()
Failed to set field l10n_server_connector_l10n_drupal_files_directory to /var/lib/drupaltestbot/sites/default/files/checkout/sites/default/files/simpletest/439462/private/temp/l10n_community_testOtherl10n_community.test52L10nServerTestCase->setUp()
Found the Save configuration buttonOtherl10n_community.test52L10nServerTestCase->setUp()
Found the requested form fields at admin/l10n_server/connectors/config/l10n_drupal/filesOtherl10n_community.test52L10nServerTestCase->setUp()
Local package directory set.Otherl10n_community.test53L10nServerTestCase->setUp()
Failed to set field l10n_server_connector_l10n_drupal_files_enabled to 1Otherl10n_community.test57L10nServerTestCase->setUp()
Found the Save configuration buttonOtherl10n_community.test57L10nServerTestCase->setUp()
Found the requested form fields at admin/l10n_server/connectorsOtherl10n_community.test57L10nServerTestCase->setUp()
Drupal connector enabled.Otherl10n_community.test58L10nServerTestCase->setUp()
Failed to set field l10n_community_import_user to ssiohSaSOtherl10n_community.test62L10nServerTestCase->setUp()
Found the Save configuration buttonOtherl10n_community.test62L10nServerTestCase->setUp()
Found the requested form fields at admin/l10n_server/l10n_communityOtherl10n_community.test62L10nServerTestCase->setUp()
Team user set.Otherl10n_community.test63L10nServerTestCase->setUp()
Argument 1 passed to DrupalWebTestCase::drupalLogin() must be an instance of stdClass, boolean given, called in /var/lib/drupaltestbot/sites/default/files/checkout/sites/default/modules/l10n_server/l10n_community/tests/l10n_community.test on line 93 and definedRecoverable errordrupal_web_test_case.php1252DrupalWebTestCase->drupalLogin()
Trying to get property of non-objectNoticedrupal_web_test_case.php1258DrupalWebTestCase->drupalLogin()
Trying to get property of non-objectNoticedrupal_web_test_case.php1259DrupalWebTestCase->drupalLogin()
Failed to set field name to Otherl10n_community.test93L10nServerTestCase->testLanguagesProjects()
Failed to set field pass to Otherl10n_community.test93L10nServerTestCase->testLanguagesProjects()
Found the requested form fields at userOtherl10n_community.test93L10nServerTestCase->testLanguagesProjects()
Trying to get property of non-objectNoticedrupal_web_test_case.php1265DrupalWebTestCase->drupalLogin()
User successfully logged in.User loginl10n_community.test93L10nServerTestCase->testLanguagesProjects()
Language list empty on start.Otherl10n_community.test95L10nServerTestCase->testLanguagesProjects()
Argument 1 passed to DrupalWebTestCase::drupalLogin() must be an instance of stdClass, boolean given, called in /var/lib/drupaltestbot/sites/default/files/checkout/sites/default/modules/l10n_server/l10n_community/tests/l10n_community.test on line 753 and definedRecoverable errordrupal_web_test_case.php1252DrupalWebTestCase->drupalLogin()
Trying to get property of non-objectNoticedrupal_web_test_case.php1258DrupalWebTestCase->drupalLogin()
Trying to get property of non-objectNoticedrupal_web_test_case.php1259DrupalWebTestCase->drupalLogin()
Failed to set field name to Otherl10n_community.test753L10nServerTestCase->addLanguage()
Failed to set field pass to Otherl10n_community.test753L10nServerTestCase->addLanguage()
Found the requested form fields at userOtherl10n_community.test753L10nServerTestCase->addLanguage()
Trying to get property of non-objectNoticedrupal_web_test_case.php1265DrupalWebTestCase->drupalLogin()
User successfully logged in.User loginl10n_community.test753L10nServerTestCase->addLanguage()
Failed to set field langcode to huOtherl10n_community.test755L10nServerTestCase->addLanguage()
Found the Add language buttonOtherl10n_community.test755L10nServerTestCase->addLanguage()
Found the requested form fields at admin/config/regional/language/addOtherl10n_community.test755L10nServerTestCase->addLanguage()
Hungarian language added to system.Otherl10n_community.test756L10nServerTestCase->addLanguage()
Hungarian language added to system.Otherl10n_community.test757L10nServerTestCase->addLanguage()
Argument 1 passed to DrupalWebTestCase::drupalLogin() must be an instance of stdClass, boolean given, called in /var/lib/drupaltestbot/sites/default/files/checkout/sites/default/modules/l10n_server/l10n_community/tests/l10n_community.test on line 102 and definedRecoverable errordrupal_web_test_case.php1252DrupalWebTestCase->drupalLogin()
Trying to get property of non-objectNoticedrupal_web_test_case.php1258DrupalWebTestCase->drupalLogin()
Trying to get property of non-objectNoticedrupal_web_test_case.php1259DrupalWebTestCase->drupalLogin()
Failed to set field name to Otherl10n_community.test102L10nServerTestCase->testLanguagesProjects()
Failed to set field pass to Otherl10n_community.test102L10nServerTestCase->testLanguagesProjects()
Found the requested form fields at userOtherl10n_community.test102L10nServerTestCase->testLanguagesProjects()
Trying to get property of non-objectNoticedrupal_web_test_case.php1265DrupalWebTestCase->drupalLogin()
User successfully logged in.User loginl10n_community.test102L10nServerTestCase->testLanguagesProjects()
Language now recognized, but still no strings to translate.Otherl10n_community.test104L10nServerTestCase->testLanguagesProjects()
Argument 1 passed to DrupalWebTestCase::drupalLogin() must be an instance of stdClass, boolean given, called in /var/lib/drupaltestbot/sites/default/files/checkout/sites/default/modules/l10n_server/l10n_community/tests/l10n_community.test on line 807 and definedRecoverable errordrupal_web_test_case.php1252DrupalWebTestCase->drupalLogin()
Trying to get property of non-objectNoticedrupal_web_test_case.php1258DrupalWebTestCase->drupalLogin()
Trying to get property of non-objectNoticedrupal_web_test_case.php1259DrupalWebTestCase->drupalLogin()
Failed to set field name to Otherl10n_community.test807L10nServerTestCase->addProject()
Failed to set field pass to Otherl10n_community.test807L10nServerTestCase->addProject()
Found the requested form fields at userOtherl10n_community.test807L10nServerTestCase->addProject()
Trying to get property of non-objectNoticedrupal_web_test_case.php1265DrupalWebTestCase->drupalLogin()
User successfully logged in.User loginl10n_community.test807L10nServerTestCase->addProject()
Raw "l10n_testlafH0n_5-5.x-5.7.tar.gz (2 files, 19 strings) scanned." foundOtherl10n_community.test823L10nServerTestCase->addProject()
Argument 1 passed to DrupalWebTestCase::drupalLogin() must be an instance of stdClass, boolean given, called in /var/lib/drupaltestbot/sites/default/files/checkout/sites/default/modules/l10n_server/l10n_community/tests/l10n_community.test on line 807 and definedRecoverable errordrupal_web_test_case.php1252DrupalWebTestCase->drupalLogin()
Trying to get property of non-objectNoticedrupal_web_test_case.php1258DrupalWebTestCase->drupalLogin()
Trying to get property of non-objectNoticedrupal_web_test_case.php1259DrupalWebTestCase->drupalLogin()
Failed to set field name to Otherl10n_community.test807L10nServerTestCase->addProject()
Failed to set field pass to Otherl10n_community.test807L10nServerTestCase->addProject()
Found the requested form fields at userOtherl10n_community.test807L10nServerTestCase->addProject()
Trying to get property of non-objectNoticedrupal_web_test_case.php1265DrupalWebTestCase->drupalLogin()
User successfully logged in.User loginl10n_community.test807L10nServerTestCase->addProject()
Raw "l10n_test5fI7Hx_6-6.x-5.7.tar.gz (3 files, 33 strings) scanned." foundOtherl10n_community.test823L10nServerTestCase->addProject()
Argument 1 passed to DrupalWebTestCase::drupalLogin() must be an instance of stdClass, boolean given, called in /var/lib/drupaltestbot/sites/default/files/checkout/sites/default/modules/l10n_server/l10n_community/tests/l10n_community.test on line 807 and definedRecoverable errordrupal_web_test_case.php1252DrupalWebTestCase->drupalLogin()
Trying to get property of non-objectNoticedrupal_web_test_case.php1258DrupalWebTestCase->drupalLogin()
Trying to get property of non-objectNoticedrupal_web_test_case.php1259DrupalWebTestCase->drupalLogin()
Failed to set field name to Otherl10n_community.test807L10nServerTestCase->addProject()
Failed to set field pass to Otherl10n_community.test807L10nServerTestCase->addProject()
Found the requested form fields at userOtherl10n_community.test807L10nServerTestCase->addProject()
Trying to get property of non-objectNoticedrupal_web_test_case.php1265DrupalWebTestCase->drupalLogin()
User successfully logged in.User loginl10n_community.test807L10nServerTestCase->addProject()
Raw "l10n_test5fI7Hx_6-6.x-3.5.tar.gz (2 files, 25 strings) scanned." foundOtherl10n_community.test823L10nServerTestCase->addProject()
Argument 1 passed to DrupalWebTestCase::drupalLogin() must be an instance of stdClass, boolean given, called in /var/lib/drupaltestbot/sites/default/files/checkout/sites/default/modules/l10n_server/l10n_community/tests/l10n_community.test on line 807 and definedRecoverable errordrupal_web_test_case.php1252DrupalWebTestCase->drupalLogin()
Trying to get property of non-objectNoticedrupal_web_test_case.php1258DrupalWebTestCase->drupalLogin()
Trying to get property of non-objectNoticedrupal_web_test_case.php1259DrupalWebTestCase->drupalLogin()
Failed to set field name to Otherl10n_community.test807L10nServerTestCase->addProject()
Failed to set field pass to Otherl10n_community.test807L10nServerTestCase->addProject()
Found the requested form fields at userOtherl10n_community.test807L10nServerTestCase->addProject()
Trying to get property of non-objectNoticedrupal_web_test_case.php1265DrupalWebTestCase->drupalLogin()
User successfully logged in.User loginl10n_community.test807L10nServerTestCase->addProject()
Raw "l10n_testpW6wSI_7-7.x-5.7.tar.gz (3 files, 31 strings) scanned." foundOtherl10n_community.test823L10nServerTestCase->addProject()
Argument 1 passed to DrupalWebTestCase::drupalLogin() must be an instance of stdClass, boolean given, called in /var/lib/drupaltestbot/sites/default/files/checkout/sites/default/modules/l10n_server/l10n_community/tests/l10n_community.test on line 113 and definedRecoverable errordrupal_web_test_case.php1252DrupalWebTestCase->drupalLogin()
Trying to get property of non-objectNoticedrupal_web_test_case.php1258DrupalWebTestCase->drupalLogin()
Trying to get property of non-objectNoticedrupal_web_test_case.php1259DrupalWebTestCase->drupalLogin()
Failed to set field name to Otherl10n_community.test113L10nServerTestCase->testLanguagesProjects()
Failed to set field pass to Otherl10n_community.test113L10nServerTestCase->testLanguagesProjects()
Found the requested form fields at userOtherl10n_community.test113L10nServerTestCase->testLanguagesProjects()
Trying to get property of non-objectNoticedrupal_web_test_case.php1265DrupalWebTestCase->drupalLogin()
User successfully logged in.User loginl10n_community.test113L10nServerTestCase->testLanguagesProjects()
With projects in place, language list is visible.Otherl10n_community.test115L10nServerTestCase->testLanguagesProjects()
l10n_testlafH0n_5 name is shown on project page.Otherl10n_community.test120L10nServerTestCase->testLanguagesProjects()
l10n_test5fI7Hx_6 name is shown on project page.Otherl10n_community.test120L10nServerTestCase->testLanguagesProjects()
l10n_testpW6wSI_7 name is shown on project page.Otherl10n_community.test120L10nServerTestCase->testLanguagesProjects()
Language shows up on project page.Otherl10n_community.test125L10nServerTestCase->testLanguagesProjects()
One release known on project.Otherl10n_community.test131L10nServerTestCase->testLanguagesProjects()
One release parsed on project.Otherl10n_community.test132L10nServerTestCase->testLanguagesProjects()
Language shows up on project page.Otherl10n_community.test125L10nServerTestCase->testLanguagesProjects()
Two releases known on project.Otherl10n_community.test127L10nServerTestCase->testLanguagesProjects()
Two releases parsed on project.Otherl10n_community.test128L10nServerTestCase->testLanguagesProjects()
Language shows up on project page.Otherl10n_community.test125L10nServerTestCase->testLanguagesProjects()
One release known on project.Otherl10n_community.test131L10nServerTestCase->testLanguagesProjects()
One release parsed on project.Otherl10n_community.test132L10nServerTestCase->testLanguagesProjects()
String "This is a test string." foundOtherl10n_community.test140L10nServerTestCase->testLanguagesProjects()
String "Test menu item in 5" foundOtherl10n_community.test141L10nServerTestCase->testLanguagesProjects()
String "test potx permission" foundOtherl10n_community.test142L10nServerTestCase->testLanguagesProjects()
Singular/plural string "1 test string/@count test strings" foundOtherl10n_community.test143L10nServerTestCase->testLanguagesProjects()
Singular/plural string "1 test string in JS/@count test strings in JS" foundOtherl10n_community.test144L10nServerTestCase->testLanguagesProjects()
String "Test string in context" found in context "Test context"Otherl10n_community.test145L10nServerTestCase->testLanguagesProjects()
"<td class="source"" found 39 timesOtherl10n_community.test146L10nServerTestCase->testLanguagesProjects()
String "This is a test string." foundOtherl10n_community.test151L10nServerTestCase->testLanguagesProjects()
String "Test menu item in 5" foundOtherl10n_community.test152L10nServerTestCase->testLanguagesProjects()
String "test potx permission" foundOtherl10n_community.test153L10nServerTestCase->testLanguagesProjects()
Singular/plural string "1 test string/@count test strings" foundOtherl10n_community.test154L10nServerTestCase->testLanguagesProjects()
"<td class="source"" found 19 timesOtherl10n_community.test157L10nServerTestCase->testLanguagesProjects()
String "This is a test string." foundOtherl10n_community.test162L10nServerTestCase->testLanguagesProjects()
String "test potx permission" foundOtherl10n_community.test164L10nServerTestCase->testLanguagesProjects()
Singular/plural string "1 test string/@count test strings" foundOtherl10n_community.test165L10nServerTestCase->testLanguagesProjects()
Singular/plural string "1 test string in JS/@count test strings in JS" foundOtherl10n_community.test166L10nServerTestCase->testLanguagesProjects()
"<td class="source"" found 33 timesOtherl10n_community.test168L10nServerTestCase->testLanguagesProjects()
String "This is a test string." foundOtherl10n_community.test173L10nServerTestCase->testLanguagesProjects()
Singular/plural string "1 test string/@count test strings" foundOtherl10n_community.test176L10nServerTestCase->testLanguagesProjects()
Singular/plural string "1 test string in JS/@count test strings in JS" foundOtherl10n_community.test177L10nServerTestCase->testLanguagesProjects()
String "Test string in context" found in context "Test context"Otherl10n_community.test178L10nServerTestCase->testLanguagesProjects()
"<td class="source"" found 31 timesOtherl10n_community.test179L10nServerTestCase->testLanguagesProjects()
PDOException: SQLSTATE[42S02]: Base table or view not found: 1146 Table 'drupaltestbotmysql.simpletest439462l10n_server_project' doesn't exist: SELECT r.rid AS rid FROM {l10n_server_project} p LEFT OUTER JOIN {l10n_server_release} r ON p.pid = r.pid WHERE (p.uri = :db_condition_placeholder_0) AND (r.title = :db_condition_placeholder_1) ; Array ( [:db_condition_placeholder_0] => l10n_test5fI7Hx_6 [:db_condition_placeholder_1] => 6.x-3.5 ) in L10nServerTestCase->testLanguagesProjects() (line 190 of /var/lib/drupaltestbot/sites/default/files/checkout/sites/default/modules/l10n_server/l10n_community/tests/l10n_community.test).Uncaught exceptiondatabase.inc2171PDOStatement->execute()
Enabled modules: locale, l10n_pconfig, potx, l10n_server, l10n_community, l10n_drupalOtherl10n_community.test27L10nServerTestCase->setUp()
Invalid permission access localization community.Rolel10n_community.test31L10nServerTestCase->setUp()
Invalid permission browse translations.Rolel10n_community.test31L10nServerTestCase->setUp()
Invalid permission access localization community.Rolel10n_community.test32L10nServerTestCase->setUp()
Invalid permission browse translations.Rolel10n_community.test32L10nServerTestCase->setUp()
Invalid permission submit suggestions.Rolel10n_community.test32L10nServerTestCase->setUp()
Invalid permission import gettext files.Rolel10n_community.test32L10nServerTestCase->setUp()
Invalid permission access localization community.Rolel10n_community.test33L10nServerTestCase->setUp()
Invalid permission browse translations.Rolel10n_community.test33L10nServerTestCase->setUp()
Invalid permission submit suggestions.Rolel10n_community.test33L10nServerTestCase->setUp()
Invalid permission import gettext files.Rolel10n_community.test33L10nServerTestCase->setUp()
Invalid permission access localization community.Rolel10n_community.test34L10nServerTestCase->setUp()
Invalid permission browse translations.Rolel10n_community.test34L10nServerTestCase->setUp()
Invalid permission moderate own suggestions.Rolel10n_community.test34L10nServerTestCase->setUp()
Invalid permission moderate suggestions from others.Rolel10n_community.test34L10nServerTestCase->setUp()
Invalid permission import gettext files.Rolel10n_community.test34L10nServerTestCase->setUp()
Invalid permission submit suggestions.Rolel10n_community.test34L10nServerTestCase->setUp()
Invalid permission administer languages.Rolel10n_community.test35L10nServerTestCase->setUp()
Invalid permission administer localization server.Rolel10n_community.test35L10nServerTestCase->setUp()
Invalid permission import gettext files.Rolel10n_community.test35L10nServerTestCase->setUp()
Argument 1 passed to DrupalWebTestCase::drupalLogin() must be an instance of stdClass, boolean given, called in /var/lib/drupaltestbot/sites/default/files/checkout/sites/default/modules/l10n_server/l10n_community/tests/l10n_community.test on line 50 and definedRecoverable errordrupal_web_test_case.php1252DrupalWebTestCase->drupalLogin()
Trying to get property of non-objectNoticedrupal_web_test_case.php1258DrupalWebTestCase->drupalLogin()
Trying to get property of non-objectNoticedrupal_web_test_case.php1259DrupalWebTestCase->drupalLogin()
Failed to set field name to Otherl10n_community.test50L10nServerTestCase->setUp()
Failed to set field pass to Otherl10n_community.test50L10nServerTestCase->setUp()
Found the requested form fields at userOtherl10n_community.test50L10nServerTestCase->setUp()
Trying to get property of non-objectNoticedrupal_web_test_case.php1265DrupalWebTestCase->drupalLogin()
User successfully logged in.User loginl10n_community.test50L10nServerTestCase->setUp()
Failed to set field l10n_server_connector_l10n_drupal_files_directory to /var/lib/drupaltestbot/sites/default/files/checkout/sites/default/files/simpletest/644286/private/temp/l10n_community_testOtherl10n_community.test52L10nServerTestCase->setUp()
Found the Save configuration buttonOtherl10n_community.test52L10nServerTestCase->setUp()
Found the requested form fields at admin/l10n_server/connectors/config/l10n_drupal/filesOtherl10n_community.test52L10nServerTestCase->setUp()
Local package directory set.Otherl10n_community.test53L10nServerTestCase->setUp()
Failed to set field l10n_server_connector_l10n_drupal_files_enabled to 1Otherl10n_community.test57L10nServerTestCase->setUp()
Found the Save configuration buttonOtherl10n_community.test57L10nServerTestCase->setUp()
Found the requested form fields at admin/l10n_server/connectorsOtherl10n_community.test57L10nServerTestCase->setUp()
Drupal connector enabled.Otherl10n_community.test58L10nServerTestCase->setUp()
Failed to set field l10n_community_import_user to eSLTf9rFOtherl10n_community.test62L10nServerTestCase->setUp()
Found the Save configuration buttonOtherl10n_community.test62L10nServerTestCase->setUp()
Found the requested form fields at admin/l10n_server/l10n_communityOtherl10n_community.test62L10nServerTestCase->setUp()
Team user set.Otherl10n_community.test63L10nServerTestCase->setUp()
Argument 1 passed to DrupalWebTestCase::drupalLogin() must be an instance of stdClass, boolean given, called in /var/lib/drupaltestbot/sites/default/files/checkout/sites/default/modules/l10n_server/l10n_community/tests/l10n_community.test on line 753 and definedRecoverable errordrupal_web_test_case.php1252DrupalWebTestCase->drupalLogin()
Trying to get property of non-objectNoticedrupal_web_test_case.php1258DrupalWebTestCase->drupalLogin()
Trying to get property of non-objectNoticedrupal_web_test_case.php1259DrupalWebTestCase->drupalLogin()
Failed to set field name to Otherl10n_community.test753L10nServerTestCase->addLanguage()
Failed to set field pass to Otherl10n_community.test753L10nServerTestCase->addLanguage()
Found the requested form fields at userOtherl10n_community.test753L10nServerTestCase->addLanguage()
Trying to get property of non-objectNoticedrupal_web_test_case.php1265DrupalWebTestCase->drupalLogin()
User successfully logged in.User loginl10n_community.test753L10nServerTestCase->addLanguage()
Failed to set field langcode to huOtherl10n_community.test755L10nServerTestCase->addLanguage()
Found the Add language buttonOtherl10n_community.test755L10nServerTestCase->addLanguage()
Found the requested form fields at admin/config/regional/language/addOtherl10n_community.test755L10nServerTestCase->addLanguage()
Hungarian language added to system.Otherl10n_community.test756L10nServerTestCase->addLanguage()
Hungarian language added to system.Otherl10n_community.test757L10nServerTestCase->addLanguage()
Argument 1 passed to DrupalWebTestCase::drupalLogin() must be an instance of stdClass, boolean given, called in /var/lib/drupaltestbot/sites/default/files/checkout/sites/default/modules/l10n_server/l10n_community/tests/l10n_community.test on line 807 and definedRecoverable errordrupal_web_test_case.php1252DrupalWebTestCase->drupalLogin()
Trying to get property of non-objectNoticedrupal_web_test_case.php1258DrupalWebTestCase->drupalLogin()
Trying to get property of non-objectNoticedrupal_web_test_case.php1259DrupalWebTestCase->drupalLogin()
Failed to set field name to Otherl10n_community.test807L10nServerTestCase->addProject()
Failed to set field pass to Otherl10n_community.test807L10nServerTestCase->addProject()
Found the requested form fields at userOtherl10n_community.test807L10nServerTestCase->addProject()
Trying to get property of non-objectNoticedrupal_web_test_case.php1265DrupalWebTestCase->drupalLogin()
User successfully logged in.User loginl10n_community.test807L10nServerTestCase->addProject()
Raw "l10n_testhKjuO9_5-5.x-5.7.tar.gz (2 files, 19 strings) scanned." foundOtherl10n_community.test823L10nServerTestCase->addProject()
Argument 1 passed to DrupalWebTestCase::drupalLogin() must be an instance of stdClass, boolean given, called in /var/lib/drupaltestbot/sites/default/files/checkout/sites/default/modules/l10n_server/l10n_community/tests/l10n_community.test on line 807 and definedRecoverable errordrupal_web_test_case.php1252DrupalWebTestCase->drupalLogin()
Trying to get property of non-objectNoticedrupal_web_test_case.php1258DrupalWebTestCase->drupalLogin()
Trying to get property of non-objectNoticedrupal_web_test_case.php1259DrupalWebTestCase->drupalLogin()
Failed to set field name to Otherl10n_community.test807L10nServerTestCase->addProject()
Failed to set field pass to Otherl10n_community.test807L10nServerTestCase->addProject()
Found the requested form fields at userOtherl10n_community.test807L10nServerTestCase->addProject()
Trying to get property of non-objectNoticedrupal_web_test_case.php1265DrupalWebTestCase->drupalLogin()
User successfully logged in.User loginl10n_community.test807L10nServerTestCase->addProject()
Raw "l10n_testWHCUtB_6-6.x-5.7.tar.gz (3 files, 33 strings) scanned." foundOtherl10n_community.test823L10nServerTestCase->addProject()
Argument 1 passed to DrupalWebTestCase::drupalLogin() must be an instance of stdClass, boolean given, called in /var/lib/drupaltestbot/sites/default/files/checkout/sites/default/modules/l10n_server/l10n_community/tests/l10n_community.test on line 807 and definedRecoverable errordrupal_web_test_case.php1252DrupalWebTestCase->drupalLogin()
Trying to get property of non-objectNoticedrupal_web_test_case.php1258DrupalWebTestCase->drupalLogin()
Trying to get property of non-objectNoticedrupal_web_test_case.php1259DrupalWebTestCase->drupalLogin()
Failed to set field name to Otherl10n_community.test807L10nServerTestCase->addProject()
Failed to set field pass to Otherl10n_community.test807L10nServerTestCase->addProject()
Found the requested form fields at userOtherl10n_community.test807L10nServerTestCase->addProject()
Trying to get property of non-objectNoticedrupal_web_test_case.php1265DrupalWebTestCase->drupalLogin()
User successfully logged in.User loginl10n_community.test807L10nServerTestCase->addProject()
Raw "l10n_testWHCUtB_6-6.x-3.5.tar.gz (2 files, 25 strings) scanned." foundOtherl10n_community.test823L10nServerTestCase->addProject()
Argument 1 passed to DrupalWebTestCase::drupalLogin() must be an instance of stdClass, boolean given, called in /var/lib/drupaltestbot/sites/default/files/checkout/sites/default/modules/l10n_server/l10n_community/tests/l10n_community.test on line 807 and definedRecoverable errordrupal_web_test_case.php1252DrupalWebTestCase->drupalLogin()
Trying to get property of non-objectNoticedrupal_web_test_case.php1258DrupalWebTestCase->drupalLogin()
Trying to get property of non-objectNoticedrupal_web_test_case.php1259DrupalWebTestCase->drupalLogin()
Failed to set field name to Otherl10n_community.test807L10nServerTestCase->addProject()
Failed to set field pass to Otherl10n_community.test807L10nServerTestCase->addProject()
Found the requested form fields at userOtherl10n_community.test807L10nServerTestCase->addProject()
Trying to get property of non-objectNoticedrupal_web_test_case.php1265DrupalWebTestCase->drupalLogin()
User successfully logged in.User loginl10n_community.test807L10nServerTestCase->addProject()
Raw "l10n_testlk3VC4_7-7.x-5.7.tar.gz (3 files, 31 strings) scanned." foundOtherl10n_community.test823L10nServerTestCase->addProject()
Argument 1 passed to DrupalWebTestCase::drupalLogin() must be an instance of stdClass, boolean given, called in /var/lib/drupaltestbot/sites/default/files/checkout/sites/default/modules/l10n_server/l10n_community/tests/l10n_community.test on line 323 and definedRecoverable errordrupal_web_test_case.php1252DrupalWebTestCase->drupalLogin()
Trying to get property of non-objectNoticedrupal_web_test_case.php1258DrupalWebTestCase->drupalLogin()
Trying to get property of non-objectNoticedrupal_web_test_case.php1259DrupalWebTestCase->drupalLogin()
Failed to set field name to Otherl10n_community.test323L10nServerTestCase->testSuggetions()
Failed to set field pass to Otherl10n_community.test323L10nServerTestCase->testSuggetions()
Found the requested form fields at userOtherl10n_community.test323L10nServerTestCase->testSuggetions()
Trying to get property of non-objectNoticedrupal_web_test_case.php1265DrupalWebTestCase->drupalLogin()
User successfully logged in.User loginl10n_community.test323L10nServerTestCase->testSuggetions()
String "This is a test string." foundOtherl10n_community.test325L10nServerTestCase->testSuggetions()
PDOException: SQLSTATE[42S02]: Base table or view not found: 1146 Table 'drupaltestbotmysql.simpletest644286l10n_server_string' doesn't exist: SELECT s.sid AS sid FROM {l10n_server_string} s WHERE (value = :db_condition_placeholder_0) ; Array ( [:db_condition_placeholder_0] => This is a test string. ) in L10nServerTestCase->testSuggetions() (line 334 of /var/lib/drupaltestbot/sites/default/files/checkout/sites/default/modules/l10n_server/l10n_community/tests/l10n_community.test).Uncaught exceptiondatabase.inc2171PDOStatement->execute()
Enabled modules: locale, l10n_pconfig, potx, l10n_server, l10n_community, l10n_drupalOtherl10n_community.test27L10nServerTestCase->setUp()
Invalid permission access localization community.Rolel10n_community.test31L10nServerTestCase->setUp()
Invalid permission browse translations.Rolel10n_community.test31L10nServerTestCase->setUp()
Invalid permission access localization community.Rolel10n_community.test32L10nServerTestCase->setUp()
Invalid permission browse translations.Rolel10n_community.test32L10nServerTestCase->setUp()
Invalid permission submit suggestions.Rolel10n_community.test32L10nServerTestCase->setUp()
Invalid permission import gettext files.Rolel10n_community.test32L10nServerTestCase->setUp()
Invalid permission access localization community.Rolel10n_community.test33L10nServerTestCase->setUp()
Invalid permission browse translations.Rolel10n_community.test33L10nServerTestCase->setUp()
Invalid permission submit suggestions.Rolel10n_community.test33L10nServerTestCase->setUp()
Invalid permission import gettext files.Rolel10n_community.test33L10nServerTestCase->setUp()
Invalid permission access localization community.Rolel10n_community.test34L10nServerTestCase->setUp()
Invalid permission browse translations.Rolel10n_community.test34L10nServerTestCase->setUp()
Invalid permission moderate own suggestions.Rolel10n_community.test34L10nServerTestCase->setUp()
Invalid permission moderate suggestions from others.Rolel10n_community.test34L10nServerTestCase->setUp()
Invalid permission import gettext files.Rolel10n_community.test34L10nServerTestCase->setUp()
Invalid permission submit suggestions.Rolel10n_community.test34L10nServerTestCase->setUp()
Invalid permission administer languages.Rolel10n_community.test35L10nServerTestCase->setUp()
Invalid permission administer localization server.Rolel10n_community.test35L10nServerTestCase->setUp()
Invalid permission import gettext files.Rolel10n_community.test35L10nServerTestCase->setUp()
Argument 1 passed to DrupalWebTestCase::drupalLogin() must be an instance of stdClass, boolean given, called in /var/lib/drupaltestbot/sites/default/files/checkout/sites/default/modules/l10n_server/l10n_community/tests/l10n_community.test on line 50 and definedRecoverable errordrupal_web_test_case.php1252DrupalWebTestCase->drupalLogin()
Trying to get property of non-objectNoticedrupal_web_test_case.php1258DrupalWebTestCase->drupalLogin()
Trying to get property of non-objectNoticedrupal_web_test_case.php1259DrupalWebTestCase->drupalLogin()
Failed to set field name to Otherl10n_community.test50L10nServerTestCase->setUp()
Failed to set field pass to Otherl10n_community.test50L10nServerTestCase->setUp()
Found the requested form fields at userOtherl10n_community.test50L10nServerTestCase->setUp()
Trying to get property of non-objectNoticedrupal_web_test_case.php1265DrupalWebTestCase->drupalLogin()
User successfully logged in.User loginl10n_community.test50L10nServerTestCase->setUp()
Failed to set field l10n_server_connector_l10n_drupal_files_directory to /var/lib/drupaltestbot/sites/default/files/checkout/sites/default/files/simpletest/799200/private/temp/l10n_community_testOtherl10n_community.test52L10nServerTestCase->setUp()
Found the Save configuration buttonOtherl10n_community.test52L10nServerTestCase->setUp()
Found the requested form fields at admin/l10n_server/connectors/config/l10n_drupal/filesOtherl10n_community.test52L10nServerTestCase->setUp()
Local package directory set.Otherl10n_community.test53L10nServerTestCase->setUp()
Failed to set field l10n_server_connector_l10n_drupal_files_enabled to 1Otherl10n_community.test57L10nServerTestCase->setUp()
Found the Save configuration buttonOtherl10n_community.test57L10nServerTestCase->setUp()
Found the requested form fields at admin/l10n_server/connectorsOtherl10n_community.test57L10nServerTestCase->setUp()
Drupal connector enabled.Otherl10n_community.test58L10nServerTestCase->setUp()
Failed to set field l10n_community_import_user to hGMlryAeOtherl10n_community.test62L10nServerTestCase->setUp()
Found the Save configuration buttonOtherl10n_community.test62L10nServerTestCase->setUp()
Found the requested form fields at admin/l10n_server/l10n_communityOtherl10n_community.test62L10nServerTestCase->setUp()
Team user set.Otherl10n_community.test63L10nServerTestCase->setUp()
Argument 1 passed to DrupalWebTestCase::drupalLogin() must be an instance of stdClass, boolean given, called in /var/lib/drupaltestbot/sites/default/files/checkout/sites/default/modules/l10n_server/l10n_community/tests/l10n_community.test on line 753 and definedRecoverable errordrupal_web_test_case.php1252DrupalWebTestCase->drupalLogin()
Trying to get property of non-objectNoticedrupal_web_test_case.php1258DrupalWebTestCase->drupalLogin()
Trying to get property of non-objectNoticedrupal_web_test_case.php1259DrupalWebTestCase->drupalLogin()
Failed to set field name to Otherl10n_community.test753L10nServerTestCase->addLanguage()
Failed to set field pass to Otherl10n_community.test753L10nServerTestCase->addLanguage()
Found the requested form fields at userOtherl10n_community.test753L10nServerTestCase->addLanguage()
Trying to get property of non-objectNoticedrupal_web_test_case.php1265DrupalWebTestCase->drupalLogin()
User successfully logged in.User loginl10n_community.test753L10nServerTestCase->addLanguage()
Failed to set field langcode to huOtherl10n_community.test755L10nServerTestCase->addLanguage()
Found the Add language buttonOtherl10n_community.test755L10nServerTestCase->addLanguage()
Found the requested form fields at admin/config/regional/language/addOtherl10n_community.test755L10nServerTestCase->addLanguage()
Hungarian language added to system.Otherl10n_community.test756L10nServerTestCase->addLanguage()
Hungarian language added to system.Otherl10n_community.test757L10nServerTestCase->addLanguage()
Argument 1 passed to DrupalWebTestCase::drupalLogin() must be an instance of stdClass, boolean given, called in /var/lib/drupaltestbot/sites/default/files/checkout/sites/default/modules/l10n_server/l10n_community/tests/l10n_community.test on line 807 and definedRecoverable errordrupal_web_test_case.php1252DrupalWebTestCase->drupalLogin()
Trying to get property of non-objectNoticedrupal_web_test_case.php1258DrupalWebTestCase->drupalLogin()
Trying to get property of non-objectNoticedrupal_web_test_case.php1259DrupalWebTestCase->drupalLogin()
Failed to set field name to Otherl10n_community.test807L10nServerTestCase->addProject()
Failed to set field pass to Otherl10n_community.test807L10nServerTestCase->addProject()
Found the requested form fields at userOtherl10n_community.test807L10nServerTestCase->addProject()
Trying to get property of non-objectNoticedrupal_web_test_case.php1265DrupalWebTestCase->drupalLogin()
User successfully logged in.User loginl10n_community.test807L10nServerTestCase->addProject()
Raw "l10n_testSCESgL_5-5.x-5.7.tar.gz (2 files, 19 strings) scanned." foundOtherl10n_community.test823L10nServerTestCase->addProject()
Argument 1 passed to DrupalWebTestCase::drupalLogin() must be an instance of stdClass, boolean given, called in /var/lib/drupaltestbot/sites/default/files/checkout/sites/default/modules/l10n_server/l10n_community/tests/l10n_community.test on line 807 and definedRecoverable errordrupal_web_test_case.php1252DrupalWebTestCase->drupalLogin()
Trying to get property of non-objectNoticedrupal_web_test_case.php1258DrupalWebTestCase->drupalLogin()
Trying to get property of non-objectNoticedrupal_web_test_case.php1259DrupalWebTestCase->drupalLogin()
Failed to set field name to Otherl10n_community.test807L10nServerTestCase->addProject()
Failed to set field pass to Otherl10n_community.test807L10nServerTestCase->addProject()
Found the requested form fields at userOtherl10n_community.test807L10nServerTestCase->addProject()
Trying to get property of non-objectNoticedrupal_web_test_case.php1265DrupalWebTestCase->drupalLogin()
User successfully logged in.User loginl10n_community.test807L10nServerTestCase->addProject()
Raw "l10n_testuWXmEs_6-6.x-5.7.tar.gz (3 files, 33 strings) scanned." foundOtherl10n_community.test823L10nServerTestCase->addProject()
Argument 1 passed to DrupalWebTestCase::drupalLogin() must be an instance of stdClass, boolean given, called in /var/lib/drupaltestbot/sites/default/files/checkout/sites/default/modules/l10n_server/l10n_community/tests/l10n_community.test on line 807 and definedRecoverable errordrupal_web_test_case.php1252DrupalWebTestCase->drupalLogin()
Trying to get property of non-objectNoticedrupal_web_test_case.php1258DrupalWebTestCase->drupalLogin()
Trying to get property of non-objectNoticedrupal_web_test_case.php1259DrupalWebTestCase->drupalLogin()
Failed to set field name to Otherl10n_community.test807L10nServerTestCase->addProject()
Failed to set field pass to Otherl10n_community.test807L10nServerTestCase->addProject()
Found the requested form fields at userOtherl10n_community.test807L10nServerTestCase->addProject()
Trying to get property of non-objectNoticedrupal_web_test_case.php1265DrupalWebTestCase->drupalLogin()
User successfully logged in.User loginl10n_community.test807L10nServerTestCase->addProject()
Raw "l10n_testuWXmEs_6-6.x-3.5.tar.gz (2 files, 25 strings) scanned." foundOtherl10n_community.test823L10nServerTestCase->addProject()
Argument 1 passed to DrupalWebTestCase::drupalLogin() must be an instance of stdClass, boolean given, called in /var/lib/drupaltestbot/sites/default/files/checkout/sites/default/modules/l10n_server/l10n_community/tests/l10n_community.test on line 807 and definedRecoverable errordrupal_web_test_case.php1252DrupalWebTestCase->drupalLogin()
Trying to get property of non-objectNoticedrupal_web_test_case.php1258DrupalWebTestCase->drupalLogin()
Trying to get property of non-objectNoticedrupal_web_test_case.php1259DrupalWebTestCase->drupalLogin()
Failed to set field name to Otherl10n_community.test807L10nServerTestCase->addProject()
Failed to set field pass to Otherl10n_community.test807L10nServerTestCase->addProject()
Found the requested form fields at userOtherl10n_community.test807L10nServerTestCase->addProject()
Trying to get property of non-objectNoticedrupal_web_test_case.php1265DrupalWebTestCase->drupalLogin()
User successfully logged in.User loginl10n_community.test807L10nServerTestCase->addProject()
Raw "l10n_testKlxcvb_7-7.x-5.7.tar.gz (3 files, 31 strings) scanned." foundOtherl10n_community.test823L10nServerTestCase->addProject()
Argument 1 passed to DrupalWebTestCase::drupalLogin() must be an instance of stdClass, boolean given, called in /var/lib/drupaltestbot/sites/default/files/checkout/sites/default/modules/l10n_server/l10n_community/tests/l10n_community.test on line 489 and definedRecoverable errordrupal_web_test_case.php1252DrupalWebTestCase->drupalLogin()
Trying to get property of non-objectNoticedrupal_web_test_case.php1258DrupalWebTestCase->drupalLogin()
Trying to get property of non-objectNoticedrupal_web_test_case.php1259DrupalWebTestCase->drupalLogin()
Failed to set field name to Otherl10n_community.test489L10nServerTestCase->testImport()
Failed to set field pass to Otherl10n_community.test489L10nServerTestCase->testImport()
Found the requested form fields at userOtherl10n_community.test489L10nServerTestCase->testImport()
Trying to get property of non-objectNoticedrupal_web_test_case.php1265DrupalWebTestCase->drupalLogin()
User successfully logged in.User loginl10n_community.test489L10nServerTestCase->testImport()
Raw "Access denied" foundOtherl10n_community.test491L10nServerTestCase->testImport()
Argument 1 passed to DrupalWebTestCase::drupalLogin() must be an instance of stdClass, boolean given, called in /var/lib/drupaltestbot/sites/default/files/checkout/sites/default/modules/l10n_server/l10n_community/tests/l10n_community.test on line 497 and definedRecoverable errordrupal_web_test_case.php1252DrupalWebTestCase->drupalLogin()
Trying to get property of non-objectNoticedrupal_web_test_case.php1258DrupalWebTestCase->drupalLogin()
Trying to get property of non-objectNoticedrupal_web_test_case.php1259DrupalWebTestCase->drupalLogin()
Failed to set field name to Otherl10n_community.test497L10nServerTestCase->testImport()
Failed to set field pass to Otherl10n_community.test497L10nServerTestCase->testImport()
Found the requested form fields at userOtherl10n_community.test497L10nServerTestCase->testImport()
Trying to get property of non-objectNoticedrupal_web_test_case.php1265DrupalWebTestCase->drupalLogin()
User successfully logged in.User loginl10n_community.test497L10nServerTestCase->testImport()
Raw "Gettext .po file with translations" foundOtherl10n_community.test499L10nServerTestCase->testImport()
Raw "Attribute import to" foundOtherl10n_community.test501L10nServerTestCase->testImport()
Trying to get property of non-objectNoticel10n_community.test505L10nServerTestCase->testImport()
Failed to set field files[file] to sites/default/modules/l10n_server/l10n_community/tests/l10n_community_test.poOtherl10n_community.test665L10nServerTestCase->importPO()
Failed to set field import_uid to Otherl10n_community.test665L10nServerTestCase->importPO()
Found the Import buttonOtherl10n_community.test665L10nServerTestCase->importPO()
Found the requested form fields at translate/languages/hu/importOtherl10n_community.test665L10nServerTestCase->importPO()
sites/default/modules/l10n_server/l10n_community/tests/l10n_community_test.po imported successfully.Otherl10n_community.test667L10nServerTestCase->importPO()
Raw "3 suggestions added" foundOtherl10n_community.test506L10nServerTestCase->testImport()
Raw "1 duplicate translation not saved" foundOtherl10n_community.test507L10nServerTestCase->testImport()
Raw "2 source strings not found; their translations were ignored" foundOtherl10n_community.test508L10nServerTestCase->testImport()
Argument 1 passed to DrupalWebTestCase::drupalLogin() must be an instance of stdClass, boolean given, called in /var/lib/drupaltestbot/sites/default/files/checkout/sites/default/modules/l10n_server/l10n_community/tests/l10n_community.test on line 512 and definedRecoverable errordrupal_web_test_case.php1252DrupalWebTestCase->drupalLogin()
Trying to get property of non-objectNoticedrupal_web_test_case.php1258DrupalWebTestCase->drupalLogin()
Trying to get property of non-objectNoticedrupal_web_test_case.php1259DrupalWebTestCase->drupalLogin()
Failed to set field name to Otherl10n_community.test512L10nServerTestCase->testImport()
Failed to set field pass to Otherl10n_community.test512L10nServerTestCase->testImport()
Found the requested form fields at userOtherl10n_community.test512L10nServerTestCase->testImport()
Trying to get property of non-objectNoticedrupal_web_test_case.php1265DrupalWebTestCase->drupalLogin()
User successfully logged in.User loginl10n_community.test512L10nServerTestCase->testImport()
String "This is a test string." foundOtherl10n_community.test517L10nServerTestCase->testImport()
Singular/plural string "1 test string/@count test strings" foundOtherl10n_community.test518L10nServerTestCase->testImport()
String "Test string in context" found in context "Test context"Otherl10n_community.test519L10nServerTestCase->testImport()
"<td class="source"" found 3 timesOtherl10n_community.test520L10nServerTestCase->testImport()
String "This is a test string. - imported translation" foundOtherl10n_community.test528L10nServerTestCase->testImport()
Singular/plural string "1 test string - imported translation/@count test strings - imported translation" foundOtherl10n_community.test529L10nServerTestCase->testImport()
String "Test string in context - imported translation" foundOtherl10n_community.test530L10nServerTestCase->testImport()
Trying to get property of non-objectNoticel10n_community.test531L10nServerTestCase->testImport()
"by " found 3 timesOtherl10n_community.test531L10nServerTestCase->testImport()
Raw "Gettext .po file with translations" foundOtherl10n_community.test537L10nServerTestCase->testImport()
Raw "Store as approved translations" foundOtherl10n_community.test538L10nServerTestCase->testImport()
Raw "Attribute import to" foundOtherl10n_community.test539L10nServerTestCase->testImport()
Trying to get property of non-objectNoticel10n_community.test544L10nServerTestCase->testImport()
Failed to set field files[file] to sites/default/modules/l10n_server/l10n_community/tests/l10n_community_test.poOtherl10n_community.test665L10nServerTestCase->importPO()
Failed to set field is_suggestion to 1Otherl10n_community.test665L10nServerTestCase->importPO()
Failed to set field import_uid to Otherl10n_community.test665L10nServerTestCase->importPO()
Found the Import buttonOtherl10n_community.test665L10nServerTestCase->importPO()
Found the requested form fields at translate/languages/hu/importOtherl10n_community.test665L10nServerTestCase->importPO()
sites/default/modules/l10n_server/l10n_community/tests/l10n_community_test.po imported successfully.Otherl10n_community.test667L10nServerTestCase->importPO()
Raw "4 duplicate translations not saved" foundOtherl10n_community.test545L10nServerTestCase->testImport()
Raw "2 source strings not found; their translations were ignored" foundOtherl10n_community.test546L10nServerTestCase->testImport()
PDOException: SQLSTATE[42S02]: Base table or view not found: 1146 Table 'drupaltestbotmysql.simpletest799200l10n_server_translation' doesn't exist: UPDATE {l10n_server_translation} SET translation=:db_update_placeholder_0 WHERE (translation = :db_condition_placeholder_0) AND (is_suggestion = :db_condition_placeholder_1) ; Array ( [:db_update_placeholder_0] => saved for testing [:db_condition_placeholder_0] => This is a test string. - imported translation [:db_condition_placeholder_1] => 1 ) in L10nServerTestCase->testImport() (line 555 of /var/lib/drupaltestbot/sites/default/files/checkout/sites/default/modules/l10n_server/l10n_community/tests/l10n_community.test).Uncaught exceptiondatabase.inc2171PDOStatement->execute()

All

Test namePassFailException
ExpandLocalization server (L10nServerTestCase) [Localization server]301332114
MessageGroupFilenameLineFunctionStatus
Enabled modules: locale, l10n_pconfig, potx, l10n_server, l10n_community, l10n_drupalOtherl10n_community.test27L10nServerTestCase->setUp()
Invalid permission access localization community.Rolel10n_community.test31L10nServerTestCase->setUp()
Invalid permission browse translations.Rolel10n_community.test31L10nServerTestCase->setUp()
Invalid permission access localization community.Rolel10n_community.test32L10nServerTestCase->setUp()
Invalid permission browse translations.Rolel10n_community.test32L10nServerTestCase->setUp()
Invalid permission submit suggestions.Rolel10n_community.test32L10nServerTestCase->setUp()
Invalid permission import gettext files.Rolel10n_community.test32L10nServerTestCase->setUp()
Invalid permission access localization community.Rolel10n_community.test33L10nServerTestCase->setUp()
Invalid permission browse translations.Rolel10n_community.test33L10nServerTestCase->setUp()
Invalid permission submit suggestions.Rolel10n_community.test33L10nServerTestCase->setUp()
Invalid permission import gettext files.Rolel10n_community.test33L10nServerTestCase->setUp()
Invalid permission access localization community.Rolel10n_community.test34L10nServerTestCase->setUp()
Invalid permission browse translations.Rolel10n_community.test34L10nServerTestCase->setUp()
Invalid permission moderate own suggestions.Rolel10n_community.test34L10nServerTestCase->setUp()
Invalid permission moderate suggestions from others.Rolel10n_community.test34L10nServerTestCase->setUp()
Invalid permission import gettext files.Rolel10n_community.test34L10nServerTestCase->setUp()
Invalid permission submit suggestions.Rolel10n_community.test34L10nServerTestCase->setUp()
Invalid permission administer languages.Rolel10n_community.test35L10nServerTestCase->setUp()
Invalid permission administer localization server.Rolel10n_community.test35L10nServerTestCase->setUp()
Invalid permission import gettext files.Rolel10n_community.test35L10nServerTestCase->setUp()
Argument 1 passed to DrupalWebTestCase::drupalLogin() must be an instance of stdClass, boolean given, called in /var/lib/drupaltestbot/sites/default/files/checkout/sites/default/modules/l10n_server/l10n_community/tests/l10n_community.test on line 50 and definedRecoverable errordrupal_web_test_case.php1252DrupalWebTestCase->drupalLogin()
Trying to get property of non-objectNoticedrupal_web_test_case.php1258DrupalWebTestCase->drupalLogin()
Trying to get property of non-objectNoticedrupal_web_test_case.php1259DrupalWebTestCase->drupalLogin()
Failed to set field name to Otherl10n_community.test50L10nServerTestCase->setUp()
Failed to set field pass to Otherl10n_community.test50L10nServerTestCase->setUp()
Found the requested form fields at userOtherl10n_community.test50L10nServerTestCase->setUp()
Trying to get property of non-objectNoticedrupal_web_test_case.php1265DrupalWebTestCase->drupalLogin()
User successfully logged in.User loginl10n_community.test50L10nServerTestCase->setUp()
Failed to set field l10n_server_connector_l10n_drupal_files_directory to /var/lib/drupaltestbot/sites/default/files/checkout/sites/default/files/simpletest/257978/private/temp/l10n_community_testOtherl10n_community.test52L10nServerTestCase->setUp()
Found the Save configuration buttonOtherl10n_community.test52L10nServerTestCase->setUp()
Found the requested form fields at admin/l10n_server/connectors/config/l10n_drupal/filesOtherl10n_community.test52L10nServerTestCase->setUp()
Local package directory set.Otherl10n_community.test53L10nServerTestCase->setUp()
Failed to set field l10n_server_connector_l10n_drupal_files_enabled to 1Otherl10n_community.test57L10nServerTestCase->setUp()
Found the Save configuration buttonOtherl10n_community.test57L10nServerTestCase->setUp()
Found the requested form fields at admin/l10n_server/connectorsOtherl10n_community.test57L10nServerTestCase->setUp()
Drupal connector enabled.Otherl10n_community.test58L10nServerTestCase->setUp()
Failed to set field l10n_community_import_user to eiJN0zqGOtherl10n_community.test62L10nServerTestCase->setUp()
Found the Save configuration buttonOtherl10n_community.test62L10nServerTestCase->setUp()
Found the requested form fields at admin/l10n_server/l10n_communityOtherl10n_community.test62L10nServerTestCase->setUp()
Team user set.Otherl10n_community.test63L10nServerTestCase->setUp()
Argument 1 passed to DrupalWebTestCase::drupalLogin() must be an instance of stdClass, boolean given, called in /var/lib/drupaltestbot/sites/default/files/checkout/sites/default/modules/l10n_server/l10n_community/tests/l10n_community.test on line 82 and definedRecoverable errordrupal_web_test_case.php1252DrupalWebTestCase->drupalLogin()
Trying to get property of non-objectNoticedrupal_web_test_case.php1258DrupalWebTestCase->drupalLogin()
Trying to get property of non-objectNoticedrupal_web_test_case.php1259DrupalWebTestCase->drupalLogin()
Failed to set field name to Otherl10n_community.test82L10nServerTestCase->testWelcome()
Failed to set field pass to Otherl10n_community.test82L10nServerTestCase->testWelcome()
Found the requested form fields at userOtherl10n_community.test82L10nServerTestCase->testWelcome()
Trying to get property of non-objectNoticedrupal_web_test_case.php1265DrupalWebTestCase->drupalLogin()
User successfully logged in.User loginl10n_community.test82L10nServerTestCase->testWelcome()
Welcome screen visible to priviledged user.Otherl10n_community.test84L10nServerTestCase->testWelcome()
Enabled modules: locale, l10n_pconfig, potx, l10n_server, l10n_community, l10n_drupalOtherl10n_community.test27L10nServerTestCase->setUp()
Invalid permission access localization community.Rolel10n_community.test31L10nServerTestCase->setUp()
Invalid permission browse translations.Rolel10n_community.test31L10nServerTestCase->setUp()
Invalid permission access localization community.Rolel10n_community.test32L10nServerTestCase->setUp()
Invalid permission browse translations.Rolel10n_community.test32L10nServerTestCase->setUp()
Invalid permission submit suggestions.Rolel10n_community.test32L10nServerTestCase->setUp()
Invalid permission import gettext files.Rolel10n_community.test32L10nServerTestCase->setUp()
Invalid permission access localization community.Rolel10n_community.test33L10nServerTestCase->setUp()
Invalid permission browse translations.Rolel10n_community.test33L10nServerTestCase->setUp()
Invalid permission submit suggestions.Rolel10n_community.test33L10nServerTestCase->setUp()
Invalid permission import gettext files.Rolel10n_community.test33L10nServerTestCase->setUp()
Invalid permission access localization community.Rolel10n_community.test34L10nServerTestCase->setUp()
Invalid permission browse translations.Rolel10n_community.test34L10nServerTestCase->setUp()
Invalid permission moderate own suggestions.Rolel10n_community.test34L10nServerTestCase->setUp()
Invalid permission moderate suggestions from others.Rolel10n_community.test34L10nServerTestCase->setUp()
Invalid permission import gettext files.Rolel10n_community.test34L10nServerTestCase->setUp()
Invalid permission submit suggestions.Rolel10n_community.test34L10nServerTestCase->setUp()
Invalid permission administer languages.Rolel10n_community.test35L10nServerTestCase->setUp()
Invalid permission administer localization server.Rolel10n_community.test35L10nServerTestCase->setUp()
Invalid permission import gettext files.Rolel10n_community.test35L10nServerTestCase->setUp()
Argument 1 passed to DrupalWebTestCase::drupalLogin() must be an instance of stdClass, boolean given, called in /var/lib/drupaltestbot/sites/default/files/checkout/sites/default/modules/l10n_server/l10n_community/tests/l10n_community.test on line 50 and definedRecoverable errordrupal_web_test_case.php1252DrupalWebTestCase->drupalLogin()
Trying to get property of non-objectNoticedrupal_web_test_case.php1258DrupalWebTestCase->drupalLogin()
Trying to get property of non-objectNoticedrupal_web_test_case.php1259DrupalWebTestCase->drupalLogin()
Failed to set field name to Otherl10n_community.test50L10nServerTestCase->setUp()
Failed to set field pass to Otherl10n_community.test50L10nServerTestCase->setUp()
Found the requested form fields at userOtherl10n_community.test50L10nServerTestCase->setUp()
Trying to get property of non-objectNoticedrupal_web_test_case.php1265DrupalWebTestCase->drupalLogin()
User successfully logged in.User loginl10n_community.test50L10nServerTestCase->setUp()
Failed to set field l10n_server_connector_l10n_drupal_files_directory to /var/lib/drupaltestbot/sites/default/files/checkout/sites/default/files/simpletest/439462/private/temp/l10n_community_testOtherl10n_community.test52L10nServerTestCase->setUp()
Found the Save configuration buttonOtherl10n_community.test52L10nServerTestCase->setUp()
Found the requested form fields at admin/l10n_server/connectors/config/l10n_drupal/filesOtherl10n_community.test52L10nServerTestCase->setUp()
Local package directory set.Otherl10n_community.test53L10nServerTestCase->setUp()
Failed to set field l10n_server_connector_l10n_drupal_files_enabled to 1Otherl10n_community.test57L10nServerTestCase->setUp()
Found the Save configuration buttonOtherl10n_community.test57L10nServerTestCase->setUp()
Found the requested form fields at admin/l10n_server/connectorsOtherl10n_community.test57L10nServerTestCase->setUp()
Drupal connector enabled.Otherl10n_community.test58L10nServerTestCase->setUp()
Failed to set field l10n_community_import_user to ssiohSaSOtherl10n_community.test62L10nServerTestCase->setUp()
Found the Save configuration buttonOtherl10n_community.test62L10nServerTestCase->setUp()
Found the requested form fields at admin/l10n_server/l10n_communityOtherl10n_community.test62L10nServerTestCase->setUp()
Team user set.Otherl10n_community.test63L10nServerTestCase->setUp()
Argument 1 passed to DrupalWebTestCase::drupalLogin() must be an instance of stdClass, boolean given, called in /var/lib/drupaltestbot/sites/default/files/checkout/sites/default/modules/l10n_server/l10n_community/tests/l10n_community.test on line 93 and definedRecoverable errordrupal_web_test_case.php1252DrupalWebTestCase->drupalLogin()
Trying to get property of non-objectNoticedrupal_web_test_case.php1258DrupalWebTestCase->drupalLogin()
Trying to get property of non-objectNoticedrupal_web_test_case.php1259DrupalWebTestCase->drupalLogin()
Failed to set field name to Otherl10n_community.test93L10nServerTestCase->testLanguagesProjects()
Failed to set field pass to Otherl10n_community.test93L10nServerTestCase->testLanguagesProjects()
Found the requested form fields at userOtherl10n_community.test93L10nServerTestCase->testLanguagesProjects()
Trying to get property of non-objectNoticedrupal_web_test_case.php1265DrupalWebTestCase->drupalLogin()
User successfully logged in.User loginl10n_community.test93L10nServerTestCase->testLanguagesProjects()
Language list empty on start.Otherl10n_community.test95L10nServerTestCase->testLanguagesProjects()
Argument 1 passed to DrupalWebTestCase::drupalLogin() must be an instance of stdClass, boolean given, called in /var/lib/drupaltestbot/sites/default/files/checkout/sites/default/modules/l10n_server/l10n_community/tests/l10n_community.test on line 753 and definedRecoverable errordrupal_web_test_case.php1252DrupalWebTestCase->drupalLogin()
Trying to get property of non-objectNoticedrupal_web_test_case.php1258DrupalWebTestCase->drupalLogin()
Trying to get property of non-objectNoticedrupal_web_test_case.php1259DrupalWebTestCase->drupalLogin()
Failed to set field name to Otherl10n_community.test753L10nServerTestCase->addLanguage()
Failed to set field pass to Otherl10n_community.test753L10nServerTestCase->addLanguage()
Found the requested form fields at userOtherl10n_community.test753L10nServerTestCase->addLanguage()
Trying to get property of non-objectNoticedrupal_web_test_case.php1265DrupalWebTestCase->drupalLogin()
User successfully logged in.User loginl10n_community.test753L10nServerTestCase->addLanguage()
Failed to set field langcode to huOtherl10n_community.test755L10nServerTestCase->addLanguage()
Found the Add language buttonOtherl10n_community.test755L10nServerTestCase->addLanguage()
Found the requested form fields at admin/config/regional/language/addOtherl10n_community.test755L10nServerTestCase->addLanguage()
Hungarian language added to system.Otherl10n_community.test756L10nServerTestCase->addLanguage()
Hungarian language added to system.Otherl10n_community.test757L10nServerTestCase->addLanguage()
Argument 1 passed to DrupalWebTestCase::drupalLogin() must be an instance of stdClass, boolean given, called in /var/lib/drupaltestbot/sites/default/files/checkout/sites/default/modules/l10n_server/l10n_community/tests/l10n_community.test on line 102 and definedRecoverable errordrupal_web_test_case.php1252DrupalWebTestCase->drupalLogin()
Trying to get property of non-objectNoticedrupal_web_test_case.php1258DrupalWebTestCase->drupalLogin()
Trying to get property of non-objectNoticedrupal_web_test_case.php1259DrupalWebTestCase->drupalLogin()
Failed to set field name to Otherl10n_community.test102L10nServerTestCase->testLanguagesProjects()
Failed to set field pass to Otherl10n_community.test102L10nServerTestCase->testLanguagesProjects()
Found the requested form fields at userOtherl10n_community.test102L10nServerTestCase->testLanguagesProjects()
Trying to get property of non-objectNoticedrupal_web_test_case.php1265DrupalWebTestCase->drupalLogin()
User successfully logged in.User loginl10n_community.test102L10nServerTestCase->testLanguagesProjects()
Language now recognized, but still no strings to translate.Otherl10n_community.test104L10nServerTestCase->testLanguagesProjects()
Argument 1 passed to DrupalWebTestCase::drupalLogin() must be an instance of stdClass, boolean given, called in /var/lib/drupaltestbot/sites/default/files/checkout/sites/default/modules/l10n_server/l10n_community/tests/l10n_community.test on line 807 and definedRecoverable errordrupal_web_test_case.php1252DrupalWebTestCase->drupalLogin()
Trying to get property of non-objectNoticedrupal_web_test_case.php1258DrupalWebTestCase->drupalLogin()
Trying to get property of non-objectNoticedrupal_web_test_case.php1259DrupalWebTestCase->drupalLogin()
Failed to set field name to Otherl10n_community.test807L10nServerTestCase->addProject()
Failed to set field pass to Otherl10n_community.test807L10nServerTestCase->addProject()
Found the requested form fields at userOtherl10n_community.test807L10nServerTestCase->addProject()
Trying to get property of non-objectNoticedrupal_web_test_case.php1265DrupalWebTestCase->drupalLogin()
User successfully logged in.User loginl10n_community.test807L10nServerTestCase->addProject()
Raw "l10n_testlafH0n_5-5.x-5.7.tar.gz (2 files, 19 strings) scanned." foundOtherl10n_community.test823L10nServerTestCase->addProject()
Argument 1 passed to DrupalWebTestCase::drupalLogin() must be an instance of stdClass, boolean given, called in /var/lib/drupaltestbot/sites/default/files/checkout/sites/default/modules/l10n_server/l10n_community/tests/l10n_community.test on line 807 and definedRecoverable errordrupal_web_test_case.php1252DrupalWebTestCase->drupalLogin()
Trying to get property of non-objectNoticedrupal_web_test_case.php1258DrupalWebTestCase->drupalLogin()
Trying to get property of non-objectNoticedrupal_web_test_case.php1259DrupalWebTestCase->drupalLogin()
Failed to set field name to Otherl10n_community.test807L10nServerTestCase->addProject()
Failed to set field pass to Otherl10n_community.test807L10nServerTestCase->addProject()
Found the requested form fields at userOtherl10n_community.test807L10nServerTestCase->addProject()
Trying to get property of non-objectNoticedrupal_web_test_case.php1265DrupalWebTestCase->drupalLogin()
User successfully logged in.User loginl10n_community.test807L10nServerTestCase->addProject()
Raw "l10n_test5fI7Hx_6-6.x-5.7.tar.gz (3 files, 33 strings) scanned." foundOtherl10n_community.test823L10nServerTestCase->addProject()
Argument 1 passed to DrupalWebTestCase::drupalLogin() must be an instance of stdClass, boolean given, called in /var/lib/drupaltestbot/sites/default/files/checkout/sites/default/modules/l10n_server/l10n_community/tests/l10n_community.test on line 807 and definedRecoverable errordrupal_web_test_case.php1252DrupalWebTestCase->drupalLogin()
Trying to get property of non-objectNoticedrupal_web_test_case.php1258DrupalWebTestCase->drupalLogin()
Trying to get property of non-objectNoticedrupal_web_test_case.php1259DrupalWebTestCase->drupalLogin()
Failed to set field name to Otherl10n_community.test807L10nServerTestCase->addProject()
Failed to set field pass to Otherl10n_community.test807L10nServerTestCase->addProject()
Found the requested form fields at userOtherl10n_community.test807L10nServerTestCase->addProject()
Trying to get property of non-objectNoticedrupal_web_test_case.php1265DrupalWebTestCase->drupalLogin()
User successfully logged in.User loginl10n_community.test807L10nServerTestCase->addProject()
Raw "l10n_test5fI7Hx_6-6.x-3.5.tar.gz (2 files, 25 strings) scanned." foundOtherl10n_community.test823L10nServerTestCase->addProject()
Argument 1 passed to DrupalWebTestCase::drupalLogin() must be an instance of stdClass, boolean given, called in /var/lib/drupaltestbot/sites/default/files/checkout/sites/default/modules/l10n_server/l10n_community/tests/l10n_community.test on line 807 and definedRecoverable errordrupal_web_test_case.php1252DrupalWebTestCase->drupalLogin()
Trying to get property of non-objectNoticedrupal_web_test_case.php1258DrupalWebTestCase->drupalLogin()
Trying to get property of non-objectNoticedrupal_web_test_case.php1259DrupalWebTestCase->drupalLogin()
Failed to set field name to Otherl10n_community.test807L10nServerTestCase->addProject()
Failed to set field pass to Otherl10n_community.test807L10nServerTestCase->addProject()
Found the requested form fields at userOtherl10n_community.test807L10nServerTestCase->addProject()
Trying to get property of non-objectNoticedrupal_web_test_case.php1265DrupalWebTestCase->drupalLogin()
User successfully logged in.User loginl10n_community.test807L10nServerTestCase->addProject()
Raw "l10n_testpW6wSI_7-7.x-5.7.tar.gz (3 files, 31 strings) scanned." foundOtherl10n_community.test823L10nServerTestCase->addProject()
Argument 1 passed to DrupalWebTestCase::drupalLogin() must be an instance of stdClass, boolean given, called in /var/lib/drupaltestbot/sites/default/files/checkout/sites/default/modules/l10n_server/l10n_community/tests/l10n_community.test on line 113 and definedRecoverable errordrupal_web_test_case.php1252DrupalWebTestCase->drupalLogin()
Trying to get property of non-objectNoticedrupal_web_test_case.php1258DrupalWebTestCase->drupalLogin()
Trying to get property of non-objectNoticedrupal_web_test_case.php1259DrupalWebTestCase->drupalLogin()
Failed to set field name to Otherl10n_community.test113L10nServerTestCase->testLanguagesProjects()
Failed to set field pass to Otherl10n_community.test113L10nServerTestCase->testLanguagesProjects()
Found the requested form fields at userOtherl10n_community.test113L10nServerTestCase->testLanguagesProjects()
Trying to get property of non-objectNoticedrupal_web_test_case.php1265DrupalWebTestCase->drupalLogin()
User successfully logged in.User loginl10n_community.test113L10nServerTestCase->testLanguagesProjects()
With projects in place, language list is visible.Otherl10n_community.test115L10nServerTestCase->testLanguagesProjects()
l10n_testlafH0n_5 name is shown on project page.Otherl10n_community.test120L10nServerTestCase->testLanguagesProjects()
l10n_test5fI7Hx_6 name is shown on project page.Otherl10n_community.test120L10nServerTestCase->testLanguagesProjects()
l10n_testpW6wSI_7 name is shown on project page.Otherl10n_community.test120L10nServerTestCase->testLanguagesProjects()
Language shows up on project page.Otherl10n_community.test125L10nServerTestCase->testLanguagesProjects()
One release known on project.Otherl10n_community.test131L10nServerTestCase->testLanguagesProjects()
One release parsed on project.Otherl10n_community.test132L10nServerTestCase->testLanguagesProjects()
Language shows up on project page.Otherl10n_community.test125L10nServerTestCase->testLanguagesProjects()
Two releases known on project.Otherl10n_community.test127L10nServerTestCase->testLanguagesProjects()
Two releases parsed on project.Otherl10n_community.test128L10nServerTestCase->testLanguagesProjects()
Language shows up on project page.Otherl10n_community.test125L10nServerTestCase->testLanguagesProjects()
One release known on project.Otherl10n_community.test131L10nServerTestCase->testLanguagesProjects()
One release parsed on project.Otherl10n_community.test132L10nServerTestCase->testLanguagesProjects()
String "This is a test string." foundOtherl10n_community.test140L10nServerTestCase->testLanguagesProjects()
String "Test menu item in 5" foundOtherl10n_community.test141L10nServerTestCase->testLanguagesProjects()
String "test potx permission" foundOtherl10n_community.test142L10nServerTestCase->testLanguagesProjects()
Singular/plural string "1 test string/@count test strings" foundOtherl10n_community.test143L10nServerTestCase->testLanguagesProjects()
Singular/plural string "1 test string in JS/@count test strings in JS" foundOtherl10n_community.test144L10nServerTestCase->testLanguagesProjects()
String "Test string in context" found in context "Test context"Otherl10n_community.test145L10nServerTestCase->testLanguagesProjects()
"<td class="source"" found 39 timesOtherl10n_community.test146L10nServerTestCase->testLanguagesProjects()
String "This is a test string." foundOtherl10n_community.test151L10nServerTestCase->testLanguagesProjects()
String "Test menu item in 5" foundOtherl10n_community.test152L10nServerTestCase->testLanguagesProjects()
String "test potx permission" foundOtherl10n_community.test153L10nServerTestCase->testLanguagesProjects()
Singular/plural string "1 test string/@count test strings" foundOtherl10n_community.test154L10nServerTestCase->testLanguagesProjects()
"<td class="source"" found 19 timesOtherl10n_community.test157L10nServerTestCase->testLanguagesProjects()
String "This is a test string." foundOtherl10n_community.test162L10nServerTestCase->testLanguagesProjects()
String "test potx permission" foundOtherl10n_community.test164L10nServerTestCase->testLanguagesProjects()
Singular/plural string "1 test string/@count test strings" foundOtherl10n_community.test165L10nServerTestCase->testLanguagesProjects()
Singular/plural string "1 test string in JS/@count test strings in JS" foundOtherl10n_community.test166L10nServerTestCase->testLanguagesProjects()
"<td class="source"" found 33 timesOtherl10n_community.test168L10nServerTestCase->testLanguagesProjects()
String "This is a test string." foundOtherl10n_community.test173L10nServerTestCase->testLanguagesProjects()
Singular/plural string "1 test string/@count test strings" foundOtherl10n_community.test176L10nServerTestCase->testLanguagesProjects()
Singular/plural string "1 test string in JS/@count test strings in JS" foundOtherl10n_community.test177L10nServerTestCase->testLanguagesProjects()
String "Test string in context" found in context "Test context"Otherl10n_community.test178L10nServerTestCase->testLanguagesProjects()
"<td class="source"" found 31 timesOtherl10n_community.test179L10nServerTestCase->testLanguagesProjects()
PDOException: SQLSTATE[42S02]: Base table or view not found: 1146 Table 'drupaltestbotmysql.simpletest439462l10n_server_project' doesn't exist: SELECT r.rid AS rid FROM {l10n_server_project} p LEFT OUTER JOIN {l10n_server_release} r ON p.pid = r.pid WHERE (p.uri = :db_condition_placeholder_0) AND (r.title = :db_condition_placeholder_1) ; Array ( [:db_condition_placeholder_0] => l10n_test5fI7Hx_6 [:db_condition_placeholder_1] => 6.x-3.5 ) in L10nServerTestCase->testLanguagesProjects() (line 190 of /var/lib/drupaltestbot/sites/default/files/checkout/sites/default/modules/l10n_server/l10n_community/tests/l10n_community.test).Uncaught exceptiondatabase.inc2171PDOStatement->execute()
Enabled modules: locale, l10n_pconfig, potx, l10n_server, l10n_community, l10n_drupalOtherl10n_community.test27L10nServerTestCase->setUp()
Invalid permission access localization community.Rolel10n_community.test31L10nServerTestCase->setUp()
Invalid permission browse translations.Rolel10n_community.test31L10nServerTestCase->setUp()
Invalid permission access localization community.Rolel10n_community.test32L10nServerTestCase->setUp()
Invalid permission browse translations.Rolel10n_community.test32L10nServerTestCase->setUp()
Invalid permission submit suggestions.Rolel10n_community.test32L10nServerTestCase->setUp()
Invalid permission import gettext files.Rolel10n_community.test32L10nServerTestCase->setUp()
Invalid permission access localization community.Rolel10n_community.test33L10nServerTestCase->setUp()
Invalid permission browse translations.Rolel10n_community.test33L10nServerTestCase->setUp()
Invalid permission submit suggestions.Rolel10n_community.test33L10nServerTestCase->setUp()
Invalid permission import gettext files.Rolel10n_community.test33L10nServerTestCase->setUp()
Invalid permission access localization community.Rolel10n_community.test34L10nServerTestCase->setUp()
Invalid permission browse translations.Rolel10n_community.test34L10nServerTestCase->setUp()
Invalid permission moderate own suggestions.Rolel10n_community.test34L10nServerTestCase->setUp()
Invalid permission moderate suggestions from others.Rolel10n_community.test34L10nServerTestCase->setUp()
Invalid permission import gettext files.Rolel10n_community.test34L10nServerTestCase->setUp()
Invalid permission submit suggestions.Rolel10n_community.test34L10nServerTestCase->setUp()
Invalid permission administer languages.Rolel10n_community.test35L10nServerTestCase->setUp()
Invalid permission administer localization server.Rolel10n_community.test35L10nServerTestCase->setUp()
Invalid permission import gettext files.Rolel10n_community.test35L10nServerTestCase->setUp()
Argument 1 passed to DrupalWebTestCase::drupalLogin() must be an instance of stdClass, boolean given, called in /var/lib/drupaltestbot/sites/default/files/checkout/sites/default/modules/l10n_server/l10n_community/tests/l10n_community.test on line 50 and definedRecoverable errordrupal_web_test_case.php1252DrupalWebTestCase->drupalLogin()
Trying to get property of non-objectNoticedrupal_web_test_case.php1258DrupalWebTestCase->drupalLogin()
Trying to get property of non-objectNoticedrupal_web_test_case.php1259DrupalWebTestCase->drupalLogin()
Failed to set field name to Otherl10n_community.test50L10nServerTestCase->setUp()
Failed to set field pass to Otherl10n_community.test50L10nServerTestCase->setUp()
Found the requested form fields at userOtherl10n_community.test50L10nServerTestCase->setUp()
Trying to get property of non-objectNoticedrupal_web_test_case.php1265DrupalWebTestCase->drupalLogin()
User successfully logged in.User loginl10n_community.test50L10nServerTestCase->setUp()
Failed to set field l10n_server_connector_l10n_drupal_files_directory to /var/lib/drupaltestbot/sites/default/files/checkout/sites/default/files/simpletest/644286/private/temp/l10n_community_testOtherl10n_community.test52L10nServerTestCase->setUp()
Found the Save configuration buttonOtherl10n_community.test52L10nServerTestCase->setUp()
Found the requested form fields at admin/l10n_server/connectors/config/l10n_drupal/filesOtherl10n_community.test52L10nServerTestCase->setUp()
Local package directory set.Otherl10n_community.test53L10nServerTestCase->setUp()
Failed to set field l10n_server_connector_l10n_drupal_files_enabled to 1Otherl10n_community.test57L10nServerTestCase->setUp()
Found the Save configuration buttonOtherl10n_community.test57L10nServerTestCase->setUp()
Found the requested form fields at admin/l10n_server/connectorsOtherl10n_community.test57L10nServerTestCase->setUp()
Drupal connector enabled.Otherl10n_community.test58L10nServerTestCase->setUp()
Failed to set field l10n_community_import_user to eSLTf9rFOtherl10n_community.test62L10nServerTestCase->setUp()
Found the Save configuration buttonOtherl10n_community.test62L10nServerTestCase->setUp()
Found the requested form fields at admin/l10n_server/l10n_communityOtherl10n_community.test62L10nServerTestCase->setUp()
Team user set.Otherl10n_community.test63L10nServerTestCase->setUp()
Argument 1 passed to DrupalWebTestCase::drupalLogin() must be an instance of stdClass, boolean given, called in /var/lib/drupaltestbot/sites/default/files/checkout/sites/default/modules/l10n_server/l10n_community/tests/l10n_community.test on line 753 and definedRecoverable errordrupal_web_test_case.php1252DrupalWebTestCase->drupalLogin()
Trying to get property of non-objectNoticedrupal_web_test_case.php1258DrupalWebTestCase->drupalLogin()
Trying to get property of non-objectNoticedrupal_web_test_case.php1259DrupalWebTestCase->drupalLogin()
Failed to set field name to Otherl10n_community.test753L10nServerTestCase->addLanguage()
Failed to set field pass to Otherl10n_community.test753L10nServerTestCase->addLanguage()
Found the requested form fields at userOtherl10n_community.test753L10nServerTestCase->addLanguage()
Trying to get property of non-objectNoticedrupal_web_test_case.php1265DrupalWebTestCase->drupalLogin()
User successfully logged in.User loginl10n_community.test753L10nServerTestCase->addLanguage()
Failed to set field langcode to huOtherl10n_community.test755L10nServerTestCase->addLanguage()
Found the Add language buttonOtherl10n_community.test755L10nServerTestCase->addLanguage()
Found the requested form fields at admin/config/regional/language/addOtherl10n_community.test755L10nServerTestCase->addLanguage()
Hungarian language added to system.Otherl10n_community.test756L10nServerTestCase->addLanguage()
Hungarian language added to system.Otherl10n_community.test757L10nServerTestCase->addLanguage()
Argument 1 passed to DrupalWebTestCase::drupalLogin() must be an instance of stdClass, boolean given, called in /var/lib/drupaltestbot/sites/default/files/checkout/sites/default/modules/l10n_server/l10n_community/tests/l10n_community.test on line 807 and definedRecoverable errordrupal_web_test_case.php1252DrupalWebTestCase->drupalLogin()
Trying to get property of non-objectNoticedrupal_web_test_case.php1258DrupalWebTestCase->drupalLogin()
Trying to get property of non-objectNoticedrupal_web_test_case.php1259DrupalWebTestCase->drupalLogin()
Failed to set field name to Otherl10n_community.test807L10nServerTestCase->addProject()
Failed to set field pass to Otherl10n_community.test807L10nServerTestCase->addProject()
Found the requested form fields at userOtherl10n_community.test807L10nServerTestCase->addProject()
Trying to get property of non-objectNoticedrupal_web_test_case.php1265DrupalWebTestCase->drupalLogin()
User successfully logged in.User loginl10n_community.test807L10nServerTestCase->addProject()
Raw "l10n_testhKjuO9_5-5.x-5.7.tar.gz (2 files, 19 strings) scanned." foundOtherl10n_community.test823L10nServerTestCase->addProject()
Argument 1 passed to DrupalWebTestCase::drupalLogin() must be an instance of stdClass, boolean given, called in /var/lib/drupaltestbot/sites/default/files/checkout/sites/default/modules/l10n_server/l10n_community/tests/l10n_community.test on line 807 and definedRecoverable errordrupal_web_test_case.php1252DrupalWebTestCase->drupalLogin()
Trying to get property of non-objectNoticedrupal_web_test_case.php1258DrupalWebTestCase->drupalLogin()
Trying to get property of non-objectNoticedrupal_web_test_case.php1259DrupalWebTestCase->drupalLogin()
Failed to set field name to Otherl10n_community.test807L10nServerTestCase->addProject()
Failed to set field pass to Otherl10n_community.test807L10nServerTestCase->addProject()
Found the requested form fields at userOtherl10n_community.test807L10nServerTestCase->addProject()
Trying to get property of non-objectNoticedrupal_web_test_case.php1265DrupalWebTestCase->drupalLogin()
User successfully logged in.User loginl10n_community.test807L10nServerTestCase->addProject()
Raw "l10n_testWHCUtB_6-6.x-5.7.tar.gz (3 files, 33 strings) scanned." foundOtherl10n_community.test823L10nServerTestCase->addProject()
Argument 1 passed to DrupalWebTestCase::drupalLogin() must be an instance of stdClass, boolean given, called in /var/lib/drupaltestbot/sites/default/files/checkout/sites/default/modules/l10n_server/l10n_community/tests/l10n_community.test on line 807 and definedRecoverable errordrupal_web_test_case.php1252DrupalWebTestCase->drupalLogin()
Trying to get property of non-objectNoticedrupal_web_test_case.php1258DrupalWebTestCase->drupalLogin()
Trying to get property of non-objectNoticedrupal_web_test_case.php1259DrupalWebTestCase->drupalLogin()
Failed to set field name to Otherl10n_community.test807L10nServerTestCase->addProject()
Failed to set field pass to Otherl10n_community.test807L10nServerTestCase->addProject()
Found the requested form fields at userOtherl10n_community.test807L10nServerTestCase->addProject()
Trying to get property of non-objectNoticedrupal_web_test_case.php1265DrupalWebTestCase->drupalLogin()
User successfully logged in.User loginl10n_community.test807L10nServerTestCase->addProject()
Raw "l10n_testWHCUtB_6-6.x-3.5.tar.gz (2 files, 25 strings) scanned." foundOtherl10n_community.test823L10nServerTestCase->addProject()
Argument 1 passed to DrupalWebTestCase::drupalLogin() must be an instance of stdClass, boolean given, called in /var/lib/drupaltestbot/sites/default/files/checkout/sites/default/modules/l10n_server/l10n_community/tests/l10n_community.test on line 807 and definedRecoverable errordrupal_web_test_case.php1252DrupalWebTestCase->drupalLogin()
Trying to get property of non-objectNoticedrupal_web_test_case.php1258DrupalWebTestCase->drupalLogin()
Trying to get property of non-objectNoticedrupal_web_test_case.php1259DrupalWebTestCase->drupalLogin()
Failed to set field name to Otherl10n_community.test807L10nServerTestCase->addProject()
Failed to set field pass to Otherl10n_community.test807L10nServerTestCase->addProject()
Found the requested form fields at userOtherl10n_community.test807L10nServerTestCase->addProject()
Trying to get property of non-objectNoticedrupal_web_test_case.php1265DrupalWebTestCase->drupalLogin()
User successfully logged in.User loginl10n_community.test807L10nServerTestCase->addProject()
Raw "l10n_testlk3VC4_7-7.x-5.7.tar.gz (3 files, 31 strings) scanned." foundOtherl10n_community.test823L10nServerTestCase->addProject()
Argument 1 passed to DrupalWebTestCase::drupalLogin() must be an instance of stdClass, boolean given, called in /var/lib/drupaltestbot/sites/default/files/checkout/sites/default/modules/l10n_server/l10n_community/tests/l10n_community.test on line 323 and definedRecoverable errordrupal_web_test_case.php1252DrupalWebTestCase->drupalLogin()
Trying to get property of non-objectNoticedrupal_web_test_case.php1258DrupalWebTestCase->drupalLogin()
Trying to get property of non-objectNoticedrupal_web_test_case.php1259DrupalWebTestCase->drupalLogin()
Failed to set field name to Otherl10n_community.test323L10nServerTestCase->testSuggetions()
Failed to set field pass to Otherl10n_community.test323L10nServerTestCase->testSuggetions()
Found the requested form fields at userOtherl10n_community.test323L10nServerTestCase->testSuggetions()
Trying to get property of non-objectNoticedrupal_web_test_case.php1265DrupalWebTestCase->drupalLogin()
User successfully logged in.User loginl10n_community.test323L10nServerTestCase->testSuggetions()
String "This is a test string." foundOtherl10n_community.test325L10nServerTestCase->testSuggetions()
PDOException: SQLSTATE[42S02]: Base table or view not found: 1146 Table 'drupaltestbotmysql.simpletest644286l10n_server_string' doesn't exist: SELECT s.sid AS sid FROM {l10n_server_string} s WHERE (value = :db_condition_placeholder_0) ; Array ( [:db_condition_placeholder_0] => This is a test string. ) in L10nServerTestCase->testSuggetions() (line 334 of /var/lib/drupaltestbot/sites/default/files/checkout/sites/default/modules/l10n_server/l10n_community/tests/l10n_community.test).Uncaught exceptiondatabase.inc2171PDOStatement->execute()
Enabled modules: locale, l10n_pconfig, potx, l10n_server, l10n_community, l10n_drupalOtherl10n_community.test27L10nServerTestCase->setUp()
Invalid permission access localization community.Rolel10n_community.test31L10nServerTestCase->setUp()
Invalid permission browse translations.Rolel10n_community.test31L10nServerTestCase->setUp()
Invalid permission access localization community.Rolel10n_community.test32L10nServerTestCase->setUp()
Invalid permission browse translations.Rolel10n_community.test32L10nServerTestCase->setUp()
Invalid permission submit suggestions.Rolel10n_community.test32L10nServerTestCase->setUp()
Invalid permission import gettext files.Rolel10n_community.test32L10nServerTestCase->setUp()
Invalid permission access localization community.Rolel10n_community.test33L10nServerTestCase->setUp()
Invalid permission browse translations.Rolel10n_community.test33L10nServerTestCase->setUp()
Invalid permission submit suggestions.Rolel10n_community.test33L10nServerTestCase->setUp()
Invalid permission import gettext files.Rolel10n_community.test33L10nServerTestCase->setUp()
Invalid permission access localization community.Rolel10n_community.test34L10nServerTestCase->setUp()
Invalid permission browse translations.Rolel10n_community.test34L10nServerTestCase->setUp()
Invalid permission moderate own suggestions.Rolel10n_community.test34L10nServerTestCase->setUp()
Invalid permission moderate suggestions from others.Rolel10n_community.test34L10nServerTestCase->setUp()
Invalid permission import gettext files.Rolel10n_community.test34L10nServerTestCase->setUp()
Invalid permission submit suggestions.Rolel10n_community.test34L10nServerTestCase->setUp()
Invalid permission administer languages.Rolel10n_community.test35L10nServerTestCase->setUp()
Invalid permission administer localization server.Rolel10n_community.test35L10nServerTestCase->setUp()
Invalid permission import gettext files.Rolel10n_community.test35L10nServerTestCase->setUp()
Argument 1 passed to DrupalWebTestCase::drupalLogin() must be an instance of stdClass, boolean given, called in /var/lib/drupaltestbot/sites/default/files/checkout/sites/default/modules/l10n_server/l10n_community/tests/l10n_community.test on line 50 and definedRecoverable errordrupal_web_test_case.php1252DrupalWebTestCase->drupalLogin()
Trying to get property of non-objectNoticedrupal_web_test_case.php1258DrupalWebTestCase->drupalLogin()
Trying to get property of non-objectNoticedrupal_web_test_case.php1259DrupalWebTestCase->drupalLogin()
Failed to set field name to Otherl10n_community.test50L10nServerTestCase->setUp()
Failed to set field pass to Otherl10n_community.test50L10nServerTestCase->setUp()
Found the requested form fields at userOtherl10n_community.test50L10nServerTestCase->setUp()
Trying to get property of non-objectNoticedrupal_web_test_case.php1265DrupalWebTestCase->drupalLogin()
User successfully logged in.User loginl10n_community.test50L10nServerTestCase->setUp()
Failed to set field l10n_server_connector_l10n_drupal_files_directory to /var/lib/drupaltestbot/sites/default/files/checkout/sites/default/files/simpletest/799200/private/temp/l10n_community_testOtherl10n_community.test52L10nServerTestCase->setUp()
Found the Save configuration buttonOtherl10n_community.test52L10nServerTestCase->setUp()
Found the requested form fields at admin/l10n_server/connectors/config/l10n_drupal/filesOtherl10n_community.test52L10nServerTestCase->setUp()
Local package directory set.Otherl10n_community.test53L10nServerTestCase->setUp()
Failed to set field l10n_server_connector_l10n_drupal_files_enabled to 1Otherl10n_community.test57L10nServerTestCase->setUp()
Found the Save configuration buttonOtherl10n_community.test57L10nServerTestCase->setUp()
Found the requested form fields at admin/l10n_server/connectorsOtherl10n_community.test57L10nServerTestCase->setUp()
Drupal connector enabled.Otherl10n_community.test58L10nServerTestCase->setUp()
Failed to set field l10n_community_import_user to hGMlryAeOtherl10n_community.test62L10nServerTestCase->setUp()
Found the Save configuration buttonOtherl10n_community.test62L10nServerTestCase->setUp()
Found the requested form fields at admin/l10n_server/l10n_communityOtherl10n_community.test62L10nServerTestCase->setUp()
Team user set.Otherl10n_community.test63L10nServerTestCase->setUp()
Argument 1 passed to DrupalWebTestCase::drupalLogin() must be an instance of stdClass, boolean given, called in /var/lib/drupaltestbot/sites/default/files/checkout/sites/default/modules/l10n_server/l10n_community/tests/l10n_community.test on line 753 and definedRecoverable errordrupal_web_test_case.php1252DrupalWebTestCase->drupalLogin()
Trying to get property of non-objectNoticedrupal_web_test_case.php1258DrupalWebTestCase->drupalLogin()
Trying to get property of non-objectNoticedrupal_web_test_case.php1259DrupalWebTestCase->drupalLogin()
Failed to set field name to Otherl10n_community.test753L10nServerTestCase->addLanguage()
Failed to set field pass to Otherl10n_community.test753L10nServerTestCase->addLanguage()
Found the requested form fields at userOtherl10n_community.test753L10nServerTestCase->addLanguage()
Trying to get property of non-objectNoticedrupal_web_test_case.php1265DrupalWebTestCase->drupalLogin()
User successfully logged in.User loginl10n_community.test753L10nServerTestCase->addLanguage()
Failed to set field langcode to huOtherl10n_community.test755L10nServerTestCase->addLanguage()
Found the Add language buttonOtherl10n_community.test755L10nServerTestCase->addLanguage()
Found the requested form fields at admin/config/regional/language/addOtherl10n_community.test755L10nServerTestCase->addLanguage()
Hungarian language added to system.Otherl10n_community.test756L10nServerTestCase->addLanguage()
Hungarian language added to system.Otherl10n_community.test757L10nServerTestCase->addLanguage()
Argument 1 passed to DrupalWebTestCase::drupalLogin() must be an instance of stdClass, boolean given, called in /var/lib/drupaltestbot/sites/default/files/checkout/sites/default/modules/l10n_server/l10n_community/tests/l10n_community.test on line 807 and definedRecoverable errordrupal_web_test_case.php1252DrupalWebTestCase->drupalLogin()
Trying to get property of non-objectNoticedrupal_web_test_case.php1258DrupalWebTestCase->drupalLogin()
Trying to get property of non-objectNoticedrupal_web_test_case.php1259DrupalWebTestCase->drupalLogin()
Failed to set field name to Otherl10n_community.test807L10nServerTestCase->addProject()
Failed to set field pass to Otherl10n_community.test807L10nServerTestCase->addProject()
Found the requested form fields at userOtherl10n_community.test807L10nServerTestCase->addProject()
Trying to get property of non-objectNoticedrupal_web_test_case.php1265DrupalWebTestCase->drupalLogin()
User successfully logged in.User loginl10n_community.test807L10nServerTestCase->addProject()
Raw "l10n_testSCESgL_5-5.x-5.7.tar.gz (2 files, 19 strings) scanned." foundOtherl10n_community.test823L10nServerTestCase->addProject()
Argument 1 passed to DrupalWebTestCase::drupalLogin() must be an instance of stdClass, boolean given, called in /var/lib/drupaltestbot/sites/default/files/checkout/sites/default/modules/l10n_server/l10n_community/tests/l10n_community.test on line 807 and definedRecoverable errordrupal_web_test_case.php1252DrupalWebTestCase->drupalLogin()
Trying to get property of non-objectNoticedrupal_web_test_case.php1258DrupalWebTestCase->drupalLogin()
Trying to get property of non-objectNoticedrupal_web_test_case.php1259DrupalWebTestCase->drupalLogin()
Failed to set field name to Otherl10n_community.test807L10nServerTestCase->addProject()
Failed to set field pass to Otherl10n_community.test807L10nServerTestCase->addProject()
Found the requested form fields at userOtherl10n_community.test807L10nServerTestCase->addProject()
Trying to get property of non-objectNoticedrupal_web_test_case.php1265DrupalWebTestCase->drupalLogin()
User successfully logged in.User loginl10n_community.test807L10nServerTestCase->addProject()
Raw "l10n_testuWXmEs_6-6.x-5.7.tar.gz (3 files, 33 strings) scanned." foundOtherl10n_community.test823L10nServerTestCase->addProject()
Argument 1 passed to DrupalWebTestCase::drupalLogin() must be an instance of stdClass, boolean given, called in /var/lib/drupaltestbot/sites/default/files/checkout/sites/default/modules/l10n_server/l10n_community/tests/l10n_community.test on line 807 and definedRecoverable errordrupal_web_test_case.php1252DrupalWebTestCase->drupalLogin()
Trying to get property of non-objectNoticedrupal_web_test_case.php1258DrupalWebTestCase->drupalLogin()
Trying to get property of non-objectNoticedrupal_web_test_case.php1259DrupalWebTestCase->drupalLogin()
Failed to set field name to Otherl10n_community.test807L10nServerTestCase->addProject()
Failed to set field pass to Otherl10n_community.test807L10nServerTestCase->addProject()
Found the requested form fields at userOtherl10n_community.test807L10nServerTestCase->addProject()
Trying to get property of non-objectNoticedrupal_web_test_case.php1265DrupalWebTestCase->drupalLogin()
User successfully logged in.User loginl10n_community.test807L10nServerTestCase->addProject()
Raw "l10n_testuWXmEs_6-6.x-3.5.tar.gz (2 files, 25 strings) scanned." foundOtherl10n_community.test823L10nServerTestCase->addProject()
Argument 1 passed to DrupalWebTestCase::drupalLogin() must be an instance of stdClass, boolean given, called in /var/lib/drupaltestbot/sites/default/files/checkout/sites/default/modules/l10n_server/l10n_community/tests/l10n_community.test on line 807 and definedRecoverable errordrupal_web_test_case.php1252DrupalWebTestCase->drupalLogin()
Trying to get property of non-objectNoticedrupal_web_test_case.php1258DrupalWebTestCase->drupalLogin()
Trying to get property of non-objectNoticedrupal_web_test_case.php1259DrupalWebTestCase->drupalLogin()
Failed to set field name to Otherl10n_community.test807L10nServerTestCase->addProject()
Failed to set field pass to Otherl10n_community.test807L10nServerTestCase->addProject()
Found the requested form fields at userOtherl10n_community.test807L10nServerTestCase->addProject()
Trying to get property of non-objectNoticedrupal_web_test_case.php1265DrupalWebTestCase->drupalLogin()
User successfully logged in.User loginl10n_community.test807L10nServerTestCase->addProject()
Raw "l10n_testKlxcvb_7-7.x-5.7.tar.gz (3 files, 31 strings) scanned." foundOtherl10n_community.test823L10nServerTestCase->addProject()
Argument 1 passed to DrupalWebTestCase::drupalLogin() must be an instance of stdClass, boolean given, called in /var/lib/drupaltestbot/sites/default/files/checkout/sites/default/modules/l10n_server/l10n_community/tests/l10n_community.test on line 489 and definedRecoverable errordrupal_web_test_case.php1252DrupalWebTestCase->drupalLogin()
Trying to get property of non-objectNoticedrupal_web_test_case.php1258DrupalWebTestCase->drupalLogin()
Trying to get property of non-objectNoticedrupal_web_test_case.php1259DrupalWebTestCase->drupalLogin()
Failed to set field name to Otherl10n_community.test489L10nServerTestCase->testImport()
Failed to set field pass to Otherl10n_community.test489L10nServerTestCase->testImport()
Found the requested form fields at userOtherl10n_community.test489L10nServerTestCase->testImport()
Trying to get property of non-objectNoticedrupal_web_test_case.php1265DrupalWebTestCase->drupalLogin()
User successfully logged in.User loginl10n_community.test489L10nServerTestCase->testImport()
Raw "Access denied" foundOtherl10n_community.test491L10nServerTestCase->testImport()
Argument 1 passed to DrupalWebTestCase::drupalLogin() must be an instance of stdClass, boolean given, called in /var/lib/drupaltestbot/sites/default/files/checkout/sites/default/modules/l10n_server/l10n_community/tests/l10n_community.test on line 497 and definedRecoverable errordrupal_web_test_case.php1252DrupalWebTestCase->drupalLogin()
Trying to get property of non-objectNoticedrupal_web_test_case.php1258DrupalWebTestCase->drupalLogin()
Trying to get property of non-objectNoticedrupal_web_test_case.php1259DrupalWebTestCase->drupalLogin()
Failed to set field name to Otherl10n_community.test497L10nServerTestCase->testImport()
Failed to set field pass to Otherl10n_community.test497L10nServerTestCase->testImport()
Found the requested form fields at userOtherl10n_community.test497L10nServerTestCase->testImport()
Trying to get property of non-objectNoticedrupal_web_test_case.php1265DrupalWebTestCase->drupalLogin()
User successfully logged in.User loginl10n_community.test497L10nServerTestCase->testImport()
Raw "Gettext .po file with translations" foundOtherl10n_community.test499L10nServerTestCase->testImport()
Raw "Attribute import to" foundOtherl10n_community.test501L10nServerTestCase->testImport()
Trying to get property of non-objectNoticel10n_community.test505L10nServerTestCase->testImport()
Failed to set field files[file] to sites/default/modules/l10n_server/l10n_community/tests/l10n_community_test.poOtherl10n_community.test665L10nServerTestCase->importPO()
Failed to set field import_uid to Otherl10n_community.test665L10nServerTestCase->importPO()
Found the Import buttonOtherl10n_community.test665L10nServerTestCase->importPO()
Found the requested form fields at translate/languages/hu/importOtherl10n_community.test665L10nServerTestCase->importPO()
sites/default/modules/l10n_server/l10n_community/tests/l10n_community_test.po imported successfully.Otherl10n_community.test667L10nServerTestCase->importPO()
Raw "3 suggestions added" foundOtherl10n_community.test506L10nServerTestCase->testImport()
Raw "1 duplicate translation not saved" foundOtherl10n_community.test507L10nServerTestCase->testImport()
Raw "2 source strings not found; their translations were ignored" foundOtherl10n_community.test508L10nServerTestCase->testImport()
Argument 1 passed to DrupalWebTestCase::drupalLogin() must be an instance of stdClass, boolean given, called in /var/lib/drupaltestbot/sites/default/files/checkout/sites/default/modules/l10n_server/l10n_community/tests/l10n_community.test on line 512 and definedRecoverable errordrupal_web_test_case.php1252DrupalWebTestCase->drupalLogin()
Trying to get property of non-objectNoticedrupal_web_test_case.php1258DrupalWebTestCase->drupalLogin()
Trying to get property of non-objectNoticedrupal_web_test_case.php1259DrupalWebTestCase->drupalLogin()
Failed to set field name to Otherl10n_community.test512L10nServerTestCase->testImport()
Failed to set field pass to Otherl10n_community.test512L10nServerTestCase->testImport()
Found the requested form fields at userOtherl10n_community.test512L10nServerTestCase->testImport()
Trying to get property of non-objectNoticedrupal_web_test_case.php1265DrupalWebTestCase->drupalLogin()
User successfully logged in.User loginl10n_community.test512L10nServerTestCase->testImport()
String "This is a test string." foundOtherl10n_community.test517L10nServerTestCase->testImport()
Singular/plural string "1 test string/@count test strings" foundOtherl10n_community.test518L10nServerTestCase->testImport()
String "Test string in context" found in context "Test context"Otherl10n_community.test519L10nServerTestCase->testImport()
"<td class="source"" found 3 timesOtherl10n_community.test520L10nServerTestCase->testImport()
String "This is a test string. - imported translation" foundOtherl10n_community.test528L10nServerTestCase->testImport()
Singular/plural string "1 test string - imported translation/@count test strings - imported translation" foundOtherl10n_community.test529L10nServerTestCase->testImport()
String "Test string in context - imported translation" foundOtherl10n_community.test530L10nServerTestCase->testImport()
Trying to get property of non-objectNoticel10n_community.test531L10nServerTestCase->testImport()
"by " found 3 timesOtherl10n_community.test531L10nServerTestCase->testImport()
Raw "Gettext .po file with translations" foundOtherl10n_community.test537L10nServerTestCase->testImport()
Raw "Store as approved translations" foundOtherl10n_community.test538L10nServerTestCase->testImport()
Raw "Attribute import to" foundOtherl10n_community.test539L10nServerTestCase->testImport()
Trying to get property of non-objectNoticel10n_community.test544L10nServerTestCase->testImport()
Failed to set field files[file] to sites/default/modules/l10n_server/l10n_community/tests/l10n_community_test.poOtherl10n_community.test665L10nServerTestCase->importPO()
Failed to set field is_suggestion to 1Otherl10n_community.test665L10nServerTestCase->importPO()
Failed to set field import_uid to Otherl10n_community.test665L10nServerTestCase->importPO()
Found the Import buttonOtherl10n_community.test665L10nServerTestCase->importPO()
Found the requested form fields at translate/languages/hu/importOtherl10n_community.test665L10nServerTestCase->importPO()
sites/default/modules/l10n_server/l10n_community/tests/l10n_community_test.po imported successfully.Otherl10n_community.test667L10nServerTestCase->importPO()
Raw "4 duplicate translations not saved" foundOtherl10n_community.test545L10nServerTestCase->testImport()
Raw "2 source strings not found; their translations were ignored" foundOtherl10n_community.test546L10nServerTestCase->testImport()
PDOException: SQLSTATE[42S02]: Base table or view not found: 1146 Table 'drupaltestbotmysql.simpletest799200l10n_server_translation' doesn't exist: UPDATE {l10n_server_translation} SET translation=:db_update_placeholder_0 WHERE (translation = :db_condition_placeholder_0) AND (is_suggestion = :db_condition_placeholder_1) ; Array ( [:db_update_placeholder_0] => saved for testing [:db_condition_placeholder_0] => This is a test string. - imported translation [:db_condition_placeholder_1] => 1 ) in L10nServerTestCase->testImport() (line 555 of /var/lib/drupaltestbot/sites/default/files/checkout/sites/default/modules/l10n_server/l10n_community/tests/l10n_community.test).Uncaught exceptiondatabase.inc2171PDOStatement->execute()