pathologic_2575361_editable.patch

Test status
StatusResult
Last receivedSat, 09/26/2015 - 06:54:02
Last requestedSat, 09/26/2015 - 06:55:01
Last testedSat, 09/26/2015 - 06:55:26
Test count1
Environment status
PHP 5.5 MySQLfail
File information
Filepathologic_2575361_editable.patch
BranchPathologic - 8.x-1.x
LinkIssue Link
SummaryFAILED: [[SimpleTest]]: [PHP 5.5 MySQL] 0 pass(es), 1 fail(s), and 1 exception(s).
Details

PHP 5.5 MySQL

  1. Setup environment
  2. Detect an invalid patch URL
  3. Detect invalid repository information
  4. Detect invalid patch format
  5. Detect a non-applicable patch
  6. Detect invalid PHP syntax
  7. Detect a Drupal installation failure
  8. Detect a test run failure
  9. Detect a failing test
    Review the test failures below then if necessary run them locally until the problem has been fixed.
  10. Complete test suite with all tests passing
0 pass(es), 1 fail(s), and 1 exception(s)

Non-pass

Test namePassFailException
ExpandDrupal\pathologic\Tests\PathologicTest011
MessageGroupFilenameLineFunctionStatus
The test did not complete due to a fatal error.Completion checkPathologicTest.php25Drupal\pathologic\Tests\PathologicTest->testPathologic()
Drupal\Core\Config\Schema\SchemaIncompleteException: Schema errors for pathologic.settings with the following errors: pathologic.settings:langcode missing schema in Drupal\Core\Config\Testing\ConfigSchemaChecker->onConfigSave() (line 98 of /var/lib/drupaltestbot/sites/default/files/checkout/core/lib/Drupal/Core/Config/Testing/ConfigSchemaChecker.php). Drupal\Core\Config\Testing\ConfigSchemaChecker->onConfigSave(Object, 'config.save', Object) Drupal\Component\EventDispatcher\ContainerAwareEventDispatcher->dispatch('config.save', Object) Drupal\Core\Config\Config->save(1) Drupal\Core\Config\ConfigInstaller->createConfiguration('', Array) Drupal\Core\Config\ConfigInstaller->installDefaultConfig('module', 'pathologic') Drupal\Core\ProxyClass\Config\ConfigInstaller->installDefaultConfig('module', 'pathologic') Drupal\Core\Extension\ModuleInstaller->install(Array, 1) Drupal\Core\ProxyClass\Extension\ModuleInstaller->install(Array, 1) Drupal\simpletest\WebTestBase->installModulesFromClassProperty(Object) Drupal\simpletest\WebTestBase->setUp() Drupal\simpletest\TestBase->run(Array) simpletest_script_run_one_test('1', 'Drupal\pathologic\Tests\PathologicTest') Uncaught exceptionConfigSchemaChecker.php98Drupal\Core\Config\Testing\ConfigSchemaChecker->onConfigSave()

All

Test namePassFailException
ExpandDrupal\pathologic\Tests\PathologicTest011
MessageGroupFilenameLineFunctionStatus
The test did not complete due to a fatal error.Completion checkPathologicTest.php25Drupal\pathologic\Tests\PathologicTest->testPathologic()
Drupal\Core\Config\Schema\SchemaIncompleteException: Schema errors for pathologic.settings with the following errors: pathologic.settings:langcode missing schema in Drupal\Core\Config\Testing\ConfigSchemaChecker->onConfigSave() (line 98 of /var/lib/drupaltestbot/sites/default/files/checkout/core/lib/Drupal/Core/Config/Testing/ConfigSchemaChecker.php). Drupal\Core\Config\Testing\ConfigSchemaChecker->onConfigSave(Object, 'config.save', Object) Drupal\Component\EventDispatcher\ContainerAwareEventDispatcher->dispatch('config.save', Object) Drupal\Core\Config\Config->save(1) Drupal\Core\Config\ConfigInstaller->createConfiguration('', Array) Drupal\Core\Config\ConfigInstaller->installDefaultConfig('module', 'pathologic') Drupal\Core\ProxyClass\Config\ConfigInstaller->installDefaultConfig('module', 'pathologic') Drupal\Core\Extension\ModuleInstaller->install(Array, 1) Drupal\Core\ProxyClass\Extension\ModuleInstaller->install(Array, 1) Drupal\simpletest\WebTestBase->installModulesFromClassProperty(Object) Drupal\simpletest\WebTestBase->setUp() Drupal\simpletest\TestBase->run(Array) simpletest_script_run_one_test('1', 'Drupal\pathologic\Tests\PathologicTest') Uncaught exceptionConfigSchemaChecker.php98Drupal\Core\Config\Testing\ConfigSchemaChecker->onConfigSave()