2547747-18--remove_entity_function_calls.patch

Test status
StatusResult
Last receivedFri, 09/25/2015 - 22:06:00
Last requestedFri, 09/25/2015 - 22:06:01
Last testedFri, 09/25/2015 - 22:06:55
Test count1
Environment status
PHP 5.5 MySQLfail
File information
File2547747-18--remove_entity_function_calls.patch
BranchSearch API - 8.x-1.x
LinkIssue Link
SummaryFAILED: [[SimpleTest]]: [PHP 5.5 MySQL] 1,040 pass(es), 0 fail(s), and 1 exception(s).
Details

PHP 5.5 MySQL

  1. Setup environment
  2. Detect an invalid patch URL
  3. Detect invalid repository information
  4. Detect invalid patch format
  5. Detect a non-applicable patch
  6. Detect invalid PHP syntax
  7. Detect a Drupal installation failure
  8. Detect a test run failure
  9. Detect a failing test
    Review the test failures below then if necessary run them locally until the problem has been fixed.
  10. Complete test suite with all tests passing
1,040 pass(es), 0 fail(s), and 1 exception(s)

Non-pass

Test namePassFailException
ExpandDrupal\search_api_db\Tests\BackendTest15001
MessageGroupFilenameLineFunctionStatus
Drupal\Core\Field\FieldException: Attempt to create a field storage without a field name. in Drupal\field\Entity\FieldStorageConfig->__construct() (line 241 of /var/lib/drupaltestbot/sites/default/files/checkout/core/modules/field/src/Entity/FieldStorageConfig.php). Drupal\field\Entity\FieldStorageConfig->__construct(Array, 'field_storage_config') Drupal\Core\Config\Entity\ConfigEntityStorage->doCreate(Array) Drupal\Core\Entity\EntityStorageBase->create(Array) Drupal\search_api_db\Tests\BackendTest->regressionTests2() Drupal\search_api_db\Tests\BackendTest->testFramework() Drupal\simpletest\TestBase->run(Array) simpletest_script_run_one_test('2', 'Drupal\search_api_db\Tests\BackendTest') Uncaught exceptionFieldStorageConfig.php241Drupal\field\Entity\FieldStorageConfig->__construct()

All

Test namePassFailException
LeafDrupal\search_api\Tests\CustomDataTypesUnitTest1800
LeafDrupal\search_api\Tests\IndexStorageUnitTest500
LeafDrupal\search_api\Tests\IntegrationTest24900
LeafDrupal\search_api\Tests\LanguageIntegrationUnitTest3500
LeafDrupal\search_api\Tests\LocalActionsWebTest1500
LeafDrupal\search_api\Tests\OverviewPageTest12100
LeafDrupal\search_api\Tests\Processor\ContentAccessTest7200
LeafDrupal\search_api\Tests\Processor\ProcessorIntegrationTest7300
LeafDrupal\search_api\Tests\Processor\RenderedItemTest4600
LeafDrupal\search_api\Tests\ServerStorageUnitTest600
LeafDrupal\search_api\Tests\ServerTaskUnitTest5900
LeafDrupal\search_api\Tests\ViewsTest2800
ExpandDrupal\search_api_db\Tests\BackendTest15001
MessageGroupFilenameLineFunctionStatus
Drupal\Core\Field\FieldException: Attempt to create a field storage without a field name. in Drupal\field\Entity\FieldStorageConfig->__construct() (line 241 of /var/lib/drupaltestbot/sites/default/files/checkout/core/modules/field/src/Entity/FieldStorageConfig.php). Drupal\field\Entity\FieldStorageConfig->__construct(Array, 'field_storage_config') Drupal\Core\Config\Entity\ConfigEntityStorage->doCreate(Array) Drupal\Core\Entity\EntityStorageBase->create(Array) Drupal\search_api_db\Tests\BackendTest->regressionTests2() Drupal\search_api_db\Tests\BackendTest->testFramework() Drupal\simpletest\TestBase->run(Array) simpletest_script_run_one_test('2', 'Drupal\search_api_db\Tests\BackendTest') Uncaught exceptionFieldStorageConfig.php241Drupal\field\Entity\FieldStorageConfig->__construct()
LeafDrupal\search_api_db_defaults\Tests\IntegrationTest1800
LeafDrupal\Tests\search_api\Unit\Plugin\Processor\AddURLTest200
LeafDrupal\Tests\search_api\Unit\Plugin\Processor\AggregatedFieldTest900
LeafDrupal\Tests\search_api\Unit\Plugin\Processor\FieldsProcessorPluginBaseTest1300
LeafDrupal\Tests\search_api\Unit\Plugin\Processor\HighlightTest1300
LeafDrupal\Tests\search_api\Unit\Plugin\Processor\HtmlFilterTest2500
LeafDrupal\Tests\search_api\Unit\Plugin\Processor\IgnoreCaseTest400
LeafDrupal\Tests\search_api\Unit\Plugin\Processor\IgnoreCharacterTest3900
LeafDrupal\Tests\search_api\Unit\Plugin\Processor\LanguageTest200
LeafDrupal\Tests\search_api\Unit\Plugin\Processor\NodeStatusTest300
LeafDrupal\Tests\search_api\Unit\Plugin\Processor\RoleFilterTest200
LeafDrupal\Tests\search_api\Unit\Plugin\Processor\StopwordsTest800
LeafDrupal\Tests\search_api\Unit\Plugin\Processor\TokenizerTest2200
LeafDrupal\Tests\search_api\Unit\Plugin\Processor\TransliterationTest300