remove-unused-namespace-2574829-1-8.x-1.x.patch

Test status
StatusResult
Last receivedFri, 09/25/2015 - 12:47:00
Last requestedFri, 09/25/2015 - 16:31:09
Last testedFri, 09/25/2015 - 16:35:58
Test count1
Environment status
PHP 5.5 MySQLfail
File information
Fileremove-unused-namespace-2574829-1-8.x-1.x.patch
BranchRELAXed Web Services - 8.x-1.x
LinkIssue Link
SummaryFAILED: [[SimpleTest]]: [PHP 5.5 MySQL] 728 pass(es), 32 fail(s), and 5 exception(s).
Details

PHP 5.5 MySQL

  1. Setup environment
  2. Detect an invalid patch URL
  3. Detect invalid repository information
  4. Detect invalid patch format
  5. Detect a non-applicable patch
  6. Detect invalid PHP syntax
  7. Detect a Drupal installation failure
  8. Detect a test run failure
  9. Detect a failing test
    Review the test failures below then if necessary run them locally until the problem has been fixed.
  10. Complete test suite with all tests passing
728 pass(es), 32 fail(s), and 5 exception(s)

Non-pass

Test namePassFailException
ExpandDrupal\relaxed\Tests\AllDocsResourceTest1462
MessageGroupFilenameLineFunctionStatus
HTTP response code is correct.BrowserAllDocsResourceTest.php64Drupal\relaxed\Tests\AllDocsResourceTest->testGet()
Undefined index: messageDrupal\relaxed\Tests\AllDocsResourceTest->testGet() Drupal\simpletest\TestBase->run(Array) simpletest_script_run_one_test('19', 'Drupal\relaxed\Tests\AllDocsResourceTest') NoticeAllDocsResourceTest.php68Drupal\relaxed\Tests\AllDocsResourceTest->testGet()
Correct value for message key when not including docs. Value NULL is equal to value 'A fatal error occurred: Settings can not be serialized. This probably means you are serializing an object that has an indirect reference to the Settings object. Adjust your code so that is not necessary.'.OtherAllDocsResourceTest.php68Drupal\relaxed\Tests\AllDocsResourceTest->testGet()
HTTP response code is correct.BrowserAllDocsResourceTest.php100Drupal\relaxed\Tests\AllDocsResourceTest->testGet()
Undefined index: messageDrupal\relaxed\Tests\AllDocsResourceTest->testGet() Drupal\simpletest\TestBase->run(Array) simpletest_script_run_one_test('19', 'Drupal\relaxed\Tests\AllDocsResourceTest') NoticeAllDocsResourceTest.php104Drupal\relaxed\Tests\AllDocsResourceTest->testGet()
Correct value for message key when including docs. Value NULL is equal to value 'A fatal error occurred: Settings can not be serialized. This probably means you are serializing an object that has an indirect reference to the Settings object. Adjust your code so that is not necessary.'.OtherAllDocsResourceTest.php104Drupal\relaxed\Tests\AllDocsResourceTest->testGet()
[26-Sep-2015 02:33:41 Australia/Sydney] Uncaught PHP Exception LogicException: "Settings can not be serialized. This probably means you are serializing an object that has an indirect reference to the Settings object. Adjust your code so that is not necessary." at /var/lib/drupaltestbot/sites/default/files/checkout/core/lib/Drupal/Core/Site/Settings.php line 67 Fatal errorUnknown0Unknown
[26-Sep-2015 02:33:41 Australia/Sydney] Uncaught PHP Exception LogicException: "Settings can not be serialized. This probably means you are serializing an object that has an indirect reference to the Settings object. Adjust your code so that is not necessary." at /var/lib/drupaltestbot/sites/default/files/checkout/core/lib/Drupal/Core/Site/Settings.php line 67 Fatal errorUnknown0Unknown
ExpandDrupal\relaxed\Tests\ChangesResourceTest20150
MessageGroupFilenameLineFunctionStatus
HTTP response code is correct when not including docs.BrowserChangesResourceTest.php101Drupal\relaxed\Tests\ChangesResourceTest->testGet()
The result is correct when not including docs. Value array ( 'message' => 'A fatal error occurred: Settings can not be serialized. This probably means you are serializing an object that has an indirect reference to the Settings object. Adjust your code so that is not necessary.', ) is equal to value array ( 'last_seq' => 1443198817953230, 'results' => array ( 0 => array ( 'changes' => array ( 0 => array ( 'rev' => '1-6290c60a3ab7bb64839c0c8c8a4a5360', ), ), 'id' => '3b81c1e8-c514-4446-be02-027c7ea557fb', 'seq' => 1443198816923895, ), 1 => array ( 'changes' => array ( 0 => array ( 'rev' => '4-3e3dcd4c853999700bad651e5dc72d5b', ), ), 'id' => '3199fee0-2dba-43c7-933d-61e2450e78ae', 'seq' => 1443198817798625, ), 2 => array ( 'changes' => array ( 0 => array ( 'rev' => '3-fc4b186c669983f21985d1f836a18c00', ), ), 'id' => '13bed4c9-886a-4d4c-8d02-2fbd8cae1199', 'seq' => 1443198817953230, 'deleted' => true, ), ), ).OtherChangesResourceTest.php105Drupal\relaxed\Tests\ChangesResourceTest->testGet()
HTTP response code is correct when including docs.BrowserChangesResourceTest.php108Drupal\relaxed\Tests\ChangesResourceTest->testGet()
The result is correct when including docs. Value array ( 'message' => 'A fatal error occurred: Settings can not be serialized. This probably means you are serializing an object that has an indirect reference to the Settings object. Adjust your code so that is not necessary.', ) is equal to value array ( 'last_seq' => 1443198817953230, 'results' => array ( 0 => array ( 'changes' => array ( 0 => array ( 'rev' => '1-6290c60a3ab7bb64839c0c8c8a4a5360', ), ), 'id' => '3b81c1e8-c514-4446-be02-027c7ea557fb', 'seq' => 1443198816923895, 'doc' => array ( '@context' => array ( '_id' => '@id', 'user' => 'http://ec2-52-88-182-40.us-west-2.compute.amazonaws.com/checkout/rest/type/user/user', ), '@type' => 'user', '_id' => '3b81c1e8-c514-4446-be02-027c7ea557fb', 'langcode' => array ( 0 => array ( 'value' => 'en', ), ), 'preferred_langcode' => array ( 0 => array ( 'value' => 'en', ), ), 'preferred_admin_langcode' => array ( ), 'name' => array ( 0 => array ( 'value' => 'fR8liefs', ), ), 'pass' => array ( 0 => NULL, ), 'mail' => array ( 0 => array ( 'value' => 'fR8liefs@example.com', ), ), 'timezone' => array ( 0 => array ( 'value' => 'Australia/Sydney', ), ), 'status' => array ( 0 => array ( 'value' => '1', ), ), 'created' => array ( 0 => array ( 'value' => '1443198713', ), ), 'changed' => array ( 0 => array ( 'value' => '1443198713', ), ), 'access' => array ( 0 => array ( 'value' => '1443198817', ), ), 'login' => array ( 0 => array ( 'value' => '1443198817', ), ), 'init' => array ( ), 'roles' => array ( 0 => array ( 'target_id' => 'k4i0hzwb', ), ), 'default_langcode' => array ( 0 => array ( 'value' => '1', ), ), '_rev' => '1-6290c60a3ab7bb64839c0c8c8a4a5360', ), ), 1 => array ( 'changes' => array ( 0 => array ( 'rev' => '4-3e3dcd4c853999700bad651e5dc72d5b', ), ), 'id' => '3199fee0-2dba-43c7-933d-61e2450e78ae', 'seq' => 1443198817798625, 'doc' => array ( '@context' => array ( '_id' => '@id', 'entity_test_rev' => 'http://ec2-52-88-182-40.us-west-2.compute.amazonaws.com/checkout/rest/type/entity_test_rev/entity_test_rev', ), '@type' => 'entity_test_rev', '_id' => '3199fee0-2dba-43c7-933d-61e2450e78ae', 'langcode' => array ( 0 => array ( 'value' => 'en', ), ), 'name' => array ( 0 => array ( 'value' => '1SDYRJBC{*c7>&WM0X@a1qat#', ), ), 'type' => array ( 0 => array ( 'value' => 'entity_test_rev', ), ), 'created' => array ( 0 => array ( 'value' => 1443198713, ), ), 'user_id' => array ( 0 => array ( 'target_id' => 1, ), ), '_rev' => '4-3e3dcd4c853999700bad651e5dc72d5b', 'field_test_text' => array ( 0 => array ( 'value' => '7xP?>&0X', 'format' => 'plain_text', ), ), ), ), 2 => array ( 'changes' => array ( 0 => array ( 'rev' => '3-fc4b186c669983f21985d1f836a18c00', ), ), 'id' => '13bed4c9-886a-4d4c-8d02-2fbd8cae1199', 'seq' => 1443198817953230, 'doc' => array ( '@context' => array ( '_id' => '@id', 'entity_test_rev' => 'http://ec2-52-88-182-40.us-west-2.compute.amazonaws.com/checkout/rest/type/entity_test_rev/entity_test_rev', ), '@type' => 'entity_test_rev', '_id' => '13bed4c9-886a-4d4c-8d02-2fbd8cae1199', 'langcode' => array ( 0 => array ( 'value' => 'en', ), ), 'name' => array ( ), 'type' => array ( 0 => array ( 'value' => 'entity_test_rev', ), ), 'created' => array ( 0 => array ( 'value' => 1443198713, ), ), 'user_id' => array ( 0 => array ( 'target_id' => 1, ), ), '_deleted' => true, '_rev' => '3-fc4b186c669983f21985d1f836a18c00', 'field_test_text' => array ( 0 => array ( 'value' => 'm6l(>&b`', 'format' => 'plain_text', ), ), ), 'deleted' => true, ), ), ).OtherChangesResourceTest.php112Drupal\relaxed\Tests\ChangesResourceTest->testGet()
HTTP response code is correct when not including docs.BrowserChangesResourceTest.php116Drupal\relaxed\Tests\ChangesResourceTest->testGet()
The result is correct when not including docs. Value array ( 'message' => 'A fatal error occurred: Settings can not be serialized. This probably means you are serializing an object that has an indirect reference to the Settings object. Adjust your code so that is not necessary.', ) is equal to value array ( 'last_seq' => 1443198817953230, 'results' => array ( 0 => array ( 'changes' => array ( 0 => array ( 'rev' => '1-6290c60a3ab7bb64839c0c8c8a4a5360', ), ), 'id' => '3b81c1e8-c514-4446-be02-027c7ea557fb', 'seq' => 1443198816923895, ), 1 => array ( 'changes' => array ( 0 => array ( 'rev' => '4-3e3dcd4c853999700bad651e5dc72d5b', ), ), 'id' => '3199fee0-2dba-43c7-933d-61e2450e78ae', 'seq' => 1443198817798625, ), 2 => array ( 'changes' => array ( 0 => array ( 'rev' => '3-fc4b186c669983f21985d1f836a18c00', ), ), 'id' => '13bed4c9-886a-4d4c-8d02-2fbd8cae1199', 'seq' => 1443198817953230, 'deleted' => true, ), ), ).OtherChangesResourceTest.php120Drupal\relaxed\Tests\ChangesResourceTest->testGet()
HTTP response code is correct when not including docs.BrowserChangesResourceTest.php123Drupal\relaxed\Tests\ChangesResourceTest->testGet()
The result is correct when not including docs. Value array ( 'message' => 'A fatal error occurred: Settings can not be serialized. This probably means you are serializing an object that has an indirect reference to the Settings object. Adjust your code so that is not necessary.', ) is equal to value array ( 'last_seq' => 1443198817953230, 'results' => array ( 0 => array ( 'changes' => array ( 0 => array ( 'rev' => '3-fc4b186c669983f21985d1f836a18c00', ), ), 'id' => '13bed4c9-886a-4d4c-8d02-2fbd8cae1199', 'seq' => 1443198817953230, 'deleted' => true, ), ), ).OtherChangesResourceTest.php132Drupal\relaxed\Tests\ChangesResourceTest->testGet()
HTTP response code is correct when not including docs.BrowserChangesResourceTest.php135Drupal\relaxed\Tests\ChangesResourceTest->testGet()
The result is correct when not including docs. Value array ( 'message' => 'A fatal error occurred: Settings can not be serialized. This probably means you are serializing an object that has an indirect reference to the Settings object. Adjust your code so that is not necessary.', ) is equal to value array ( 'last_seq' => 1443198817953230, 'results' => array ( ), ).OtherChangesResourceTest.php141Drupal\relaxed\Tests\ChangesResourceTest->testGet()
[26-Sep-2015 02:33:38 Australia/Sydney] Uncaught PHP Exception LogicException: "Settings can not be serialized. This probably means you are serializing an object that has an indirect reference to the Settings object. Adjust your code so that is not necessary." at /var/lib/drupaltestbot/sites/default/files/checkout/core/lib/Drupal/Core/Site/Settings.php line 67 Fatal errorUnknown0Unknown
[26-Sep-2015 02:33:38 Australia/Sydney] Uncaught PHP Exception LogicException: "Settings can not be serialized. This probably means you are serializing an object that has an indirect reference to the Settings object. Adjust your code so that is not necessary." at /var/lib/drupaltestbot/sites/default/files/checkout/core/lib/Drupal/Core/Site/Settings.php line 67 Fatal errorUnknown0Unknown
[26-Sep-2015 02:33:38 Australia/Sydney] Uncaught PHP Exception LogicException: "Settings can not be serialized. This probably means you are serializing an object that has an indirect reference to the Settings object. Adjust your code so that is not necessary." at /var/lib/drupaltestbot/sites/default/files/checkout/core/lib/Drupal/Core/Site/Settings.php line 67 Fatal errorUnknown0Unknown
[26-Sep-2015 02:33:38 Australia/Sydney] Uncaught PHP Exception LogicException: "Settings can not be serialized. This probably means you are serializing an object that has an indirect reference to the Settings object. Adjust your code so that is not necessary." at /var/lib/drupaltestbot/sites/default/files/checkout/core/lib/Drupal/Core/Site/Settings.php line 67 Fatal errorUnknown0Unknown
[26-Sep-2015 02:33:38 Australia/Sydney] Uncaught PHP Exception LogicException: "Settings can not be serialized. This probably means you are serializing an object that has an indirect reference to the Settings object. Adjust your code so that is not necessary." at /var/lib/drupaltestbot/sites/default/files/checkout/core/lib/Drupal/Core/Site/Settings.php line 67 Fatal errorUnknown0Unknown
ExpandDrupal\relaxed\Tests\DocResourceTest13093
MessageGroupFilenameLineFunctionStatus
HTTP response header x-relaxed-etag with value 2-85147c011afedf8ad3655814a293532c found, actual value: 1-8f4e8c2d0d7d1a3df0216140b3977877BrowserDocResourceTest.php56Drupal\relaxed\Tests\DocResourceTest->testHead()
HTTP response code is correct.BrowserDocResourceTest.php64Drupal\relaxed\Tests\DocResourceTest->testHead()
HTTP response header x-relaxed-etag with value 2-85147c011afedf8ad3655814a293532c found, actual value: 1-8f4e8c2d0d7d1a3df0216140b3977877BrowserDocResourceTest.php72Drupal\relaxed\Tests\DocResourceTest->testHead()
HTTP response code is correct.BrowserDocResourceTest.php76Drupal\relaxed\Tests\DocResourceTest->testHead()
Undefined index: _revisionsDrupal\relaxed\Tests\DocResourceTest->testGet() Drupal\simpletest\TestBase->run(Array) simpletest_script_run_one_test('14', 'Drupal\relaxed\Tests\DocResourceTest') NoticeDocResourceTest.php113Drupal\relaxed\Tests\DocResourceTest->testGet()
Undefined index: _revisionsDrupal\relaxed\Tests\DocResourceTest->testGet() Drupal\simpletest\TestBase->run(Array) simpletest_script_run_one_test('14', 'Drupal\relaxed\Tests\DocResourceTest') NoticeDocResourceTest.php113Drupal\relaxed\Tests\DocResourceTest->testGet()
GET request returned correct revision list after first revision. Value '-' is equal to value '1-8f4e8c2d0d7d1a3df0216140b3977877'.OtherDocResourceTest.php114Drupal\relaxed\Tests\DocResourceTest->testGet()
Undefined index: _revisionsDrupal\relaxed\Tests\DocResourceTest->testGet() Drupal\simpletest\TestBase->run(Array) simpletest_script_run_one_test('14', 'Drupal\relaxed\Tests\DocResourceTest') NoticeDocResourceTest.php121Drupal\relaxed\Tests\DocResourceTest->testGet()
GET request returned correct revision list after second revision. Value 0 is equal to value 2.OtherDocResourceTest.php122Drupal\relaxed\Tests\DocResourceTest->testGet()
HTTP response code is correct.BrowserDocResourceTest.php126Drupal\relaxed\Tests\DocResourceTest->testGet()
HTTP response header x-relaxed-etag with value 2-62117364e0c8c039c1875a79f0d863ad found, actual value: 1-8f4e8c2d0d7d1a3df0216140b3977877BrowserDocResourceTest.php141Drupal\relaxed\Tests\DocResourceTest->testGet()
HTTP response code is correct.BrowserDocResourceTest.php145Drupal\relaxed\Tests\DocResourceTest->testGet()
ExpandDrupal\relaxed\Tests\RootResourceTest1310
MessageGroupFilenameLineFunctionStatus
Correct values in response. Value array ( 'couchdb' => Drupal\Core\StringTranslation\TranslatableString::__set_state(array( 'string' => 'Welcome', 'translatableString' => NULL, 'arguments' => array ( ), 'options' => array ( ), 'stringTranslation' => Drupal\Core\StringTranslation\TranslationManager::__set_state(array( 'translators' => array ( 30 => array ( 0 => Drupal\Core\StringTranslation\Translator\CustomStrings::__set_state(array( 'settings' => Drupal\Core\Site\Settings::__set_state(array( 'storage' => array ( 'hash_salt' => 'wbj_NchRm3TPX_ju3Gp7rCKZc4eD8ld-r2wm8IxQMe9ciEA88v5wivKIGgujz1sbvJS5d8z-eg', 'update_free_access' => false, 'container_yamls' => array ( 0 => '/var/lib/drupaltestbot/sites/default/files/checkout/sites/simpletest/277188/services.yml', ), 'file_public_path' => 'sites/simpletest/277188/files', 'file_private_path' => 'sites/simpletest/277188/private', 'test_parent_site' => 'sites/default', 'apcu_ensure_unique_prefix' => false, 'install_profile' => 'testing', ), '_serviceId' => 'settings', )), 'translations' => array ( 'en' => array ( ), '' => array ( ), ), '_serviceId' => 'string_translator.custom_strings', )), ), ), 'sortedTranslators' => array ( 0 => Drupal\Core\StringTranslation\Translator\CustomStrings::__set_state(array( 'settings' => Drupal\Core\Site\Settings::__set_state(array( 'storage' => array ( 'hash_salt' => 'wbj_NchRm3TPX_ju3Gp7rCKZc4eD8ld-r2wm8IxQMe9ciEA88v5wivKIGgujz1sbvJS5d8z-eg', 'update_free_access' => false, 'container_yamls' => array ( 0 => '/var/lib/drupaltestbot/sites/default/files/checkout/sites/simpletest/277188/services.yml', ), 'file_public_path' => 'sites/simpletest/277188/files', 'file_private_path' => 'sites/simpletest/277188/private', 'test_parent_site' => 'sites/default', 'apcu_ensure_unique_prefix' => false, 'install_profile' => 'testing', ), '_serviceId' => 'settings', )), 'translations' => array ( 'en' => array ( ), '' => array ( ), ), '_serviceId' => 'string_translator.custom_strings', )), ), 'defaultLangcode' => 'en', '_serviceId' => 'string_translation', )), )), 'uuid' => '0af93395-c50c-41cb-8546-7010077f8591', 'vendor' => array ( 'name' => 'Drupal', 'version' => '8.0.0-dev', ), 'version' => '8.0.0-dev', ) is identical to value array ( 'couchdb' => 'Welcome', 'uuid' => '0af93395-c50c-41cb-8546-7010077f8591', 'vendor' => array ( 'name' => 'Drupal', 'version' => '8.0.0-dev', ), 'version' => '8.0.0-dev', ).OtherRootResourceTest.php41Drupal\relaxed\Tests\RootResourceTest->testGet()
ExpandDrupal\relaxed\Tests\SessionResourceTest3010
MessageGroupFilenameLineFunctionStatus
Correct values in response. Value array ( 'info' => array ( ), 'ok' => true, 'userCtx' => array ( 'user' => 'test_user', 'roles' => array ( 0 => 'authenticated', 1 => 'jix0myuc', ), ), ) is identical to value array ( 'info' => array ( ), 'ok' => true, 'userCtx' => array ( 'user' => 'test_admin_user', 'roles' => array ( 0 => 'authenticated', 1 => 'kqekd1ws', 2 => '_admin', ), ), ).OtherSessionResourceTest.php75Drupal\relaxed\Tests\SessionResourceTest->testGet()

All

Test namePassFailException
LeafDrupal\relaxed\Tests\AllDbsResourceTest1400
ExpandDrupal\relaxed\Tests\AllDocsResourceTest1462
MessageGroupFilenameLineFunctionStatus
HTTP response code is correct.BrowserAllDocsResourceTest.php64Drupal\relaxed\Tests\AllDocsResourceTest->testGet()
Undefined index: messageDrupal\relaxed\Tests\AllDocsResourceTest->testGet() Drupal\simpletest\TestBase->run(Array) simpletest_script_run_one_test('19', 'Drupal\relaxed\Tests\AllDocsResourceTest') NoticeAllDocsResourceTest.php68Drupal\relaxed\Tests\AllDocsResourceTest->testGet()
Correct value for message key when not including docs. Value NULL is equal to value 'A fatal error occurred: Settings can not be serialized. This probably means you are serializing an object that has an indirect reference to the Settings object. Adjust your code so that is not necessary.'.OtherAllDocsResourceTest.php68Drupal\relaxed\Tests\AllDocsResourceTest->testGet()
HTTP response code is correct.BrowserAllDocsResourceTest.php100Drupal\relaxed\Tests\AllDocsResourceTest->testGet()
Undefined index: messageDrupal\relaxed\Tests\AllDocsResourceTest->testGet() Drupal\simpletest\TestBase->run(Array) simpletest_script_run_one_test('19', 'Drupal\relaxed\Tests\AllDocsResourceTest') NoticeAllDocsResourceTest.php104Drupal\relaxed\Tests\AllDocsResourceTest->testGet()
Correct value for message key when including docs. Value NULL is equal to value 'A fatal error occurred: Settings can not be serialized. This probably means you are serializing an object that has an indirect reference to the Settings object. Adjust your code so that is not necessary.'.OtherAllDocsResourceTest.php104Drupal\relaxed\Tests\AllDocsResourceTest->testGet()
[26-Sep-2015 02:33:41 Australia/Sydney] Uncaught PHP Exception LogicException: "Settings can not be serialized. This probably means you are serializing an object that has an indirect reference to the Settings object. Adjust your code so that is not necessary." at /var/lib/drupaltestbot/sites/default/files/checkout/core/lib/Drupal/Core/Site/Settings.php line 67 Fatal errorUnknown0Unknown
[26-Sep-2015 02:33:41 Australia/Sydney] Uncaught PHP Exception LogicException: "Settings can not be serialized. This probably means you are serializing an object that has an indirect reference to the Settings object. Adjust your code so that is not necessary." at /var/lib/drupaltestbot/sites/default/files/checkout/core/lib/Drupal/Core/Site/Settings.php line 67 Fatal errorUnknown0Unknown
LeafDrupal\relaxed\Tests\AttachmentResourceTest9200
LeafDrupal\relaxed\Tests\BulkDocsResourceTest5200
ExpandDrupal\relaxed\Tests\ChangesResourceTest20150
MessageGroupFilenameLineFunctionStatus
HTTP response code is correct when not including docs.BrowserChangesResourceTest.php101Drupal\relaxed\Tests\ChangesResourceTest->testGet()
The result is correct when not including docs. Value array ( 'message' => 'A fatal error occurred: Settings can not be serialized. This probably means you are serializing an object that has an indirect reference to the Settings object. Adjust your code so that is not necessary.', ) is equal to value array ( 'last_seq' => 1443198817953230, 'results' => array ( 0 => array ( 'changes' => array ( 0 => array ( 'rev' => '1-6290c60a3ab7bb64839c0c8c8a4a5360', ), ), 'id' => '3b81c1e8-c514-4446-be02-027c7ea557fb', 'seq' => 1443198816923895, ), 1 => array ( 'changes' => array ( 0 => array ( 'rev' => '4-3e3dcd4c853999700bad651e5dc72d5b', ), ), 'id' => '3199fee0-2dba-43c7-933d-61e2450e78ae', 'seq' => 1443198817798625, ), 2 => array ( 'changes' => array ( 0 => array ( 'rev' => '3-fc4b186c669983f21985d1f836a18c00', ), ), 'id' => '13bed4c9-886a-4d4c-8d02-2fbd8cae1199', 'seq' => 1443198817953230, 'deleted' => true, ), ), ).OtherChangesResourceTest.php105Drupal\relaxed\Tests\ChangesResourceTest->testGet()
HTTP response code is correct when including docs.BrowserChangesResourceTest.php108Drupal\relaxed\Tests\ChangesResourceTest->testGet()
The result is correct when including docs. Value array ( 'message' => 'A fatal error occurred: Settings can not be serialized. This probably means you are serializing an object that has an indirect reference to the Settings object. Adjust your code so that is not necessary.', ) is equal to value array ( 'last_seq' => 1443198817953230, 'results' => array ( 0 => array ( 'changes' => array ( 0 => array ( 'rev' => '1-6290c60a3ab7bb64839c0c8c8a4a5360', ), ), 'id' => '3b81c1e8-c514-4446-be02-027c7ea557fb', 'seq' => 1443198816923895, 'doc' => array ( '@context' => array ( '_id' => '@id', 'user' => 'http://ec2-52-88-182-40.us-west-2.compute.amazonaws.com/checkout/rest/type/user/user', ), '@type' => 'user', '_id' => '3b81c1e8-c514-4446-be02-027c7ea557fb', 'langcode' => array ( 0 => array ( 'value' => 'en', ), ), 'preferred_langcode' => array ( 0 => array ( 'value' => 'en', ), ), 'preferred_admin_langcode' => array ( ), 'name' => array ( 0 => array ( 'value' => 'fR8liefs', ), ), 'pass' => array ( 0 => NULL, ), 'mail' => array ( 0 => array ( 'value' => 'fR8liefs@example.com', ), ), 'timezone' => array ( 0 => array ( 'value' => 'Australia/Sydney', ), ), 'status' => array ( 0 => array ( 'value' => '1', ), ), 'created' => array ( 0 => array ( 'value' => '1443198713', ), ), 'changed' => array ( 0 => array ( 'value' => '1443198713', ), ), 'access' => array ( 0 => array ( 'value' => '1443198817', ), ), 'login' => array ( 0 => array ( 'value' => '1443198817', ), ), 'init' => array ( ), 'roles' => array ( 0 => array ( 'target_id' => 'k4i0hzwb', ), ), 'default_langcode' => array ( 0 => array ( 'value' => '1', ), ), '_rev' => '1-6290c60a3ab7bb64839c0c8c8a4a5360', ), ), 1 => array ( 'changes' => array ( 0 => array ( 'rev' => '4-3e3dcd4c853999700bad651e5dc72d5b', ), ), 'id' => '3199fee0-2dba-43c7-933d-61e2450e78ae', 'seq' => 1443198817798625, 'doc' => array ( '@context' => array ( '_id' => '@id', 'entity_test_rev' => 'http://ec2-52-88-182-40.us-west-2.compute.amazonaws.com/checkout/rest/type/entity_test_rev/entity_test_rev', ), '@type' => 'entity_test_rev', '_id' => '3199fee0-2dba-43c7-933d-61e2450e78ae', 'langcode' => array ( 0 => array ( 'value' => 'en', ), ), 'name' => array ( 0 => array ( 'value' => '1SDYRJBC{*c7>&WM0X@a1qat#', ), ), 'type' => array ( 0 => array ( 'value' => 'entity_test_rev', ), ), 'created' => array ( 0 => array ( 'value' => 1443198713, ), ), 'user_id' => array ( 0 => array ( 'target_id' => 1, ), ), '_rev' => '4-3e3dcd4c853999700bad651e5dc72d5b', 'field_test_text' => array ( 0 => array ( 'value' => '7xP?>&0X', 'format' => 'plain_text', ), ), ), ), 2 => array ( 'changes' => array ( 0 => array ( 'rev' => '3-fc4b186c669983f21985d1f836a18c00', ), ), 'id' => '13bed4c9-886a-4d4c-8d02-2fbd8cae1199', 'seq' => 1443198817953230, 'doc' => array ( '@context' => array ( '_id' => '@id', 'entity_test_rev' => 'http://ec2-52-88-182-40.us-west-2.compute.amazonaws.com/checkout/rest/type/entity_test_rev/entity_test_rev', ), '@type' => 'entity_test_rev', '_id' => '13bed4c9-886a-4d4c-8d02-2fbd8cae1199', 'langcode' => array ( 0 => array ( 'value' => 'en', ), ), 'name' => array ( ), 'type' => array ( 0 => array ( 'value' => 'entity_test_rev', ), ), 'created' => array ( 0 => array ( 'value' => 1443198713, ), ), 'user_id' => array ( 0 => array ( 'target_id' => 1, ), ), '_deleted' => true, '_rev' => '3-fc4b186c669983f21985d1f836a18c00', 'field_test_text' => array ( 0 => array ( 'value' => 'm6l(>&b`', 'format' => 'plain_text', ), ), ), 'deleted' => true, ), ), ).OtherChangesResourceTest.php112Drupal\relaxed\Tests\ChangesResourceTest->testGet()
HTTP response code is correct when not including docs.BrowserChangesResourceTest.php116Drupal\relaxed\Tests\ChangesResourceTest->testGet()
The result is correct when not including docs. Value array ( 'message' => 'A fatal error occurred: Settings can not be serialized. This probably means you are serializing an object that has an indirect reference to the Settings object. Adjust your code so that is not necessary.', ) is equal to value array ( 'last_seq' => 1443198817953230, 'results' => array ( 0 => array ( 'changes' => array ( 0 => array ( 'rev' => '1-6290c60a3ab7bb64839c0c8c8a4a5360', ), ), 'id' => '3b81c1e8-c514-4446-be02-027c7ea557fb', 'seq' => 1443198816923895, ), 1 => array ( 'changes' => array ( 0 => array ( 'rev' => '4-3e3dcd4c853999700bad651e5dc72d5b', ), ), 'id' => '3199fee0-2dba-43c7-933d-61e2450e78ae', 'seq' => 1443198817798625, ), 2 => array ( 'changes' => array ( 0 => array ( 'rev' => '3-fc4b186c669983f21985d1f836a18c00', ), ), 'id' => '13bed4c9-886a-4d4c-8d02-2fbd8cae1199', 'seq' => 1443198817953230, 'deleted' => true, ), ), ).OtherChangesResourceTest.php120Drupal\relaxed\Tests\ChangesResourceTest->testGet()
HTTP response code is correct when not including docs.BrowserChangesResourceTest.php123Drupal\relaxed\Tests\ChangesResourceTest->testGet()
The result is correct when not including docs. Value array ( 'message' => 'A fatal error occurred: Settings can not be serialized. This probably means you are serializing an object that has an indirect reference to the Settings object. Adjust your code so that is not necessary.', ) is equal to value array ( 'last_seq' => 1443198817953230, 'results' => array ( 0 => array ( 'changes' => array ( 0 => array ( 'rev' => '3-fc4b186c669983f21985d1f836a18c00', ), ), 'id' => '13bed4c9-886a-4d4c-8d02-2fbd8cae1199', 'seq' => 1443198817953230, 'deleted' => true, ), ), ).OtherChangesResourceTest.php132Drupal\relaxed\Tests\ChangesResourceTest->testGet()
HTTP response code is correct when not including docs.BrowserChangesResourceTest.php135Drupal\relaxed\Tests\ChangesResourceTest->testGet()
The result is correct when not including docs. Value array ( 'message' => 'A fatal error occurred: Settings can not be serialized. This probably means you are serializing an object that has an indirect reference to the Settings object. Adjust your code so that is not necessary.', ) is equal to value array ( 'last_seq' => 1443198817953230, 'results' => array ( ), ).OtherChangesResourceTest.php141Drupal\relaxed\Tests\ChangesResourceTest->testGet()
[26-Sep-2015 02:33:38 Australia/Sydney] Uncaught PHP Exception LogicException: "Settings can not be serialized. This probably means you are serializing an object that has an indirect reference to the Settings object. Adjust your code so that is not necessary." at /var/lib/drupaltestbot/sites/default/files/checkout/core/lib/Drupal/Core/Site/Settings.php line 67 Fatal errorUnknown0Unknown
[26-Sep-2015 02:33:38 Australia/Sydney] Uncaught PHP Exception LogicException: "Settings can not be serialized. This probably means you are serializing an object that has an indirect reference to the Settings object. Adjust your code so that is not necessary." at /var/lib/drupaltestbot/sites/default/files/checkout/core/lib/Drupal/Core/Site/Settings.php line 67 Fatal errorUnknown0Unknown
[26-Sep-2015 02:33:38 Australia/Sydney] Uncaught PHP Exception LogicException: "Settings can not be serialized. This probably means you are serializing an object that has an indirect reference to the Settings object. Adjust your code so that is not necessary." at /var/lib/drupaltestbot/sites/default/files/checkout/core/lib/Drupal/Core/Site/Settings.php line 67 Fatal errorUnknown0Unknown
[26-Sep-2015 02:33:38 Australia/Sydney] Uncaught PHP Exception LogicException: "Settings can not be serialized. This probably means you are serializing an object that has an indirect reference to the Settings object. Adjust your code so that is not necessary." at /var/lib/drupaltestbot/sites/default/files/checkout/core/lib/Drupal/Core/Site/Settings.php line 67 Fatal errorUnknown0Unknown
[26-Sep-2015 02:33:38 Australia/Sydney] Uncaught PHP Exception LogicException: "Settings can not be serialized. This probably means you are serializing an object that has an indirect reference to the Settings object. Adjust your code so that is not necessary." at /var/lib/drupaltestbot/sites/default/files/checkout/core/lib/Drupal/Core/Site/Settings.php line 67 Fatal errorUnknown0Unknown
LeafDrupal\relaxed\Tests\DbResourceTest7500
ExpandDrupal\relaxed\Tests\DocResourceTest13093
MessageGroupFilenameLineFunctionStatus
HTTP response header x-relaxed-etag with value 2-85147c011afedf8ad3655814a293532c found, actual value: 1-8f4e8c2d0d7d1a3df0216140b3977877BrowserDocResourceTest.php56Drupal\relaxed\Tests\DocResourceTest->testHead()
HTTP response code is correct.BrowserDocResourceTest.php64Drupal\relaxed\Tests\DocResourceTest->testHead()
HTTP response header x-relaxed-etag with value 2-85147c011afedf8ad3655814a293532c found, actual value: 1-8f4e8c2d0d7d1a3df0216140b3977877BrowserDocResourceTest.php72Drupal\relaxed\Tests\DocResourceTest->testHead()
HTTP response code is correct.BrowserDocResourceTest.php76Drupal\relaxed\Tests\DocResourceTest->testHead()
Undefined index: _revisionsDrupal\relaxed\Tests\DocResourceTest->testGet() Drupal\simpletest\TestBase->run(Array) simpletest_script_run_one_test('14', 'Drupal\relaxed\Tests\DocResourceTest') NoticeDocResourceTest.php113Drupal\relaxed\Tests\DocResourceTest->testGet()
Undefined index: _revisionsDrupal\relaxed\Tests\DocResourceTest->testGet() Drupal\simpletest\TestBase->run(Array) simpletest_script_run_one_test('14', 'Drupal\relaxed\Tests\DocResourceTest') NoticeDocResourceTest.php113Drupal\relaxed\Tests\DocResourceTest->testGet()
GET request returned correct revision list after first revision. Value '-' is equal to value '1-8f4e8c2d0d7d1a3df0216140b3977877'.OtherDocResourceTest.php114Drupal\relaxed\Tests\DocResourceTest->testGet()
Undefined index: _revisionsDrupal\relaxed\Tests\DocResourceTest->testGet() Drupal\simpletest\TestBase->run(Array) simpletest_script_run_one_test('14', 'Drupal\relaxed\Tests\DocResourceTest') NoticeDocResourceTest.php121Drupal\relaxed\Tests\DocResourceTest->testGet()
GET request returned correct revision list after second revision. Value 0 is equal to value 2.OtherDocResourceTest.php122Drupal\relaxed\Tests\DocResourceTest->testGet()
HTTP response code is correct.BrowserDocResourceTest.php126Drupal\relaxed\Tests\DocResourceTest->testGet()
HTTP response header x-relaxed-etag with value 2-62117364e0c8c039c1875a79f0d863ad found, actual value: 1-8f4e8c2d0d7d1a3df0216140b3977877BrowserDocResourceTest.php141Drupal\relaxed\Tests\DocResourceTest->testGet()
HTTP response code is correct.BrowserDocResourceTest.php145Drupal\relaxed\Tests\DocResourceTest->testGet()
LeafDrupal\relaxed\Tests\Encoder\StreamEncoderTest600
LeafDrupal\relaxed\Tests\EnsureFullCommitResourceTest1500
LeafDrupal\relaxed\Tests\LocalDocResourceTest4800
LeafDrupal\relaxed\Tests\Normalizer\AllDocsNormalizerTest1200
LeafDrupal\relaxed\Tests\Normalizer\AttachmentNormalizerTest2200
LeafDrupal\relaxed\Tests\Normalizer\BulkDocsNormalizerTest4400
LeafDrupal\relaxed\Tests\Normalizer\ContentEntityNormalizerTest4900
LeafDrupal\relaxed\Tests\Normalizer\FileItemNormalizerTest3300
LeafDrupal\relaxed\Tests\Normalizer\WorkspaceNormalizerTest2400
LeafDrupal\relaxed\Tests\ReplicationLogTest600
LeafDrupal\relaxed\Tests\RevsDiffResourceTest2900
ExpandDrupal\relaxed\Tests\RootResourceTest1310
MessageGroupFilenameLineFunctionStatus
Correct values in response. Value array ( 'couchdb' => Drupal\Core\StringTranslation\TranslatableString::__set_state(array( 'string' => 'Welcome', 'translatableString' => NULL, 'arguments' => array ( ), 'options' => array ( ), 'stringTranslation' => Drupal\Core\StringTranslation\TranslationManager::__set_state(array( 'translators' => array ( 30 => array ( 0 => Drupal\Core\StringTranslation\Translator\CustomStrings::__set_state(array( 'settings' => Drupal\Core\Site\Settings::__set_state(array( 'storage' => array ( 'hash_salt' => 'wbj_NchRm3TPX_ju3Gp7rCKZc4eD8ld-r2wm8IxQMe9ciEA88v5wivKIGgujz1sbvJS5d8z-eg', 'update_free_access' => false, 'container_yamls' => array ( 0 => '/var/lib/drupaltestbot/sites/default/files/checkout/sites/simpletest/277188/services.yml', ), 'file_public_path' => 'sites/simpletest/277188/files', 'file_private_path' => 'sites/simpletest/277188/private', 'test_parent_site' => 'sites/default', 'apcu_ensure_unique_prefix' => false, 'install_profile' => 'testing', ), '_serviceId' => 'settings', )), 'translations' => array ( 'en' => array ( ), '' => array ( ), ), '_serviceId' => 'string_translator.custom_strings', )), ), ), 'sortedTranslators' => array ( 0 => Drupal\Core\StringTranslation\Translator\CustomStrings::__set_state(array( 'settings' => Drupal\Core\Site\Settings::__set_state(array( 'storage' => array ( 'hash_salt' => 'wbj_NchRm3TPX_ju3Gp7rCKZc4eD8ld-r2wm8IxQMe9ciEA88v5wivKIGgujz1sbvJS5d8z-eg', 'update_free_access' => false, 'container_yamls' => array ( 0 => '/var/lib/drupaltestbot/sites/default/files/checkout/sites/simpletest/277188/services.yml', ), 'file_public_path' => 'sites/simpletest/277188/files', 'file_private_path' => 'sites/simpletest/277188/private', 'test_parent_site' => 'sites/default', 'apcu_ensure_unique_prefix' => false, 'install_profile' => 'testing', ), '_serviceId' => 'settings', )), 'translations' => array ( 'en' => array ( ), '' => array ( ), ), '_serviceId' => 'string_translator.custom_strings', )), ), 'defaultLangcode' => 'en', '_serviceId' => 'string_translation', )), )), 'uuid' => '0af93395-c50c-41cb-8546-7010077f8591', 'vendor' => array ( 'name' => 'Drupal', 'version' => '8.0.0-dev', ), 'version' => '8.0.0-dev', ) is identical to value array ( 'couchdb' => 'Welcome', 'uuid' => '0af93395-c50c-41cb-8546-7010077f8591', 'vendor' => array ( 'name' => 'Drupal', 'version' => '8.0.0-dev', ), 'version' => '8.0.0-dev', ).OtherRootResourceTest.php41Drupal\relaxed\Tests\RootResourceTest->testGet()
ExpandDrupal\relaxed\Tests\SessionResourceTest3010
MessageGroupFilenameLineFunctionStatus
Correct values in response. Value array ( 'info' => array ( ), 'ok' => true, 'userCtx' => array ( 'user' => 'test_user', 'roles' => array ( 0 => 'authenticated', 1 => 'jix0myuc', ), ), ) is identical to value array ( 'info' => array ( ), 'ok' => true, 'userCtx' => array ( 'user' => 'test_admin_user', 'roles' => array ( 0 => 'authenticated', 1 => 'kqekd1ws', 2 => '_admin', ), ), ).OtherSessionResourceTest.php75Drupal\relaxed\Tests\SessionResourceTest->testGet()