allow_multiple_local-2257033-57.patch

Test status
StatusResult
Last receivedFri, 09/25/2015 - 10:20:00
Last requestedFri, 09/25/2015 - 11:31:10
Last testedFri, 09/25/2015 - 11:34:17
Test count1
Environment status
PHP 5.5 MySQLfail
File information
Fileallow_multiple_local-2257033-57.patch
BranchTranslation Management Tool - 8.x-1.x
LinkIssue Link
SummaryFAILED: [[SimpleTest]]: [PHP 5.5 MySQL] 2,608 pass(es), 0 fail(s), and 8 exception(s).
Details

PHP 5.5 MySQL

  1. Setup environment
  2. Detect an invalid patch URL
  3. Detect invalid repository information
  4. Detect invalid patch format
  5. Detect a non-applicable patch
  6. Detect invalid PHP syntax
  7. Detect a Drupal installation failure
  8. Detect a test run failure
  9. Detect a failing test
    Review the test failures below then if necessary run them locally until the problem has been fixed.
  10. Complete test suite with all tests passing
2,608 pass(es), 0 fail(s), and 8 exception(s)

Non-pass

Test namePassFailException
ExpandDrupal\tmgmt\Tests\TMGMTUiTest58505
MessageGroupFilenameLineFunctionStatus
Drupal\Core\Config\Schema\SchemaIncompleteException: Schema errors for tmgmt.translator.cuddrvtl with the following errors: tmgmt.translator.cuddrvtl:remote_languages_mappings variable type is NULL but applied schema class is Drupal\Core\Config\Schema\Sequence in Drupal\Core\Config\Testing\ConfigSchemaChecker->onConfigSave() (line 98 of /var/lib/drupaltestbot/sites/default/files/checkout/core/lib/Drupal/Core/Config/Testing/ConfigSchemaChecker.php). Drupal\Core\Config\Testing\ConfigSchemaChecker->onConfigSave(Object, 'config.save', Object) Drupal\Component\EventDispatcher\ContainerAwareEventDispatcher->dispatch('config.save', Object) Drupal\Core\Config\Config->save() Drupal\Core\Config\Entity\ConfigEntityStorage->doSave('cuddrvtl', Object) Drupal\Core\Entity\EntityStorageBase->save(Object) Drupal\Core\Config\Entity\ConfigEntityStorage->save(Object) Drupal\Core\Entity\Entity->save() Drupal\Core\Config\Entity\ConfigEntityBase->save() Drupal\tmgmt\Tests\TMGMTTestBase->createTranslator() Drupal\tmgmt\Tests\TMGMTUiTest->testCheckoutFunction() Drupal\simpletest\TestBase->run(Array) simpletest_script_run_one_test('14', 'Drupal\tmgmt\Tests\TMGMTUiTest') Uncaught exceptionConfigSchemaChecker.php98Drupal\Core\Config\Testing\ConfigSchemaChecker->onConfigSave()
Drupal\Core\Config\Schema\SchemaIncompleteException: Schema errors for tmgmt.translator.cn0wzsuk with the following errors: tmgmt.translator.cn0wzsuk:remote_languages_mappings variable type is NULL but applied schema class is Drupal\Core\Config\Schema\Sequence in Drupal\Core\Config\Testing\ConfigSchemaChecker->onConfigSave() (line 98 of /var/lib/drupaltestbot/sites/default/files/checkout/core/lib/Drupal/Core/Config/Testing/ConfigSchemaChecker.php). Drupal\Core\Config\Testing\ConfigSchemaChecker->onConfigSave(Object, 'config.save', Object) Drupal\Component\EventDispatcher\ContainerAwareEventDispatcher->dispatch('config.save', Object) Drupal\Core\Config\Config->save() Drupal\Core\Config\Entity\ConfigEntityStorage->doSave('cn0wzsuk', Object) Drupal\Core\Entity\EntityStorageBase->save(Object) Drupal\Core\Config\Entity\ConfigEntityStorage->save(Object) Drupal\Core\Entity\Entity->save() Drupal\Core\Config\Entity\ConfigEntityBase->save() Drupal\tmgmt\Tests\TMGMTTestBase->createTranslator() Drupal\tmgmt\Tests\TMGMTUiTest->testReview() Drupal\simpletest\TestBase->run(Array) simpletest_script_run_one_test('14', 'Drupal\tmgmt\Tests\TMGMTUiTest') Uncaught exceptionConfigSchemaChecker.php98Drupal\Core\Config\Testing\ConfigSchemaChecker->onConfigSave()
Drupal\Core\Config\Schema\SchemaIncompleteException: Schema errors for tmgmt.translator.mbbgoeye with the following errors: tmgmt.translator.mbbgoeye:remote_languages_mappings variable type is NULL but applied schema class is Drupal\Core\Config\Schema\Sequence in Drupal\Core\Config\Testing\ConfigSchemaChecker->onConfigSave() (line 98 of /var/lib/drupaltestbot/sites/default/files/checkout/core/lib/Drupal/Core/Config/Testing/ConfigSchemaChecker.php). Drupal\Core\Config\Testing\ConfigSchemaChecker->onConfigSave(Object, 'config.save', Object) Drupal\Component\EventDispatcher\ContainerAwareEventDispatcher->dispatch('config.save', Object) Drupal\Core\Config\Config->save() Drupal\Core\Config\Entity\ConfigEntityStorage->doSave('mbbgoeye', Object) Drupal\Core\Entity\EntityStorageBase->save(Object) Drupal\Core\Config\Entity\ConfigEntityStorage->save(Object) Drupal\Core\Entity\Entity->save() Drupal\Core\Config\Entity\ConfigEntityBase->save() Drupal\tmgmt\Tests\TMGMTTestBase->createTranslator() Drupal\tmgmt\Tests\TMGMTUiTest->testAbortJob() Drupal\simpletest\TestBase->run(Array) simpletest_script_run_one_test('14', 'Drupal\tmgmt\Tests\TMGMTUiTest') Uncaught exceptionConfigSchemaChecker.php98Drupal\Core\Config\Testing\ConfigSchemaChecker->onConfigSave()
Drupal\Core\Config\Schema\SchemaIncompleteException: Schema errors for tmgmt.translator.pb0rip5n with the following errors: tmgmt.translator.pb0rip5n:remote_languages_mappings variable type is NULL but applied schema class is Drupal\Core\Config\Schema\Sequence in Drupal\Core\Config\Testing\ConfigSchemaChecker->onConfigSave() (line 98 of /var/lib/drupaltestbot/sites/default/files/checkout/core/lib/Drupal/Core/Config/Testing/ConfigSchemaChecker.php). Drupal\Core\Config\Testing\ConfigSchemaChecker->onConfigSave(Object, 'config.save', Object) Drupal\Component\EventDispatcher\ContainerAwareEventDispatcher->dispatch('config.save', Object) Drupal\Core\Config\Config->save() Drupal\Core\Config\Entity\ConfigEntityStorage->doSave('pb0rip5n', Object) Drupal\Core\Entity\EntityStorageBase->save(Object) Drupal\Core\Config\Entity\ConfigEntityStorage->save(Object) Drupal\Core\Entity\Entity->save() Drupal\Core\Config\Entity\ConfigEntityBase->save() Drupal\tmgmt\Tests\TMGMTTestBase->createTranslator() Drupal\tmgmt\Tests\TMGMTUiTest->testPageTitles() Drupal\simpletest\TestBase->run(Array) simpletest_script_run_one_test('14', 'Drupal\tmgmt\Tests\TMGMTUiTest') Uncaught exceptionConfigSchemaChecker.php98Drupal\Core\Config\Testing\ConfigSchemaChecker->onConfigSave()
Drupal\Core\Config\Schema\SchemaIncompleteException: Schema errors for tmgmt.translator.asxfedeh with the following errors: tmgmt.translator.asxfedeh:remote_languages_mappings variable type is NULL but applied schema class is Drupal\Core\Config\Schema\Sequence in Drupal\Core\Config\Testing\ConfigSchemaChecker->onConfigSave() (line 98 of /var/lib/drupaltestbot/sites/default/files/checkout/core/lib/Drupal/Core/Config/Testing/ConfigSchemaChecker.php). Drupal\Core\Config\Testing\ConfigSchemaChecker->onConfigSave(Object, 'config.save', Object) Drupal\Component\EventDispatcher\ContainerAwareEventDispatcher->dispatch('config.save', Object) Drupal\Core\Config\Config->save() Drupal\Core\Config\Entity\ConfigEntityStorage->doSave('asxfedeh', Object) Drupal\Core\Entity\EntityStorageBase->save(Object) Drupal\Core\Config\Entity\ConfigEntityStorage->save(Object) Drupal\Core\Entity\Entity->save() Drupal\Core\Config\Entity\ConfigEntityBase->save() Drupal\tmgmt\Tests\TMGMTTestBase->createTranslator() Drupal\tmgmt\Tests\TMGMTUiTest->testJobItemDelete() Drupal\simpletest\TestBase->run(Array) simpletest_script_run_one_test('14', 'Drupal\tmgmt\Tests\TMGMTUiTest') Uncaught exceptionConfigSchemaChecker.php98Drupal\Core\Config\Testing\ConfigSchemaChecker->onConfigSave()
ExpandDrupal\tmgmt\Tests\TranslatorTest11001
MessageGroupFilenameLineFunctionStatus
Drupal\Core\Config\Schema\SchemaIncompleteException: Schema errors for tmgmt.translator.tw9mzwfb with the following errors: tmgmt.translator.tw9mzwfb:remote_languages_mappings variable type is NULL but applied schema class is Drupal\Core\Config\Schema\Sequence in Drupal\Core\Config\Testing\ConfigSchemaChecker->onConfigSave() (line 98 of /var/lib/drupaltestbot/sites/default/files/checkout/core/lib/Drupal/Core/Config/Testing/ConfigSchemaChecker.php). Drupal\Core\Config\Testing\ConfigSchemaChecker->onConfigSave(Object, 'config.save', Object) Drupal\Component\EventDispatcher\ContainerAwareEventDispatcher->dispatch('config.save', Object) Drupal\Core\Config\Config->save() Drupal\Core\Config\Entity\ConfigEntityStorage->doSave('tw9mzwfb', Object) Drupal\Core\Entity\EntityStorageBase->save(Object) Drupal\Core\Config\Entity\ConfigEntityStorage->save(Object) Drupal\Core\Entity\Entity->save() Drupal\Core\Config\Entity\ConfigEntityBase->save() Drupal\tmgmt\Tests\TMGMTTestBase->createTranslator() Drupal\tmgmt\Tests\TranslatorTest->testTranslatorHandling() Drupal\simpletest\TestBase->run(Array) simpletest_script_run_one_test('11', 'Drupal\tmgmt\Tests\TranslatorTest') Uncaught exceptionConfigSchemaChecker.php98Drupal\Core\Config\Testing\ConfigSchemaChecker->onConfigSave()
ExpandDrupal\tmgmt_file\Tests\FileTranslatorTest12802
MessageGroupFilenameLineFunctionStatus
Drupal\Core\Config\Schema\SchemaIncompleteException: Schema errors for tmgmt.translator.p1ppzmqw with the following errors: tmgmt.translator.p1ppzmqw:remote_languages_mappings variable type is NULL but applied schema class is Drupal\Core\Config\Schema\Sequence in Drupal\Core\Config\Testing\ConfigSchemaChecker->onConfigSave() (line 98 of /var/lib/drupaltestbot/sites/default/files/checkout/core/lib/Drupal/Core/Config/Testing/ConfigSchemaChecker.php). Drupal\Core\Config\Testing\ConfigSchemaChecker->onConfigSave(Object, 'config.save', Object) Drupal\Component\EventDispatcher\ContainerAwareEventDispatcher->dispatch('config.save', Object) Drupal\Core\Config\Config->save() Drupal\Core\Config\Entity\ConfigEntityStorage->doSave('p1ppzmqw', Object) Drupal\Core\Entity\EntityStorageBase->save(Object) Drupal\Core\Config\Entity\ConfigEntityStorage->save(Object) Drupal\Core\Entity\Entity->save() Drupal\Core\Config\Entity\ConfigEntityBase->save() Drupal\tmgmt\Tests\TMGMTTestBase->createTranslator(Array) Drupal\tmgmt_file\Tests\FileTranslatorTest->testXLIFFTextProcessing() Drupal\simpletest\TestBase->run(Array) simpletest_script_run_one_test('19', 'Drupal\tmgmt_file\Tests\FileTranslatorTest') Uncaught exceptionConfigSchemaChecker.php98Drupal\Core\Config\Testing\ConfigSchemaChecker->onConfigSave()
Drupal\Core\Config\Schema\SchemaIncompleteException: Schema errors for tmgmt.translator.w6qa3ksq with the following errors: tmgmt.translator.w6qa3ksq:remote_languages_mappings variable type is NULL but applied schema class is Drupal\Core\Config\Schema\Sequence in Drupal\Core\Config\Testing\ConfigSchemaChecker->onConfigSave() (line 98 of /var/lib/drupaltestbot/sites/default/files/checkout/core/lib/Drupal/Core/Config/Testing/ConfigSchemaChecker.php). Drupal\Core\Config\Testing\ConfigSchemaChecker->onConfigSave(Object, 'config.save', Object) Drupal\Component\EventDispatcher\ContainerAwareEventDispatcher->dispatch('config.save', Object) Drupal\Core\Config\Config->save() Drupal\Core\Config\Entity\ConfigEntityStorage->doSave('w6qa3ksq', Object) Drupal\Core\Entity\EntityStorageBase->save(Object) Drupal\Core\Config\Entity\ConfigEntityStorage->save(Object) Drupal\Core\Entity\Entity->save() Drupal\Core\Config\Entity\ConfigEntityBase->save() Drupal\tmgmt\Tests\TMGMTTestBase->createTranslator(Array) Drupal\tmgmt_file\Tests\FileTranslatorTest->testPrivate() Drupal\simpletest\TestBase->run(Array) simpletest_script_run_one_test('19', 'Drupal\tmgmt_file\Tests\FileTranslatorTest') Uncaught exceptionConfigSchemaChecker.php98Drupal\Core\Config\Testing\ConfigSchemaChecker->onConfigSave()

All

Test namePassFailException
LeafDrupal\tmgmt\Tests\CrudTest19900
LeafDrupal\tmgmt\Tests\HelperTest4300
LeafDrupal\tmgmt\Tests\LocalTasksTests3100
LeafDrupal\tmgmt\Tests\PluginsTest5000
LeafDrupal\tmgmt\Tests\TMGMTCartTest5200
ExpandDrupal\tmgmt\Tests\TMGMTUiTest58505
MessageGroupFilenameLineFunctionStatus
Drupal\Core\Config\Schema\SchemaIncompleteException: Schema errors for tmgmt.translator.cuddrvtl with the following errors: tmgmt.translator.cuddrvtl:remote_languages_mappings variable type is NULL but applied schema class is Drupal\Core\Config\Schema\Sequence in Drupal\Core\Config\Testing\ConfigSchemaChecker->onConfigSave() (line 98 of /var/lib/drupaltestbot/sites/default/files/checkout/core/lib/Drupal/Core/Config/Testing/ConfigSchemaChecker.php). Drupal\Core\Config\Testing\ConfigSchemaChecker->onConfigSave(Object, 'config.save', Object) Drupal\Component\EventDispatcher\ContainerAwareEventDispatcher->dispatch('config.save', Object) Drupal\Core\Config\Config->save() Drupal\Core\Config\Entity\ConfigEntityStorage->doSave('cuddrvtl', Object) Drupal\Core\Entity\EntityStorageBase->save(Object) Drupal\Core\Config\Entity\ConfigEntityStorage->save(Object) Drupal\Core\Entity\Entity->save() Drupal\Core\Config\Entity\ConfigEntityBase->save() Drupal\tmgmt\Tests\TMGMTTestBase->createTranslator() Drupal\tmgmt\Tests\TMGMTUiTest->testCheckoutFunction() Drupal\simpletest\TestBase->run(Array) simpletest_script_run_one_test('14', 'Drupal\tmgmt\Tests\TMGMTUiTest') Uncaught exceptionConfigSchemaChecker.php98Drupal\Core\Config\Testing\ConfigSchemaChecker->onConfigSave()
Drupal\Core\Config\Schema\SchemaIncompleteException: Schema errors for tmgmt.translator.cn0wzsuk with the following errors: tmgmt.translator.cn0wzsuk:remote_languages_mappings variable type is NULL but applied schema class is Drupal\Core\Config\Schema\Sequence in Drupal\Core\Config\Testing\ConfigSchemaChecker->onConfigSave() (line 98 of /var/lib/drupaltestbot/sites/default/files/checkout/core/lib/Drupal/Core/Config/Testing/ConfigSchemaChecker.php). Drupal\Core\Config\Testing\ConfigSchemaChecker->onConfigSave(Object, 'config.save', Object) Drupal\Component\EventDispatcher\ContainerAwareEventDispatcher->dispatch('config.save', Object) Drupal\Core\Config\Config->save() Drupal\Core\Config\Entity\ConfigEntityStorage->doSave('cn0wzsuk', Object) Drupal\Core\Entity\EntityStorageBase->save(Object) Drupal\Core\Config\Entity\ConfigEntityStorage->save(Object) Drupal\Core\Entity\Entity->save() Drupal\Core\Config\Entity\ConfigEntityBase->save() Drupal\tmgmt\Tests\TMGMTTestBase->createTranslator() Drupal\tmgmt\Tests\TMGMTUiTest->testReview() Drupal\simpletest\TestBase->run(Array) simpletest_script_run_one_test('14', 'Drupal\tmgmt\Tests\TMGMTUiTest') Uncaught exceptionConfigSchemaChecker.php98Drupal\Core\Config\Testing\ConfigSchemaChecker->onConfigSave()
Drupal\Core\Config\Schema\SchemaIncompleteException: Schema errors for tmgmt.translator.mbbgoeye with the following errors: tmgmt.translator.mbbgoeye:remote_languages_mappings variable type is NULL but applied schema class is Drupal\Core\Config\Schema\Sequence in Drupal\Core\Config\Testing\ConfigSchemaChecker->onConfigSave() (line 98 of /var/lib/drupaltestbot/sites/default/files/checkout/core/lib/Drupal/Core/Config/Testing/ConfigSchemaChecker.php). Drupal\Core\Config\Testing\ConfigSchemaChecker->onConfigSave(Object, 'config.save', Object) Drupal\Component\EventDispatcher\ContainerAwareEventDispatcher->dispatch('config.save', Object) Drupal\Core\Config\Config->save() Drupal\Core\Config\Entity\ConfigEntityStorage->doSave('mbbgoeye', Object) Drupal\Core\Entity\EntityStorageBase->save(Object) Drupal\Core\Config\Entity\ConfigEntityStorage->save(Object) Drupal\Core\Entity\Entity->save() Drupal\Core\Config\Entity\ConfigEntityBase->save() Drupal\tmgmt\Tests\TMGMTTestBase->createTranslator() Drupal\tmgmt\Tests\TMGMTUiTest->testAbortJob() Drupal\simpletest\TestBase->run(Array) simpletest_script_run_one_test('14', 'Drupal\tmgmt\Tests\TMGMTUiTest') Uncaught exceptionConfigSchemaChecker.php98Drupal\Core\Config\Testing\ConfigSchemaChecker->onConfigSave()
Drupal\Core\Config\Schema\SchemaIncompleteException: Schema errors for tmgmt.translator.pb0rip5n with the following errors: tmgmt.translator.pb0rip5n:remote_languages_mappings variable type is NULL but applied schema class is Drupal\Core\Config\Schema\Sequence in Drupal\Core\Config\Testing\ConfigSchemaChecker->onConfigSave() (line 98 of /var/lib/drupaltestbot/sites/default/files/checkout/core/lib/Drupal/Core/Config/Testing/ConfigSchemaChecker.php). Drupal\Core\Config\Testing\ConfigSchemaChecker->onConfigSave(Object, 'config.save', Object) Drupal\Component\EventDispatcher\ContainerAwareEventDispatcher->dispatch('config.save', Object) Drupal\Core\Config\Config->save() Drupal\Core\Config\Entity\ConfigEntityStorage->doSave('pb0rip5n', Object) Drupal\Core\Entity\EntityStorageBase->save(Object) Drupal\Core\Config\Entity\ConfigEntityStorage->save(Object) Drupal\Core\Entity\Entity->save() Drupal\Core\Config\Entity\ConfigEntityBase->save() Drupal\tmgmt\Tests\TMGMTTestBase->createTranslator() Drupal\tmgmt\Tests\TMGMTUiTest->testPageTitles() Drupal\simpletest\TestBase->run(Array) simpletest_script_run_one_test('14', 'Drupal\tmgmt\Tests\TMGMTUiTest') Uncaught exceptionConfigSchemaChecker.php98Drupal\Core\Config\Testing\ConfigSchemaChecker->onConfigSave()
Drupal\Core\Config\Schema\SchemaIncompleteException: Schema errors for tmgmt.translator.asxfedeh with the following errors: tmgmt.translator.asxfedeh:remote_languages_mappings variable type is NULL but applied schema class is Drupal\Core\Config\Schema\Sequence in Drupal\Core\Config\Testing\ConfigSchemaChecker->onConfigSave() (line 98 of /var/lib/drupaltestbot/sites/default/files/checkout/core/lib/Drupal/Core/Config/Testing/ConfigSchemaChecker.php). Drupal\Core\Config\Testing\ConfigSchemaChecker->onConfigSave(Object, 'config.save', Object) Drupal\Component\EventDispatcher\ContainerAwareEventDispatcher->dispatch('config.save', Object) Drupal\Core\Config\Config->save() Drupal\Core\Config\Entity\ConfigEntityStorage->doSave('asxfedeh', Object) Drupal\Core\Entity\EntityStorageBase->save(Object) Drupal\Core\Config\Entity\ConfigEntityStorage->save(Object) Drupal\Core\Entity\Entity->save() Drupal\Core\Config\Entity\ConfigEntityBase->save() Drupal\tmgmt\Tests\TMGMTTestBase->createTranslator() Drupal\tmgmt\Tests\TMGMTUiTest->testJobItemDelete() Drupal\simpletest\TestBase->run(Array) simpletest_script_run_one_test('14', 'Drupal\tmgmt\Tests\TMGMTUiTest') Uncaught exceptionConfigSchemaChecker.php98Drupal\Core\Config\Testing\ConfigSchemaChecker->onConfigSave()
ExpandDrupal\tmgmt\Tests\TranslatorTest11001
MessageGroupFilenameLineFunctionStatus
Drupal\Core\Config\Schema\SchemaIncompleteException: Schema errors for tmgmt.translator.tw9mzwfb with the following errors: tmgmt.translator.tw9mzwfb:remote_languages_mappings variable type is NULL but applied schema class is Drupal\Core\Config\Schema\Sequence in Drupal\Core\Config\Testing\ConfigSchemaChecker->onConfigSave() (line 98 of /var/lib/drupaltestbot/sites/default/files/checkout/core/lib/Drupal/Core/Config/Testing/ConfigSchemaChecker.php). Drupal\Core\Config\Testing\ConfigSchemaChecker->onConfigSave(Object, 'config.save', Object) Drupal\Component\EventDispatcher\ContainerAwareEventDispatcher->dispatch('config.save', Object) Drupal\Core\Config\Config->save() Drupal\Core\Config\Entity\ConfigEntityStorage->doSave('tw9mzwfb', Object) Drupal\Core\Entity\EntityStorageBase->save(Object) Drupal\Core\Config\Entity\ConfigEntityStorage->save(Object) Drupal\Core\Entity\Entity->save() Drupal\Core\Config\Entity\ConfigEntityBase->save() Drupal\tmgmt\Tests\TMGMTTestBase->createTranslator() Drupal\tmgmt\Tests\TranslatorTest->testTranslatorHandling() Drupal\simpletest\TestBase->run(Array) simpletest_script_run_one_test('11', 'Drupal\tmgmt\Tests\TranslatorTest') Uncaught exceptionConfigSchemaChecker.php98Drupal\Core\Config\Testing\ConfigSchemaChecker->onConfigSave()
LeafDrupal\tmgmt\Tests\TranslatorUITest3000
LeafDrupal\tmgmt_config\Tests\ConfigSourceListTest24400
LeafDrupal\tmgmt_config\Tests\ConfigSourceUiTest26500
LeafDrupal\tmgmt_config\Tests\ConfigSourceUnitTest8900
LeafDrupal\tmgmt_content\Tests\ContentEntitySourceListTest16100
LeafDrupal\tmgmt_content\Tests\ContentEntitySourceUiTest29000
LeafDrupal\tmgmt_content\Tests\ContentEntitySourceUnitTest14600
LeafDrupal\tmgmt_content\Tests\ContentEntitySuggestionsTest2400
LeafDrupal\tmgmt_demo\Tests\TMGMTDemoTest4800
ExpandDrupal\tmgmt_file\Tests\FileTranslatorTest12802
MessageGroupFilenameLineFunctionStatus
Drupal\Core\Config\Schema\SchemaIncompleteException: Schema errors for tmgmt.translator.p1ppzmqw with the following errors: tmgmt.translator.p1ppzmqw:remote_languages_mappings variable type is NULL but applied schema class is Drupal\Core\Config\Schema\Sequence in Drupal\Core\Config\Testing\ConfigSchemaChecker->onConfigSave() (line 98 of /var/lib/drupaltestbot/sites/default/files/checkout/core/lib/Drupal/Core/Config/Testing/ConfigSchemaChecker.php). Drupal\Core\Config\Testing\ConfigSchemaChecker->onConfigSave(Object, 'config.save', Object) Drupal\Component\EventDispatcher\ContainerAwareEventDispatcher->dispatch('config.save', Object) Drupal\Core\Config\Config->save() Drupal\Core\Config\Entity\ConfigEntityStorage->doSave('p1ppzmqw', Object) Drupal\Core\Entity\EntityStorageBase->save(Object) Drupal\Core\Config\Entity\ConfigEntityStorage->save(Object) Drupal\Core\Entity\Entity->save() Drupal\Core\Config\Entity\ConfigEntityBase->save() Drupal\tmgmt\Tests\TMGMTTestBase->createTranslator(Array) Drupal\tmgmt_file\Tests\FileTranslatorTest->testXLIFFTextProcessing() Drupal\simpletest\TestBase->run(Array) simpletest_script_run_one_test('19', 'Drupal\tmgmt_file\Tests\FileTranslatorTest') Uncaught exceptionConfigSchemaChecker.php98Drupal\Core\Config\Testing\ConfigSchemaChecker->onConfigSave()
Drupal\Core\Config\Schema\SchemaIncompleteException: Schema errors for tmgmt.translator.w6qa3ksq with the following errors: tmgmt.translator.w6qa3ksq:remote_languages_mappings variable type is NULL but applied schema class is Drupal\Core\Config\Schema\Sequence in Drupal\Core\Config\Testing\ConfigSchemaChecker->onConfigSave() (line 98 of /var/lib/drupaltestbot/sites/default/files/checkout/core/lib/Drupal/Core/Config/Testing/ConfigSchemaChecker.php). Drupal\Core\Config\Testing\ConfigSchemaChecker->onConfigSave(Object, 'config.save', Object) Drupal\Component\EventDispatcher\ContainerAwareEventDispatcher->dispatch('config.save', Object) Drupal\Core\Config\Config->save() Drupal\Core\Config\Entity\ConfigEntityStorage->doSave('w6qa3ksq', Object) Drupal\Core\Entity\EntityStorageBase->save(Object) Drupal\Core\Config\Entity\ConfigEntityStorage->save(Object) Drupal\Core\Entity\Entity->save() Drupal\Core\Config\Entity\ConfigEntityBase->save() Drupal\tmgmt\Tests\TMGMTTestBase->createTranslator(Array) Drupal\tmgmt_file\Tests\FileTranslatorTest->testPrivate() Drupal\simpletest\TestBase->run(Array) simpletest_script_run_one_test('19', 'Drupal\tmgmt_file\Tests\FileTranslatorTest') Uncaught exceptionConfigSchemaChecker.php98Drupal\Core\Config\Testing\ConfigSchemaChecker->onConfigSave()
LeafDrupal\tmgmt_locale\Tests\LocaleSourceTest6300
LeafDrupal\tmgmt_locale\Tests\LocaleSourceUiTest5000