cart-manager.patch

Test status
StatusResult
Last receivedThu, 09/24/2015 - 20:55:02
Last requestedThu, 09/24/2015 - 20:56:01
Last testedThu, 09/24/2015 - 21:03:07
Test count1
Environment status
PHP 5.5 MySQLfail
File information
Filecart-manager.patch
BranchUbercart - 8.x-4.x
LinkIssue Link
SummaryFAILED: [[SimpleTest]]: [PHP 5.5 MySQL] 2,802 pass(es), 334 fail(s), and 73 exception(s).
Details

PHP 5.5 MySQL

  1. Setup environment
  2. Detect an invalid patch URL
  3. Detect invalid repository information
  4. Detect invalid patch format
  5. Detect a non-applicable patch
  6. Detect invalid PHP syntax
  7. Detect a Drupal installation failure
  8. Detect a test run failure
  9. Detect a failing test
    Review the test failures below then if necessary run them locally until the problem has been fixed.
  10. Complete test suite with all tests passing
2,802 pass(es), 334 fail(s), and 73 exception(s)

Non-pass

Test namePassFailException
ExpandDrupal\uc_attribute\Tests\AttributeTest411202
MessageGroupFilenameLineFunctionStatus
Attribute and selected option found in cartOtherAttributeTest.php745Drupal\uc_attribute\Tests\AttributeTest->testProductAttribute()
Adjusted price found in cartOtherAttributeTest.php746Drupal\uc_attribute\Tests\AttributeTest->testProductAttribute()
simplexml_import_dom(): Invalid Nodetype to importsimplexml_import_dom(Object) Drupal\simpletest\WebTestBase->parse() Drupal\simpletest\WebTestBase->drupalPostForm(NULL, Array, 'Checkout') Drupal\uc_attribute\Tests\AttributeTest->testProductAttribute() Drupal\simpletest\TestBase->run(Array) simpletest_script_run_one_test('5', 'Drupal\uc_attribute\Tests\AttributeTest') WarningAssertContentTrait.php138Drupal\simpletest\WebTestBase->parse()
Attribute and selected option found at checkoutOtherAttributeTest.php750Drupal\uc_attribute\Tests\AttributeTest->testProductAttribute()
Adjusted price found at checkoutOtherAttributeTest.php751Drupal\uc_attribute\Tests\AttributeTest->testProductAttribute()
simplexml_import_dom(): Invalid Nodetype to importsimplexml_import_dom(Object) Drupal\simpletest\WebTestBase->parse() Drupal\simpletest\WebTestBase->drupalPostForm('cart', Array, 'Checkout') Drupal\uc_store\Tests\UbercartTestBase->checkout() Drupal\uc_attribute\Tests\AttributeTest->testProductAttribute() Drupal\simpletest\TestBase->run(Array) simpletest_script_run_one_test('5', 'Drupal\uc_attribute\Tests\AttributeTest') WarningAssertContentTrait.php138Drupal\simpletest\WebTestBase->parse()
Viewed cart page: Billing pane has been displayed.OtherUbercartTestBase.php249Drupal\uc_store\Tests\UbercartTestBase->checkout()
Class 'Drupal\uc_cart\Controller\Cart' not foundPHP Fatal errorCartController.php25Unknown
Class 'Drupal\uc_cart\Controller\Cart' not foundPHP Fatal errorCartController.php25Unknown
Call to undefined method Drupal\uc_cart\CartManager::entityManager()PHP Fatal errorCartManager.php85Unknown
Option selected on cart item.OtherAttributeTest.php806Drupal\uc_attribute\Tests\AttributeTest->testAttributeAddToCart()
Product has adjusted price.OtherAttributeTest.php807Drupal\uc_attribute\Tests\AttributeTest->testAttributeAddToCart()
Option selected on cart item.OtherAttributeTest.php806Drupal\uc_attribute\Tests\AttributeTest->testAttributeAddToCart()
Product has adjusted price.OtherAttributeTest.php807Drupal\uc_attribute\Tests\AttributeTest->testAttributeAddToCart()
Option selected on cart item.OtherAttributeTest.php806Drupal\uc_attribute\Tests\AttributeTest->testAttributeAddToCart()
Product has adjusted price.OtherAttributeTest.php807Drupal\uc_attribute\Tests\AttributeTest->testAttributeAddToCart()
Option selected on cart item.OtherAttributeTest.php806Drupal\uc_attribute\Tests\AttributeTest->testAttributeAddToCart()
Product has adjusted price.OtherAttributeTest.php807Drupal\uc_attribute\Tests\AttributeTest->testAttributeAddToCart()
Class 'Drupal\uc_cart\Controller\Cart' not foundPHP Fatal errorCartController.php25Unknown
Class 'Drupal\uc_cart\Controller\Cart' not foundPHP Fatal errorCartController.php25Unknown
Class 'Drupal\uc_cart\Controller\Cart' not foundPHP Fatal errorCartController.php25Unknown
Class 'Drupal\uc_cart\Controller\Cart' not foundPHP Fatal errorCartController.php25Unknown
ExpandDrupal\uc_cart\Tests\CartBlockTest6320
MessageGroupFilenameLineFunctionStatus
Class 'Drupal\uc_cart\Controller\Cart' not foundPHP Fatal errorCartController.php25Unknown
Class 'Drupal\uc_cart\Controller\Cart' not foundPHP Fatal errorCartController.php25Unknown
ExpandDrupal\uc_cart\Tests\CartCheckoutTest29110428
MessageGroupFilenameLineFunctionStatus
"There are no products in your shopping cart." foundOtherCartCheckoutTest.php117Drupal\uc_cart\Tests\CartCheckoutTest->testCart()
"fC20RC2u added to your shopping cart." foundOtherCartCheckoutTest.php121Drupal\uc_cart\Tests\CartCheckoutTest->testCart()
"hook_uc_cart_item_insert fired" foundOtherCartCheckoutTest.php122Drupal\uc_cart\Tests\CartCheckoutTest->testCart()
The product is in the cart.OtherCartCheckoutTest.php126Drupal\uc_cart\Tests\CartCheckoutTest->testCart()
simplexml_import_dom(): Invalid Nodetype to importsimplexml_import_dom(Object) Drupal\simpletest\WebTestBase->parse() Drupal\simpletest\WebTestBase->xpath('//textarea[@name="items[0][qty]"]|//input[@name="items[0][qty]"]|//select[@name="items[0][qty]"]') Drupal\simpletest\WebTestBase->assertFieldByXPath('//textarea[@name="items[0][qty]"]|//input[@name="items[0][qty]"]|//select[@name="items[0][qty]"]', 1, 'The product quantity is 1.', 'Browser') Drupal\simpletest\WebTestBase->assertFieldByName('items[0][qty]', 1, 'The product quantity is 1.') Drupal\uc_cart\Tests\CartCheckoutTest->testCart() Drupal\simpletest\TestBase->run(Array) simpletest_script_run_one_test('6', 'Drupal\uc_cart\Tests\CartCheckoutTest') WarningAssertContentTrait.php138Drupal\simpletest\WebTestBase->parse()
The product quantity is 1.BrowserCartCheckoutTest.php127Drupal\uc_cart\Tests\CartCheckoutTest->testCart()
"Your item(s) have been updated." foundOtherCartCheckoutTest.php131Drupal\uc_cart\Tests\CartCheckoutTest->testCart()
"hook_uc_cart_item_update fired" foundOtherCartCheckoutTest.php132Drupal\uc_cart\Tests\CartCheckoutTest->testCart()
simplexml_import_dom(): Invalid Nodetype to importsimplexml_import_dom(Object) Drupal\simpletest\WebTestBase->parse() Drupal\simpletest\WebTestBase->xpath('//textarea[@name="items[0][qty]"]|//input[@name="items[0][qty]"]|//select[@name="items[0][qty]"]') Drupal\simpletest\WebTestBase->assertFieldByXPath('//textarea[@name="items[0][qty]"]|//input[@name="items[0][qty]"]|//select[@name="items[0][qty]"]', 2, 'The product quantity is 2.', 'Browser') Drupal\simpletest\WebTestBase->assertFieldByName('items[0][qty]', 2, 'The product quantity is 2.') Drupal\uc_cart\Tests\CartCheckoutTest->testCart() Drupal\simpletest\TestBase->run(Array) simpletest_script_run_one_test('6', 'Drupal\uc_cart\Tests\CartCheckoutTest') WarningAssertContentTrait.php138Drupal\simpletest\WebTestBase->parse()
The product quantity is 2.BrowserCartCheckoutTest.php136Drupal\uc_cart\Tests\CartCheckoutTest->testCart()
simplexml_import_dom(): Invalid Nodetype to importsimplexml_import_dom(Object) Drupal\simpletest\WebTestBase->parse() Drupal\simpletest\WebTestBase->drupalPostForm('cart', Array, Object) Drupal\uc_cart\Tests\CartCheckoutTest->testCart() Drupal\simpletest\TestBase->run(Array) simpletest_script_run_one_test('6', 'Drupal\uc_cart\Tests\CartCheckoutTest') WarningAssertContentTrait.php138Drupal\simpletest\WebTestBase->parse()
"Your cart has been updated." foundOtherCartCheckoutTest.php141Drupal\uc_cart\Tests\CartCheckoutTest->testCart()
simplexml_import_dom(): Invalid Nodetype to importsimplexml_import_dom(Object) Drupal\simpletest\WebTestBase->parse() Drupal\simpletest\WebTestBase->xpath('//textarea[@name="items[0][qty]"]|//input[@name="items[0][qty]"]|//select[@name="items[0][qty]"]') Drupal\simpletest\WebTestBase->assertFieldByXPath('//textarea[@name="items[0][qty]"]|//input[@name="items[0][qty]"]|//select[@name="items[0][qty]"]', 34, 'The product quantity was updated.', 'Browser') Drupal\simpletest\WebTestBase->assertFieldByName('items[0][qty]', 34, 'The product quantity was updated.') Drupal\uc_cart\Tests\CartCheckoutTest->testCart() Drupal\simpletest\TestBase->run(Array) simpletest_script_run_one_test('6', 'Drupal\uc_cart\Tests\CartCheckoutTest') WarningAssertContentTrait.php138Drupal\simpletest\WebTestBase->parse()
The product quantity was updated.BrowserCartCheckoutTest.php142Drupal\uc_cart\Tests\CartCheckoutTest->testCart()
"hook_uc_cart_item_update fired" foundOtherCartCheckoutTest.php143Drupal\uc_cart\Tests\CartCheckoutTest->testCart()
simplexml_import_dom(): Invalid Nodetype to importsimplexml_import_dom(Object) Drupal\simpletest\WebTestBase->parse() Drupal\simpletest\WebTestBase->drupalPostForm('cart', Array, Object) Drupal\uc_cart\Tests\CartCheckoutTest->testCart() Drupal\simpletest\TestBase->run(Array) simpletest_script_run_one_test('6', 'Drupal\uc_cart\Tests\CartCheckoutTest') WarningAssertContentTrait.php138Drupal\simpletest\WebTestBase->parse()
"Your cart has been updated." foundOtherCartCheckoutTest.php147Drupal\uc_cart\Tests\CartCheckoutTest->testCart()
"There are no products in your shopping cart." foundOtherCartCheckoutTest.php148Drupal\uc_cart\Tests\CartCheckoutTest->testCart()
"hook_uc_cart_item_delete fired" foundOtherCartCheckoutTest.php149Drupal\uc_cart\Tests\CartCheckoutTest->testCart()
simplexml_import_dom(): Invalid Nodetype to importsimplexml_import_dom(Object) Drupal\simpletest\WebTestBase->parse() Drupal\simpletest\WebTestBase->drupalPostForm('cart', Array, Object) Drupal\uc_cart\Tests\CartCheckoutTest->testCart() Drupal\simpletest\TestBase->run(Array) simpletest_script_run_one_test('6', 'Drupal\uc_cart\Tests\CartCheckoutTest') WarningAssertContentTrait.php138Drupal\simpletest\WebTestBase->parse()
"fC20RC2u removed from your shopping cart." foundOtherCartCheckoutTest.php154Drupal\uc_cart\Tests\CartCheckoutTest->testCart()
"There are no products in your shopping cart." foundOtherCartCheckoutTest.php155Drupal\uc_cart\Tests\CartCheckoutTest->testCart()
"hook_uc_cart_item_delete fired" foundOtherCartCheckoutTest.php156Drupal\uc_cart\Tests\CartCheckoutTest->testCart()
simplexml_import_dom(): Invalid Nodetype to importsimplexml_import_dom(Object) Drupal\simpletest\WebTestBase->parse() Drupal\simpletest\WebTestBase->drupalPostForm('cart', Array, Object) Drupal\uc_cart\Tests\CartCheckoutTest->testCart() Drupal\simpletest\TestBase->run(Array) simpletest_script_run_one_test('6', 'Drupal\uc_cart\Tests\CartCheckoutTest') WarningAssertContentTrait.php138Drupal\simpletest\WebTestBase->parse()
simplexml_import_dom(): Invalid Nodetype to importsimplexml_import_dom(Object) Drupal\simpletest\WebTestBase->parse() Drupal\simpletest\WebTestBase->drupalPostForm(NULL, Array, Object) Drupal\uc_cart\Tests\CartCheckoutTest->testCart() Drupal\simpletest\TestBase->run(Array) simpletest_script_run_one_test('6', 'Drupal\uc_cart\Tests\CartCheckoutTest') WarningAssertContentTrait.php138Drupal\simpletest\WebTestBase->parse()
"There are no products in your shopping cart." foundOtherCartCheckoutTest.php165Drupal\uc_cart\Tests\CartCheckoutTest->testCart()
"hook_uc_cart_item_delete fired" foundOtherCartCheckoutTest.php166Drupal\uc_cart\Tests\CartCheckoutTest->testCart()
Class 'Drupal\uc_cart\Controller\Cart' not foundPHP Fatal errorCartController.php25Unknown
Class 'Drupal\uc_cart\Controller\Cart' not foundPHP Fatal errorCartController.php25Unknown
Class 'Drupal\uc_cart\Controller\Cart' not foundPHP Fatal errorCartController.php25Unknown
Class 'Drupal\uc_cart\Controller\Cart' not foundPHP Fatal errorCartController.php25Unknown
Class 'Drupal\uc_cart\Controller\Cart' not foundPHP Fatal errorCartController.php25Unknown
Class 'Drupal\uc_cart\Controller\Cart' not foundPHP Fatal errorCartController.php25Unknown
Class 'Drupal\uc_cart\Controller\Cart' not foundPHP Fatal errorCartController.php25Unknown
Class 'Drupal\uc_cart\Controller\Cart' not foundPHP Fatal errorCartController.php25Unknown
Class 'Drupal\uc_cart\Controller\Cart' not foundPHP Fatal errorCartController.php25Unknown
Class 'Drupal\uc_cart\Controller\Cart' not foundPHP Fatal errorCartController.php25Unknown
Class 'Drupal\uc_cart\Controller\Cart' not foundPHP Fatal errorCartController.php25Unknown
Class 'Drupal\uc_cart\Controller\Cart' not foundPHP Fatal errorCartController.php25Unknown
"prw8Pdsv added to your shopping cart." foundOtherCartCheckoutTest.php173Drupal\uc_cart\Tests\CartCheckoutTest->testCartMerge()
"prw8Pdsv added to your shopping cart." foundOtherCartCheckoutTest.php178Drupal\uc_cart\Tests\CartCheckoutTest->testCartMerge()
The product remains in the cart after logging in.OtherCartCheckoutTest.php183Drupal\uc_cart\Tests\CartCheckoutTest->testCartMerge()
simplexml_import_dom(): Invalid Nodetype to importsimplexml_import_dom(Object) Drupal\simpletest\WebTestBase->parse() Drupal\simpletest\WebTestBase->xpath('//textarea[@name="items[0][qty]"]|//input[@name="items[0][qty]"]|//select[@name="items[0][qty]"]') Drupal\simpletest\WebTestBase->assertFieldByXPath('//textarea[@name="items[0][qty]"]|//input[@name="items[0][qty]"]|//select[@name="items[0][qty]"]', 2, 'The product quantity is 2.', 'Browser') Drupal\simpletest\WebTestBase->assertFieldByName('items[0][qty]', 2, 'The product quantity is 2.') Drupal\uc_cart\Tests\CartCheckoutTest->testCartMerge() Drupal\simpletest\TestBase->run(Array) simpletest_script_run_one_test('6', 'Drupal\uc_cart\Tests\CartCheckoutTest') WarningAssertContentTrait.php138Drupal\simpletest\WebTestBase->parse()
The product quantity is 2.BrowserCartCheckoutTest.php184Drupal\uc_cart\Tests\CartCheckoutTest->testCartMerge()
Class 'Drupal\uc_cart\Controller\Cart' not foundPHP Fatal errorCartController.php25Unknown
Class 'Drupal\uc_cart\Controller\Cart' not foundPHP Fatal errorCartController.php25Unknown
Class 'Drupal\uc_cart\Controller\Cart' not foundPHP Fatal errorCartController.php25Unknown
"There are no products in your shopping cart." foundOtherCartCheckoutTest.php194Drupal\uc_cart\Tests\CartCheckoutTest->testDeletedCartItem()
Class 'Drupal\uc_cart\Controller\Cart' not foundPHP Fatal errorCartController.php25Unknown
Class 'Drupal\uc_cart\Controller\Cart' not foundPHP Fatal errorCartController.php25Unknown
simplexml_import_dom(): Invalid Nodetype to importsimplexml_import_dom(Object) Drupal\simpletest\WebTestBase->parse() Drupal\simpletest\WebTestBase->drupalPostForm('cart', Array, 'Checkout') Drupal\uc_store\Tests\UbercartTestBase->checkout() Drupal\uc_cart\Tests\CartCheckoutTest->testAuthenticatedCheckout() Drupal\simpletest\TestBase->run(Array) simpletest_script_run_one_test('6', 'Drupal\uc_cart\Tests\CartCheckoutTest') WarningAssertContentTrait.php138Drupal\simpletest\WebTestBase->parse()
Viewed cart page: Billing pane has been displayed.OtherUbercartTestBase.php249Drupal\uc_store\Tests\UbercartTestBase->checkout()
Raw "Your order is complete!" foundOtherCartCheckoutTest.php217Drupal\uc_cart\Tests\CartCheckoutTest->testAuthenticatedCheckout()
Raw "While logged in" foundOtherCartCheckoutTest.php218Drupal\uc_cart\Tests\CartCheckoutTest->testAuthenticatedCheckout()
"There are no products in your shopping cart." foundOtherCartCheckoutTest.php222Drupal\uc_cart\Tests\CartCheckoutTest->testAuthenticatedCheckout()
Class 'Drupal\uc_cart\Controller\Cart' not foundPHP Fatal errorCartController.php25Unknown
Class 'Drupal\uc_cart\Controller\Cart' not foundPHP Fatal errorCartController.php25Unknown
Call to undefined method Drupal\uc_cart\CartManager::entityManager()PHP Fatal errorCartManager.php85Unknown
Class 'Drupal\uc_cart\Controller\Cart' not foundPHP Fatal errorCartController.php25Unknown
simplexml_import_dom(): Invalid Nodetype to importsimplexml_import_dom(Object) Drupal\simpletest\WebTestBase->parse() Drupal\simpletest\WebTestBase->drupalPostForm('cart', Array, 'Checkout') Drupal\uc_store\Tests\UbercartTestBase->checkout() Drupal\uc_cart\Tests\CartCheckoutTest->testAnonymousCheckoutAccountGenerated() Drupal\simpletest\TestBase->run(Array) simpletest_script_run_one_test('6', 'Drupal\uc_cart\Tests\CartCheckoutTest') WarningAssertContentTrait.php138Drupal\simpletest\WebTestBase->parse()
Viewed cart page: Billing pane has been displayed.OtherUbercartTestBase.php249Drupal\uc_store\Tests\UbercartTestBase->checkout()
Raw "Your order is complete!" foundOtherCartCheckoutTest.php228Drupal\uc_cart\Tests\CartCheckoutTest->testAnonymousCheckoutAccountGenerated()
New username is not empty.OtherCartCheckoutTest.php234Drupal\uc_cart\Tests\CartCheckoutTest->testAnonymousCheckoutAccountGenerated()
New password is not empty.OtherCartCheckoutTest.php235Drupal\uc_cart\Tests\CartCheckoutTest->testAnonymousCheckoutAccountGenerated()
Trying to get property of non-objectDrupal\uc_cart\Tests\CartCheckoutTest->testAnonymousCheckoutAccountGenerated() Drupal\simpletest\TestBase->run(Array) simpletest_script_run_one_test('6', 'Drupal\uc_cart\Tests\CartCheckoutTest') NoticeCartCheckoutTest.php236Drupal\uc_cart\Tests\CartCheckoutTest->testAnonymousCheckoutAccountGenerated()
Trying to get property of non-objectDrupal\uc_cart\Tests\CartCheckoutTest->testAnonymousCheckoutAccountGenerated() Drupal\simpletest\TestBase->run(Array) simpletest_script_run_one_test('6', 'Drupal\uc_cart\Tests\CartCheckoutTest') NoticeCartCheckoutTest.php236Drupal\uc_cart\Tests\CartCheckoutTest->testAnonymousCheckoutAccountGenerated()
Mail body contains username.OtherCartCheckoutTest.php236Drupal\uc_cart\Tests\CartCheckoutTest->testAnonymousCheckoutAccountGenerated()
Trying to get property of non-objectDrupal\uc_cart\Tests\CartCheckoutTest->testAnonymousCheckoutAccountGenerated() Drupal\simpletest\TestBase->run(Array) simpletest_script_run_one_test('6', 'Drupal\uc_cart\Tests\CartCheckoutTest') NoticeCartCheckoutTest.php241Drupal\uc_cart\Tests\CartCheckoutTest->testAnonymousCheckoutAccountGenerated()
Trying to get property of non-objectDrupal\uc_cart\Tests\CartCheckoutTest->testAnonymousCheckoutAccountGenerated() Drupal\simpletest\TestBase->run(Array) simpletest_script_run_one_test('6', 'Drupal\uc_cart\Tests\CartCheckoutTest') NoticeCartCheckoutTest.php241Drupal\uc_cart\Tests\CartCheckoutTest->testAnonymousCheckoutAccountGenerated()
Invoice body contains username.OtherCartCheckoutTest.php241Drupal\uc_cart\Tests\CartCheckoutTest->testAnonymousCheckoutAccountGenerated()
Trying to get property of non-objectDrupal\uc_cart\Tests\CartCheckoutTest->testAnonymousCheckoutAccountGenerated() Drupal\simpletest\TestBase->run(Array) simpletest_script_run_one_test('6', 'Drupal\uc_cart\Tests\CartCheckoutTest') NoticeCartCheckoutTest.php242Drupal\uc_cart\Tests\CartCheckoutTest->testAnonymousCheckoutAccountGenerated()
Invoice body contains password.OtherCartCheckoutTest.php242Drupal\uc_cart\Tests\CartCheckoutTest->testAnonymousCheckoutAccountGenerated()
Trying to get property of non-objectDrupal\uc_cart\Tests\CartCheckoutTest->testAnonymousCheckoutAccountGenerated() Drupal\simpletest\TestBase->run(Array) simpletest_script_run_one_test('6', 'Drupal\uc_cart\Tests\CartCheckoutTest') NoticeCartCheckoutTest.php245Drupal\uc_cart\Tests\CartCheckoutTest->testAnonymousCheckoutAccountGenerated()
Trying to get property of non-objectDrupal\uc_cart\Tests\CartCheckoutTest->testAnonymousCheckoutAccountGenerated() Drupal\simpletest\TestBase->run(Array) simpletest_script_run_one_test('6', 'Drupal\uc_cart\Tests\CartCheckoutTest') NoticeCartCheckoutTest.php245Drupal\uc_cart\Tests\CartCheckoutTest->testAnonymousCheckoutAccountGenerated()
strpos(): Empty needlestrpos('', '') Drupal\simpletest\WebTestBase->assertTextHelper(NULL, 'Username is shown on screen.', 'Other', ) Drupal\simpletest\WebTestBase->assertText(NULL, 'Username is shown on screen.') Drupal\uc_cart\Tests\CartCheckoutTest->testAnonymousCheckoutAccountGenerated() Drupal\simpletest\TestBase->run(Array) simpletest_script_run_one_test('6', 'Drupal\uc_cart\Tests\CartCheckoutTest') WarningAssertContentTrait.php614Drupal\simpletest\WebTestBase->assertTextHelper()
Username is shown on screen.OtherCartCheckoutTest.php245Drupal\uc_cart\Tests\CartCheckoutTest->testAnonymousCheckoutAccountGenerated()
Trying to get property of non-objectDrupal\uc_cart\Tests\CartCheckoutTest->testAnonymousCheckoutAccountGenerated() Drupal\simpletest\TestBase->run(Array) simpletest_script_run_one_test('6', 'Drupal\uc_cart\Tests\CartCheckoutTest') NoticeCartCheckoutTest.php246Drupal\uc_cart\Tests\CartCheckoutTest->testAnonymousCheckoutAccountGenerated()
strpos(): Empty needlestrpos('', '') Drupal\simpletest\WebTestBase->assertTextHelper(NULL, 'Password is shown on screen.', 'Other', ) Drupal\simpletest\WebTestBase->assertText(NULL, 'Password is shown on screen.') Drupal\uc_cart\Tests\CartCheckoutTest->testAnonymousCheckoutAccountGenerated() Drupal\simpletest\TestBase->run(Array) simpletest_script_run_one_test('6', 'Drupal\uc_cart\Tests\CartCheckoutTest') WarningAssertContentTrait.php614Drupal\simpletest\WebTestBase->assertTextHelper()
Password is shown on screen.OtherCartCheckoutTest.php246Drupal\uc_cart\Tests\CartCheckoutTest->testAnonymousCheckoutAccountGenerated()
"There are no products in your shopping cart." foundOtherCartCheckoutTest.php250Drupal\uc_cart\Tests\CartCheckoutTest->testAnonymousCheckoutAccountGenerated()
Trying to get property of non-objectDrupal\uc_cart\Tests\CartCheckoutTest->testAnonymousCheckoutAccountGenerated() Drupal\simpletest\TestBase->run(Array) simpletest_script_run_one_test('6', 'Drupal\uc_cart\Tests\CartCheckoutTest') NoticeCartCheckoutTest.php254Drupal\uc_cart\Tests\CartCheckoutTest->testAnonymousCheckoutAccountGenerated()
Trying to get property of non-objectDrupal\uc_cart\Tests\CartCheckoutTest->testAnonymousCheckoutAccountGenerated() Drupal\simpletest\TestBase->run(Array) simpletest_script_run_one_test('6', 'Drupal\uc_cart\Tests\CartCheckoutTest') NoticeCartCheckoutTest.php254Drupal\uc_cart\Tests\CartCheckoutTest->testAnonymousCheckoutAccountGenerated()
Trying to get property of non-objectDrupal\uc_cart\Tests\CartCheckoutTest->testAnonymousCheckoutAccountGenerated() Drupal\simpletest\TestBase->run(Array) simpletest_script_run_one_test('6', 'Drupal\uc_cart\Tests\CartCheckoutTest') NoticeCartCheckoutTest.php255Drupal\uc_cart\Tests\CartCheckoutTest->testAnonymousCheckoutAccountGenerated()
Failed to set field name to OtherCartCheckoutTest.php257Drupal\uc_cart\Tests\CartCheckoutTest->testAnonymousCheckoutAccountGenerated()
Failed to set field pass to OtherCartCheckoutTest.php257Drupal\uc_cart\Tests\CartCheckoutTest->testAnonymousCheckoutAccountGenerated()
Found the requested form fields at userOtherCartCheckoutTest.php257Drupal\uc_cart\Tests\CartCheckoutTest->testAnonymousCheckoutAccountGenerated()
Class 'Drupal\uc_cart\Controller\Cart' not foundPHP Fatal errorCartController.php25Unknown
Class 'Drupal\uc_cart\Controller\Cart' not foundPHP Fatal errorCartController.php25Unknown
Call to undefined method Drupal\uc_cart\CartManager::entityManager()PHP Fatal errorCartManager.php85Unknown
Class 'Drupal\uc_cart\Controller\Cart' not foundPHP Fatal errorCartController.php25Unknown
simplexml_import_dom(): Invalid Nodetype to importsimplexml_import_dom(Object) Drupal\simpletest\WebTestBase->parse() Drupal\simpletest\WebTestBase->drupalPostForm('cart', Array, 'Checkout') Drupal\uc_store\Tests\UbercartTestBase->checkout(Array) Drupal\uc_cart\Tests\CartCheckoutTest->testAnonymousCheckoutAccountProvided() Drupal\simpletest\TestBase->run(Array) simpletest_script_run_one_test('6', 'Drupal\uc_cart\Tests\CartCheckoutTest') WarningAssertContentTrait.php138Drupal\simpletest\WebTestBase->parse()
Viewed cart page: Billing pane has been displayed.OtherUbercartTestBase.php249Drupal\uc_store\Tests\UbercartTestBase->checkout()
Raw "Your order is complete!" foundOtherCartCheckoutTest.php279Drupal\uc_cart\Tests\CartCheckoutTest->testAnonymousCheckoutAccountProvided()
Username is shown on screen.OtherCartCheckoutTest.php280Drupal\uc_cart\Tests\CartCheckoutTest->testAnonymousCheckoutAccountProvided()
Mail body contains username.OtherCartCheckoutTest.php286Drupal\uc_cart\Tests\CartCheckoutTest->testAnonymousCheckoutAccountProvided()
Invoice body contains username.OtherCartCheckoutTest.php291Drupal\uc_cart\Tests\CartCheckoutTest->testAnonymousCheckoutAccountProvided()
"There are no products in your shopping cart." foundOtherCartCheckoutTest.php296Drupal\uc_cart\Tests\CartCheckoutTest->testAnonymousCheckoutAccountProvided()
Class 'Drupal\uc_cart\Controller\Cart' not foundPHP Fatal errorCartController.php25Unknown
Class 'Drupal\uc_cart\Controller\Cart' not foundPHP Fatal errorCartController.php25Unknown
Call to undefined method Drupal\uc_cart\CartManager::entityManager()PHP Fatal errorCartManager.php85Unknown
Class 'Drupal\uc_cart\Controller\Cart' not foundPHP Fatal errorCartController.php25Unknown
simplexml_import_dom(): Invalid Nodetype to importsimplexml_import_dom(Object) Drupal\simpletest\WebTestBase->parse() Drupal\simpletest\WebTestBase->drupalPostForm('cart', Array, 'Checkout') Drupal\uc_store\Tests\UbercartTestBase->checkout(Array) Drupal\uc_cart\Tests\CartCheckoutTest->testAnonymousCheckoutAccountExists() Drupal\simpletest\TestBase->run(Array) simpletest_script_run_one_test('6', 'Drupal\uc_cart\Tests\CartCheckoutTest') WarningAssertContentTrait.php138Drupal\simpletest\WebTestBase->parse()
Viewed cart page: Billing pane has been displayed.OtherUbercartTestBase.php249Drupal\uc_store\Tests\UbercartTestBase->checkout()
Raw "Your order is complete!" foundOtherCartCheckoutTest.php309Drupal\uc_cart\Tests\CartCheckoutTest->testAnonymousCheckoutAccountExists()
Raw "order has been attached to the account we found" foundOtherCartCheckoutTest.php310Drupal\uc_cart\Tests\CartCheckoutTest->testAnonymousCheckoutAccountExists()
"There are no products in your shopping cart." foundOtherCartCheckoutTest.php314Drupal\uc_cart\Tests\CartCheckoutTest->testAnonymousCheckoutAccountExists()
Class 'Drupal\uc_cart\Controller\Cart' not foundPHP Fatal errorCartController.php25Unknown
Class 'Drupal\uc_cart\Controller\Cart' not foundPHP Fatal errorCartController.php25Unknown
Call to undefined method Drupal\uc_cart\CartManager::entityManager()PHP Fatal errorCartManager.php85Unknown
Class 'Drupal\uc_cart\Controller\Cart' not foundPHP Fatal errorCartController.php25Unknown
"Your order is complete!" foundOtherCartCheckoutTest.php346Drupal\uc_cart\Tests\CartCheckoutTest->testCheckoutNewUsername()
"A new account has been created" foundOtherCartCheckoutTest.php347Drupal\uc_cart\Tests\CartCheckoutTest->testCheckoutNewUsername()
Class 'Drupal\uc_cart\Controller\Cart' not foundPHP Fatal errorCartController.php25Unknown
Call to undefined method Drupal\uc_cart\CartManager::entityManager()PHP Fatal errorCartManager.php85Unknown
simplexml_import_dom(): Invalid Nodetype to importsimplexml_import_dom(Object) Drupal\simpletest\WebTestBase->parse() Drupal\simpletest\WebTestBase->drupalPostForm('cart', Array, 'Checkout') Drupal\uc_store\Tests\UbercartTestBase->checkout() Drupal\uc_cart\Tests\CartCheckoutTest->testCheckoutBlockedUser() Drupal\simpletest\TestBase->run(Array) simpletest_script_run_one_test('6', 'Drupal\uc_cart\Tests\CartCheckoutTest') WarningAssertContentTrait.php138Drupal\simpletest\WebTestBase->parse()
Viewed cart page: Billing pane has been displayed.OtherUbercartTestBase.php249Drupal\uc_store\Tests\UbercartTestBase->checkout()
Raw "Your order is complete!" foundOtherCartCheckoutTest.php362Drupal\uc_cart\Tests\CartCheckoutTest->testCheckoutBlockedUser()
Blocked user email found.OtherCartCheckoutTest.php366Drupal\uc_cart\Tests\CartCheckoutTest->testCheckoutBlockedUser()
Class 'Drupal\uc_cart\Controller\Cart' not foundPHP Fatal errorCartController.php25Unknown
Class 'Drupal\uc_cart\Controller\Cart' not foundPHP Fatal errorCartController.php25Unknown
Call to undefined method Drupal\uc_cart\CartManager::entityManager()PHP Fatal errorCartManager.php85Unknown
simplexml_import_dom(): Invalid Nodetype to importsimplexml_import_dom(Object) Drupal\simpletest\WebTestBase->parse() Drupal\simpletest\WebTestBase->drupalPostForm('cart', Array, 'Checkout') Drupal\uc_store\Tests\UbercartTestBase->checkout() Drupal\uc_cart\Tests\CartCheckoutTest->testCheckoutLogin() Drupal\simpletest\TestBase->run(Array) simpletest_script_run_one_test('6', 'Drupal\uc_cart\Tests\CartCheckoutTest') WarningAssertContentTrait.php138Drupal\simpletest\WebTestBase->parse()
Viewed cart page: Billing pane has been displayed.OtherUbercartTestBase.php249Drupal\uc_store\Tests\UbercartTestBase->checkout()
Raw "Your order is complete!" foundOtherCartCheckoutTest.php383Drupal\uc_cart\Tests\CartCheckoutTest->testCheckoutLogin()
Raw "you are already logged in" foundOtherCartCheckoutTest.php384Drupal\uc_cart\Tests\CartCheckoutTest->testCheckoutLogin()
User is logged in.OtherCartCheckoutTest.php388Drupal\uc_cart\Tests\CartCheckoutTest->testCheckoutLogin()
"There are no products in your shopping cart." foundOtherCartCheckoutTest.php392Drupal\uc_cart\Tests\CartCheckoutTest->testCheckoutLogin()
Class 'Drupal\uc_cart\Controller\Cart' not foundPHP Fatal errorCartController.php25Unknown
Class 'Drupal\uc_cart\Controller\Cart' not foundPHP Fatal errorCartController.php25Unknown
Call to undefined method Drupal\uc_cart\CartManager::entityManager()PHP Fatal errorCartManager.php85Unknown
Class 'Drupal\uc_cart\Controller\Cart' not foundPHP Fatal errorCartController.php25Unknown
The test did not complete due to a fatal error.Completion checkCartCheckoutTest.php395Drupal\uc_cart\Tests\CartCheckoutTest->testCheckoutComplete()
ExpandDrupal\uc_cart\Tests\CartSettingsTest132188
MessageGroupFilenameLineFunctionStatus
"vnWhV2s8 added to your shopping cart." foundOtherCartSettingsTest.php31Drupal\uc_cart\Tests\CartSettingsTest->testAddToCartMessage()
simplexml_import_dom(): Invalid Nodetype to importsimplexml_import_dom(Object) Drupal\simpletest\WebTestBase->parse() Drupal\simpletest\WebTestBase->drupalPostForm('cart', Array, 'Remove') Drupal\uc_cart\Tests\CartSettingsTest->testAddToCartMessage() Drupal\simpletest\TestBase->run(Array) simpletest_script_run_one_test('8', 'Drupal\uc_cart\Tests\CartSettingsTest') WarningAssertContentTrait.php138Drupal\simpletest\WebTestBase->parse()
Class 'Drupal\uc_cart\Controller\Cart' not foundPHP Fatal errorCartController.php25Unknown
Class 'Drupal\uc_cart\Controller\Cart' not foundPHP Fatal errorCartController.php25Unknown
Class 'Drupal\uc_cart\Controller\Cart' not foundPHP Fatal errorCartController.php25Unknown
simplexml_import_dom(): Invalid Nodetype to importsimplexml_import_dom(Object) Drupal\simpletest\WebTestBase->parse() Drupal\simpletest\WebTestBase->drupalPostForm('cart', Array, Object) Drupal\uc_cart\Tests\CartSettingsTest->testMinimumSubtotal() Drupal\simpletest\TestBase->run(Array) simpletest_script_run_one_test('8', 'Drupal\uc_cart\Tests\CartSettingsTest') WarningAssertContentTrait.php138Drupal\simpletest\WebTestBase->parse()
Prevented checkout below the minimum order total.OtherCartSettingsTest.php113Drupal\uc_cart\Tests\CartSettingsTest->testMinimumSubtotal()
simplexml_import_dom(): Invalid Nodetype to importsimplexml_import_dom(Object) Drupal\simpletest\WebTestBase->parse() Drupal\simpletest\WebTestBase->drupalPostForm('cart', Array, Object) Drupal\uc_cart\Tests\CartSettingsTest->testMinimumSubtotal() Drupal\simpletest\TestBase->run(Array) simpletest_script_run_one_test('8', 'Drupal\uc_cart\Tests\CartSettingsTest') WarningAssertContentTrait.php138Drupal\simpletest\WebTestBase->parse()
"Enter your billing address and information here." foundOtherCartSettingsTest.php126Drupal\uc_cart\Tests\CartSettingsTest->testMinimumSubtotal()
Class 'Drupal\uc_cart\Controller\Cart' not foundPHP Fatal errorCartController.php25Unknown
Class 'Drupal\uc_cart\Controller\Cart' not foundPHP Fatal errorCartController.php25Unknown
Class 'Drupal\uc_cart\Controller\Cart' not foundPHP Fatal errorCartController.php25Unknown
Class 'Drupal\uc_cart\Controller\Cart' not foundPHP Fatal errorCartController.php25Unknown
simplexml_import_dom(): Invalid Nodetype to importsimplexml_import_dom(Object) Drupal\simpletest\WebTestBase->parse() Drupal\simpletest\WebTestBase->xpath('//a[normalize-space(text())=:label]', Array) Drupal\simpletest\WebTestBase->assertLink(Object, 0, 'Continue shopping link appears on the page.') Drupal\uc_cart\Tests\CartSettingsTest->testContinueShopping() Drupal\simpletest\TestBase->run(Array) simpletest_script_run_one_test('8', 'Drupal\uc_cart\Tests\CartSettingsTest') WarningAssertContentTrait.php138Drupal\simpletest\WebTestBase->parse()
Continue shopping link appears on the page.OtherCartSettingsTest.php140Drupal\uc_cart\Tests\CartSettingsTest->testContinueShopping()
simplexml_import_dom(): Invalid Nodetype to importsimplexml_import_dom(Object) Drupal\simpletest\WebTestBase->parse() Drupal\simpletest\WebTestBase->xpath('//a[@href="/checkout/node/1"]') Drupal\uc_cart\Tests\CartSettingsTest->testContinueShopping() Drupal\simpletest\TestBase->run(Array) simpletest_script_run_one_test('8', 'Drupal\uc_cart\Tests\CartSettingsTest') WarningAssertContentTrait.php138Drupal\simpletest\WebTestBase->parse()
Continue shopping link returns to the product page.OtherCartSettingsTest.php145Drupal\uc_cart\Tests\CartSettingsTest->testContinueShopping()
simplexml_import_dom(): Invalid Nodetype to importsimplexml_import_dom(Object) Drupal\simpletest\WebTestBase->parse() Drupal\simpletest\WebTestBase->drupalPostForm('cart', Array, Object) Drupal\uc_cart\Tests\CartSettingsTest->testContinueShopping() Drupal\simpletest\TestBase->run(Array) simpletest_script_run_one_test('8', 'Drupal\uc_cart\Tests\CartSettingsTest') WarningAssertContentTrait.php138Drupal\simpletest\WebTestBase->parse()
Continue shopping button takes the user to the correct URL.OtherCartSettingsTest.php179Drupal\uc_cart\Tests\CartSettingsTest->testContinueShopping()
Class 'Drupal\uc_cart\Controller\Cart' not foundPHP Fatal errorCartController.php25Unknown
Class 'Drupal\uc_cart\Controller\Cart' not foundPHP Fatal errorCartController.php25Unknown
simplexml_import_dom(): Invalid Nodetype to importsimplexml_import_dom(Object) Drupal\simpletest\WebTestBase->parse() Drupal\simpletest\WebTestBase->xpath('//a[normalize-space(text())=:label]', Array) Drupal\simpletest\WebTestBase->assertLink('ehaMDVJt', 0, 'The breadcrumb link text is set correctly.') Drupal\uc_cart\Tests\CartSettingsTest->testCartBreadcrumb() Drupal\simpletest\TestBase->run(Array) simpletest_script_run_one_test('8', 'Drupal\uc_cart\Tests\CartSettingsTest') WarningAssertContentTrait.php138Drupal\simpletest\WebTestBase->parse()
The breadcrumb link text is set correctly.OtherCartSettingsTest.php213Drupal\uc_cart\Tests\CartSettingsTest->testCartBreadcrumb()
simplexml_import_dom(): Invalid Nodetype to importsimplexml_import_dom(Object) Drupal\simpletest\WebTestBase->parse() Drupal\simpletest\WebTestBase->xpath('//a[@href="http://ec2-52-88-182-40.us-west-2.compute.amazonaws.com/checkout/ruA7CcLC"]') Drupal\uc_cart\Tests\CartSettingsTest->testCartBreadcrumb() Drupal\simpletest\TestBase->run(Array) simpletest_script_run_one_test('8', 'Drupal\uc_cart\Tests\CartSettingsTest') WarningAssertContentTrait.php138Drupal\simpletest\WebTestBase->parse()
The breadcrumb link is set correctly.OtherCartSettingsTest.php218Drupal\uc_cart\Tests\CartSettingsTest->testCartBreadcrumb()
Class 'Drupal\uc_cart\Controller\Cart' not foundPHP Fatal errorCartController.php25Unknown
ExpandDrupal\uc_cart\Tests\CheckoutSettingsTest4932
MessageGroupFilenameLineFunctionStatus
simplexml_import_dom(): Invalid Nodetype to importsimplexml_import_dom(Object) Drupal\simpletest\WebTestBase->parse() Drupal\simpletest\WebTestBase->xpath('//input[@value="Checkout"]') Drupal\uc_cart\Tests\CheckoutSettingsTest->testEnableCheckout() Drupal\simpletest\TestBase->run(Array) simpletest_script_run_one_test('7', 'Drupal\uc_cart\Tests\CheckoutSettingsTest') WarningAssertContentTrait.php138Drupal\simpletest\WebTestBase->parse()
Class 'Drupal\uc_cart\Controller\Cart' not foundPHP Fatal errorCartController.php25Unknown
simplexml_import_dom(): Invalid Nodetype to importsimplexml_import_dom(Object) Drupal\simpletest\WebTestBase->parse() Drupal\simpletest\WebTestBase->drupalPostForm('cart', Array, Object) Drupal\uc_cart\Tests\CheckoutSettingsTest->testAnonymousCheckout() Drupal\simpletest\TestBase->run(Array) simpletest_script_run_one_test('7', 'Drupal\uc_cart\Tests\CheckoutSettingsTest') WarningAssertContentTrait.php138Drupal\simpletest\WebTestBase->parse()
Class 'Drupal\uc_cart\Controller\Cart' not foundPHP Fatal errorCartController.php25Unknown
Class 'Drupal\uc_cart\Controller\Cart' not foundPHP Fatal errorCartController.php25Unknown
ExpandDrupal\uc_cart_links\Tests\CartLinksTest348346
MessageGroupFilenameLineFunctionStatus
Product title correct in cart.OtherCartLinksTest.php157Drupal\uc_cart_links\Tests\CartLinksTest->testCartLinksBasicFunctionality()
simplexml_import_dom(): Invalid Nodetype to importsimplexml_import_dom(Object) Drupal\simpletest\WebTestBase->parse() Drupal\simpletest\WebTestBase->xpath('//textarea[@name="items[0][qty]"]|//input[@name="items[0][qty]"]|//select[@name="items[0][qty]"]') Drupal\simpletest\WebTestBase->assertFieldByXPath('//textarea[@name="items[0][qty]"]|//input[@name="items[0][qty]"]|//select[@name="items[0][qty]"]', 8, 'Product quantity correct in cart.', 'Browser') Drupal\simpletest\WebTestBase->assertFieldByName('items[0][qty]', 8, 'Product quantity correct in cart.') Drupal\uc_cart_links\Tests\CartLinksTest->testCartLinksBasicFunctionality() Drupal\simpletest\TestBase->run(Array) simpletest_script_run_one_test('10', 'Drupal\uc_cart_links\Tests\CartLinksTest') WarningAssertContentTrait.php138Drupal\simpletest\WebTestBase->parse()
Product quantity correct in cart.BrowserCartLinksTest.php162Drupal\uc_cart_links\Tests\CartLinksTest->testCartLinksBasicFunctionality()
Attribute dWukzlj8 correct in cart.OtherCartLinksTest.php169Drupal\uc_cart_links\Tests\CartLinksTest->testCartLinksBasicFunctionality()
Option sDd7nl8Z correct in cart.OtherCartLinksTest.php175Drupal\uc_cart_links\Tests\CartLinksTest->testCartLinksBasicFunctionality()
Attribute pFSnxjKJ correct in cart.OtherCartLinksTest.php169Drupal\uc_cart_links\Tests\CartLinksTest->testCartLinksBasicFunctionality()
Option jTULMcxR correct in cart.OtherCartLinksTest.php175Drupal\uc_cart_links\Tests\CartLinksTest->testCartLinksBasicFunctionality()
Attribute y8jwyFYM correct in cart.OtherCartLinksTest.php169Drupal\uc_cart_links\Tests\CartLinksTest->testCartLinksBasicFunctionality()
Option lapwZZsvZIQM correct in cart.OtherCartLinksTest.php175Drupal\uc_cart_links\Tests\CartLinksTest->testCartLinksBasicFunctionality()
simplexml_import_dom(): Invalid Nodetype to importsimplexml_import_dom(Object) Drupal\simpletest\WebTestBase->parse() Drupal\simpletest\WebTestBase->drupalPostForm('cart', Array, Object) Drupal\uc_cart_links\Tests\CartLinksTest->testCartLinksBasicFunctionality() Drupal\simpletest\TestBase->run(Array) simpletest_script_run_one_test('10', 'Drupal\uc_cart_links\Tests\CartLinksTest') WarningAssertContentTrait.php138Drupal\simpletest\WebTestBase->parse()
"There are no products in your shopping cart." foundOtherCartLinksTest.php190Drupal\uc_cart_links\Tests\CartLinksTest->testCartLinksBasicFunctionality()
Product title correct in cart.OtherCartLinksTest.php157Drupal\uc_cart_links\Tests\CartLinksTest->testCartLinksBasicFunctionality()
simplexml_import_dom(): Invalid Nodetype to importsimplexml_import_dom(Object) Drupal\simpletest\WebTestBase->parse() Drupal\simpletest\WebTestBase->xpath('//textarea[@name="items[0][qty]"]|//input[@name="items[0][qty]"]|//select[@name="items[0][qty]"]') Drupal\simpletest\WebTestBase->assertFieldByXPath('//textarea[@name="items[0][qty]"]|//input[@name="items[0][qty]"]|//select[@name="items[0][qty]"]', 10, 'Product quantity correct in cart.', 'Browser') Drupal\simpletest\WebTestBase->assertFieldByName('items[0][qty]', 10, 'Product quantity correct in cart.') Drupal\uc_cart_links\Tests\CartLinksTest->testCartLinksBasicFunctionality() Drupal\simpletest\TestBase->run(Array) simpletest_script_run_one_test('10', 'Drupal\uc_cart_links\Tests\CartLinksTest') WarningAssertContentTrait.php138Drupal\simpletest\WebTestBase->parse()
Product quantity correct in cart.BrowserCartLinksTest.php162Drupal\uc_cart_links\Tests\CartLinksTest->testCartLinksBasicFunctionality()
Attribute lX2Dbfrr correct in cart.OtherCartLinksTest.php169Drupal\uc_cart_links\Tests\CartLinksTest->testCartLinksBasicFunctionality()
Option iZ2u2OSd correct in cart.OtherCartLinksTest.php175Drupal\uc_cart_links\Tests\CartLinksTest->testCartLinksBasicFunctionality()
Attribute sycsmLh0 correct in cart.OtherCartLinksTest.php169Drupal\uc_cart_links\Tests\CartLinksTest->testCartLinksBasicFunctionality()
Option bFDipeSt correct in cart.OtherCartLinksTest.php175Drupal\uc_cart_links\Tests\CartLinksTest->testCartLinksBasicFunctionality()
Attribute mGWDtrS8 correct in cart.OtherCartLinksTest.php169Drupal\uc_cart_links\Tests\CartLinksTest->testCartLinksBasicFunctionality()
Option sN3JVJHY correct in cart.OtherCartLinksTest.php175Drupal\uc_cart_links\Tests\CartLinksTest->testCartLinksBasicFunctionality()
Option eoHoinev correct in cart.OtherCartLinksTest.php175Drupal\uc_cart_links\Tests\CartLinksTest->testCartLinksBasicFunctionality()
Option kw6yx0MT correct in cart.OtherCartLinksTest.php175Drupal\uc_cart_links\Tests\CartLinksTest->testCartLinksBasicFunctionality()
simplexml_import_dom(): Invalid Nodetype to importsimplexml_import_dom(Object) Drupal\simpletest\WebTestBase->parse() Drupal\simpletest\WebTestBase->drupalPostForm('cart', Array, Object) Drupal\uc_cart_links\Tests\CartLinksTest->testCartLinksBasicFunctionality() Drupal\simpletest\TestBase->run(Array) simpletest_script_run_one_test('10', 'Drupal\uc_cart_links\Tests\CartLinksTest') WarningAssertContentTrait.php138Drupal\simpletest\WebTestBase->parse()
"There are no products in your shopping cart." foundOtherCartLinksTest.php190Drupal\uc_cart_links\Tests\CartLinksTest->testCartLinksBasicFunctionality()
Class 'Drupal\uc_cart\Controller\Cart' not foundPHP Fatal errorCartController.php25Unknown
Class 'Drupal\uc_cart\Controller\Cart' not foundPHP Fatal errorCartController.php25Unknown
Class 'Drupal\uc_cart\Controller\Cart' not foundPHP Fatal errorCartController.php25Unknown
Class 'Drupal\uc_cart\Controller\Cart' not foundPHP Fatal errorCartController.php25Unknown
simplexml_import_dom(): Invalid Nodetype to importsimplexml_import_dom(Object) Drupal\simpletest\WebTestBase->parse() Drupal\simpletest\WebTestBase->drupalPostForm('cart', Array, Object) Drupal\uc_cart_links\Tests\CartLinksTest->testCartLinksProductActionMessage() Drupal\simpletest\TestBase->run(Array) simpletest_script_run_one_test('10', 'Drupal\uc_cart_links\Tests\CartLinksTest') WarningAssertContentTrait.php138Drupal\simpletest\WebTestBase->parse()
"There are no products in your shopping cart." foundOtherCartLinksTest.php232Drupal\uc_cart_links\Tests\CartLinksTest->testCartLinksProductActionMessage()
Class 'Drupal\uc_cart\Controller\Cart' not foundPHP Fatal errorCartController.php25Unknown
Product title correct in cart.OtherCartLinksTest.php299Drupal\uc_cart_links\Tests\CartLinksTest->testCartLinksAllowEmptying()
Cart was not emptied by Cart Link.OtherCartLinksTest.php316Drupal\uc_cart_links\Tests\CartLinksTest->testCartLinksAllowEmptying()
Cart was not emptied by Cart Link.OtherCartLinksTest.php320Drupal\uc_cart_links\Tests\CartLinksTest->testCartLinksAllowEmptying()
Class 'Drupal\uc_cart\Controller\Cart' not foundPHP Fatal errorCartController.php25Unknown
Class 'Drupal\uc_cart\Controller\Cart' not foundPHP Fatal errorCartController.php25Unknown
Class 'Drupal\uc_cart\Controller\Cart' not foundPHP Fatal errorCartController.php25Unknown
simplexml_import_dom(): Invalid Nodetype to importsimplexml_import_dom(Object) Drupal\simpletest\WebTestBase->parse() Drupal\simpletest\WebTestBase->drupalPostForm('cart', Array, Object) Drupal\uc_cart_links\Tests\CartLinksTest->testCartLinksMessages() Drupal\simpletest\TestBase->run(Array) simpletest_script_run_one_test('10', 'Drupal\uc_cart_links\Tests\CartLinksTest') WarningAssertContentTrait.php138Drupal\simpletest\WebTestBase->parse()
"There are no products in your shopping cart." foundOtherCartLinksTest.php467Drupal\uc_cart_links\Tests\CartLinksTest->testCartLinksMessages()
Class 'Drupal\uc_cart\Controller\Cart' not foundPHP Fatal errorCartController.php25Unknown
ExpandDrupal\uc_catalog\Tests\CatalogTest8320
MessageGroupFilenameLineFunctionStatus
"aGl5jbMv added to your shopping cart." foundOtherCatalogTest.php46Drupal\uc_catalog\Tests\CatalogTest->testCatalog()
Class 'Drupal\uc_cart\Controller\Cart' not foundPHP Fatal errorCartController.php25Unknown
ExpandDrupal\uc_credit\Tests\CreditCardTest251611
MessageGroupFilenameLineFunctionStatus
simplexml_import_dom(): Invalid Nodetype to importsimplexml_import_dom(Object) Drupal\simpletest\WebTestBase->parse() Drupal\simpletest\WebTestBase->drupalPostForm('cart', Array, 'Checkout') Drupal\uc_store\Tests\UbercartTestBase->checkout(Array) Drupal\uc_credit\Tests\CreditCardTest->testCheckout() Drupal\simpletest\TestBase->run(Array) simpletest_script_run_one_test('1', 'Drupal\uc_credit\Tests\CreditCardTest') WarningAssertContentTrait.php138Drupal\simpletest\WebTestBase->parse()
Viewed cart page: Billing pane has been displayed.OtherUbercartTestBase.php249Drupal\uc_store\Tests\UbercartTestBase->checkout()
"Your order is complete!" foundOtherCreditCardTest.php255Drupal\uc_credit\Tests\CreditCardTest->testCheckout()
Class 'Drupal\uc_cart\Controller\Cart' not foundPHP Fatal errorCartController.php25Unknown
Class 'Drupal\uc_cart\Controller\Cart' not foundPHP Fatal errorCartController.php25Unknown
Call to undefined method Drupal\uc_cart\CartManager::entityManager()PHP Fatal errorCartManager.php85Unknown
Card with expiry date 9/2015 passed validation.OtherCreditCardTest.php278Drupal\uc_credit\Tests\CreditCardTest->testExpiryDate()
Card with expiry date 10/2015 passed validation.OtherCreditCardTest.php278Drupal\uc_credit\Tests\CreditCardTest->testExpiryDate()
Card with expiry date 11/2015 passed validation.OtherCreditCardTest.php278Drupal\uc_credit\Tests\CreditCardTest->testExpiryDate()
Card with expiry date 12/2015 passed validation.OtherCreditCardTest.php278Drupal\uc_credit\Tests\CreditCardTest->testExpiryDate()
Card with expiry date 1/2016 passed validation.OtherCreditCardTest.php278Drupal\uc_credit\Tests\CreditCardTest->testExpiryDate()
Card with expiry date 2/2016 passed validation.OtherCreditCardTest.php278Drupal\uc_credit\Tests\CreditCardTest->testExpiryDate()
Card with expiry date 3/2016 passed validation.OtherCreditCardTest.php278Drupal\uc_credit\Tests\CreditCardTest->testExpiryDate()
Card with expiry date 4/2016 passed validation.OtherCreditCardTest.php278Drupal\uc_credit\Tests\CreditCardTest->testExpiryDate()
Card with expiry date 5/2016 passed validation.OtherCreditCardTest.php278Drupal\uc_credit\Tests\CreditCardTest->testExpiryDate()
Card with expiry date 6/2016 passed validation.OtherCreditCardTest.php278Drupal\uc_credit\Tests\CreditCardTest->testExpiryDate()
Card with expiry date 7/2016 passed validation.OtherCreditCardTest.php278Drupal\uc_credit\Tests\CreditCardTest->testExpiryDate()
Card with expiry date 8/2016 passed validation.OtherCreditCardTest.php278Drupal\uc_credit\Tests\CreditCardTest->testExpiryDate()
Card with expiry date 9/2016 passed validation.OtherCreditCardTest.php278Drupal\uc_credit\Tests\CreditCardTest->testExpiryDate()
Card with expiry date 10/2016 passed validation.OtherCreditCardTest.php278Drupal\uc_credit\Tests\CreditCardTest->testExpiryDate()
Card with expiry date 11/2016 passed validation.OtherCreditCardTest.php278Drupal\uc_credit\Tests\CreditCardTest->testExpiryDate()
Card with expiry date 12/2016 passed validation.OtherCreditCardTest.php278Drupal\uc_credit\Tests\CreditCardTest->testExpiryDate()
Card with expiry date 1/2017 passed validation.OtherCreditCardTest.php278Drupal\uc_credit\Tests\CreditCardTest->testExpiryDate()
Card with expiry date 2/2017 passed validation.OtherCreditCardTest.php278Drupal\uc_credit\Tests\CreditCardTest->testExpiryDate()
Card with expiry date 3/2017 passed validation.OtherCreditCardTest.php278Drupal\uc_credit\Tests\CreditCardTest->testExpiryDate()
Card with expiry date 4/2017 passed validation.OtherCreditCardTest.php278Drupal\uc_credit\Tests\CreditCardTest->testExpiryDate()
Card with expiry date 5/2017 passed validation.OtherCreditCardTest.php278Drupal\uc_credit\Tests\CreditCardTest->testExpiryDate()
Card with expiry date 6/2017 passed validation.OtherCreditCardTest.php278Drupal\uc_credit\Tests\CreditCardTest->testExpiryDate()
Card with expiry date 7/2017 passed validation.OtherCreditCardTest.php278Drupal\uc_credit\Tests\CreditCardTest->testExpiryDate()
Card with expiry date 8/2017 passed validation.OtherCreditCardTest.php278Drupal\uc_credit\Tests\CreditCardTest->testExpiryDate()
Card with expiry date 9/2017 passed validation.OtherCreditCardTest.php278Drupal\uc_credit\Tests\CreditCardTest->testExpiryDate()
Card with expiry date 10/2017 passed validation.OtherCreditCardTest.php278Drupal\uc_credit\Tests\CreditCardTest->testExpiryDate()
Card with expiry date 11/2017 passed validation.OtherCreditCardTest.php278Drupal\uc_credit\Tests\CreditCardTest->testExpiryDate()
Card with expiry date 12/2017 passed validation.OtherCreditCardTest.php278Drupal\uc_credit\Tests\CreditCardTest->testExpiryDate()
Call to undefined method Drupal\uc_cart\CartManager::entityManager()PHP Fatal errorCartManager.php85Unknown
Call to undefined method Drupal\uc_cart\CartManager::entityManager()PHP Fatal errorCartManager.php85Unknown
Call to undefined method Drupal\uc_cart\CartManager::entityManager()PHP Fatal errorCartManager.php85Unknown
Call to undefined method Drupal\uc_cart\CartManager::entityManager()PHP Fatal errorCartManager.php85Unknown
Call to undefined method Drupal\uc_cart\CartManager::entityManager()PHP Fatal errorCartManager.php85Unknown
Call to undefined method Drupal\uc_cart\CartManager::entityManager()PHP Fatal errorCartManager.php85Unknown
Call to undefined method Drupal\uc_cart\CartManager::entityManager()PHP Fatal errorCartManager.php85Unknown
Call to undefined method Drupal\uc_cart\CartManager::entityManager()PHP Fatal errorCartManager.php85Unknown
Call to undefined method Drupal\uc_cart\CartManager::entityManager()PHP Fatal errorCartManager.php85Unknown
Call to undefined method Drupal\uc_cart\CartManager::entityManager()PHP Fatal errorCartManager.php85Unknown
Call to undefined method Drupal\uc_cart\CartManager::entityManager()PHP Fatal errorCartManager.php85Unknown
Call to undefined method Drupal\uc_cart\CartManager::entityManager()PHP Fatal errorCartManager.php85Unknown
Call to undefined method Drupal\uc_cart\CartManager::entityManager()PHP Fatal errorCartManager.php85Unknown
Call to undefined method Drupal\uc_cart\CartManager::entityManager()PHP Fatal errorCartManager.php85Unknown
Call to undefined method Drupal\uc_cart\CartManager::entityManager()PHP Fatal errorCartManager.php85Unknown
Call to undefined method Drupal\uc_cart\CartManager::entityManager()PHP Fatal errorCartManager.php85Unknown
Call to undefined method Drupal\uc_cart\CartManager::entityManager()PHP Fatal errorCartManager.php85Unknown
Call to undefined method Drupal\uc_cart\CartManager::entityManager()PHP Fatal errorCartManager.php85Unknown
Call to undefined method Drupal\uc_cart\CartManager::entityManager()PHP Fatal errorCartManager.php85Unknown
Call to undefined method Drupal\uc_cart\CartManager::entityManager()PHP Fatal errorCartManager.php85Unknown
Call to undefined method Drupal\uc_cart\CartManager::entityManager()PHP Fatal errorCartManager.php85Unknown
Call to undefined method Drupal\uc_cart\CartManager::entityManager()PHP Fatal errorCartManager.php85Unknown
Call to undefined method Drupal\uc_cart\CartManager::entityManager()PHP Fatal errorCartManager.php85Unknown
Call to undefined method Drupal\uc_cart\CartManager::entityManager()PHP Fatal errorCartManager.php85Unknown
Call to undefined method Drupal\uc_cart\CartManager::entityManager()PHP Fatal errorCartManager.php85Unknown
Call to undefined method Drupal\uc_cart\CartManager::entityManager()PHP Fatal errorCartManager.php85Unknown
Call to undefined method Drupal\uc_cart\CartManager::entityManager()PHP Fatal errorCartManager.php85Unknown
Call to undefined method Drupal\uc_cart\CartManager::entityManager()PHP Fatal errorCartManager.php85Unknown
ExpandDrupal\uc_payment\Tests\PaymentPaneTest101112
MessageGroupFilenameLineFunctionStatus
Class 'Drupal\uc_cart\Controller\Cart' not foundPHP Fatal errorCartController.php25Unknown
Class 'Drupal\uc_cart\Controller\Cart' not foundPHP Fatal errorCartController.php25Unknown
simplexml_import_dom(): Invalid Nodetype to importsimplexml_import_dom(Object) Drupal\simpletest\WebTestBase->parse() Drupal\simpletest\WebTestBase->drupalPostForm('cart', Array, Object) Drupal\uc_payment\Tests\PaymentPaneTest->testFreeOrders() Drupal\simpletest\TestBase->run(Array) simpletest_script_run_one_test('2', 'Drupal\uc_payment\Tests\PaymentPaneTest') WarningAssertContentTrait.php138Drupal\simpletest\WebTestBase->parse()
simplexml_import_dom(): Invalid Nodetype to importsimplexml_import_dom(Object) Drupal\simpletest\WebTestBase->parse() Drupal\simpletest\WebTestBase->drupalPostForm('cart', Array, Object) Drupal\uc_payment\Tests\PaymentPaneTest->testFreeOrders() Drupal\simpletest\TestBase->run(Array) simpletest_script_run_one_test('2', 'Drupal\uc_payment\Tests\PaymentPaneTest') WarningAssertContentTrait.php138Drupal\simpletest\WebTestBase->parse()
"Check or money order" not foundOtherPaymentPaneTest.php97Drupal\uc_payment\Tests\PaymentPaneTest->testFreeOrders()
"No payment required" foundOtherPaymentPaneTest.php98Drupal\uc_payment\Tests\PaymentPaneTest->testFreeOrders()
"Continue with checkout to complete your order." foundOtherPaymentPaneTest.php99Drupal\uc_payment\Tests\PaymentPaneTest->testFreeOrders()
"Subtotal: $0.00" foundOtherPaymentPaneTest.php100Drupal\uc_payment\Tests\PaymentPaneTest->testFreeOrders()
Class 'Drupal\uc_cart\Controller\Cart' not foundPHP Fatal errorCartController.php25Unknown
Class 'Drupal\uc_cart\Controller\Cart' not foundPHP Fatal errorCartController.php25Unknown
Class 'Drupal\uc_cart\Controller\Cart' not foundPHP Fatal errorCartController.php25Unknown
Class 'Drupal\uc_cart\Controller\Cart' not foundPHP Fatal errorCartController.php25Unknown
Class 'Drupal\uc_cart\Controller\Cart' not foundPHP Fatal errorCartController.php25Unknown
ExpandDrupal\uc_payment_pack\Tests\PaymentPackTest139111
MessageGroupFilenameLineFunctionStatus
simplexml_import_dom(): Invalid Nodetype to importsimplexml_import_dom(Object) Drupal\simpletest\WebTestBase->parse() Drupal\simpletest\WebTestBase->xpath('//a[normalize-space(text())=:label]', Array) Drupal\simpletest\WebTestBase->assertNoLink('Receive Check') Drupal\uc_payment_pack\Tests\PaymentPackTest->testCheck() Drupal\simpletest\TestBase->run(Array) simpletest_script_run_one_test('3', 'Drupal\uc_payment_pack\Tests\PaymentPackTest') WarningAssertContentTrait.php138Drupal\simpletest\WebTestBase->parse()
Check clear date found.OtherPaymentPackTest.php124Drupal\uc_payment_pack\Tests\PaymentPackTest->testCheck()
"Check received" foundOtherPaymentPackTest.php128Drupal\uc_payment_pack\Tests\PaymentPackTest->testCheck()
"Expected clear date:" foundOtherPaymentPackTest.php129Drupal\uc_payment_pack\Tests\PaymentPackTest->testCheck()
Check clear date found.OtherPaymentPackTest.php130Drupal\uc_payment_pack\Tests\PaymentPackTest->testCheck()
Class 'Drupal\uc_cart\Controller\Cart' not foundPHP Fatal errorCartController.php25Unknown
Call to undefined method Drupal\uc_cart\CartManager::entityManager()PHP Fatal errorCartManager.php85Unknown
Call to undefined method Drupal\uc_cart\CartManager::entityManager()PHP Fatal errorCartManager.php85Unknown
Class 'Drupal\uc_cart\Controller\Cart' not foundPHP Fatal errorCartController.php25Unknown
Call to undefined method Drupal\uc_cart\CartManager::entityManager()PHP Fatal errorCartManager.php85Unknown
Class 'Drupal\uc_cart\Controller\Cart' not foundPHP Fatal errorCartController.php25Unknown
Call to undefined method Drupal\uc_cart\CartManager::entityManager()PHP Fatal errorCartManager.php85Unknown
ExpandDrupal\uc_product\Tests\ProductTest14940
MessageGroupFilenameLineFunctionStatus
"hdqMEI5A added to your shopping cart." foundOtherProductTest.php222Drupal\uc_product\Tests\ProductTest->testProductQuantity()
"Your item(s) have been updated." foundOtherProductTest.php226Drupal\uc_product\Tests\ProductTest->testProductQuantity()
Class 'Drupal\uc_cart\Controller\Cart' not foundPHP Fatal errorCartController.php25Unknown
Class 'Drupal\uc_cart\Controller\Cart' not foundPHP Fatal errorCartController.php25Unknown
ExpandDrupal\uc_product_kit\Tests\ProductKitTest121238
MessageGroupFilenameLineFunctionStatus
Product kit title found.OtherProductKitTest.php160Drupal\uc_product_kit\Tests\ProductKitTest->testProductKitMutability()
Product kit total found.OtherProductKitTest.php166Drupal\uc_product_kit\Tests\ProductKitTest->testProductKitMutability()
simplexml_import_dom(): Invalid Nodetype to importsimplexml_import_dom(Object) Drupal\simpletest\WebTestBase->parse() Drupal\simpletest\WebTestBase->drupalPostForm(NULL, Array, 'Update cart') Drupal\uc_product_kit\Tests\ProductKitTest->testProductKitMutability() Drupal\simpletest\TestBase->run(Array) simpletest_script_run_one_test('14', 'Drupal\uc_product_kit\Tests\ProductKitTest') WarningAssertContentTrait.php138Drupal\simpletest\WebTestBase->parse()
Updated product kit total found.OtherProductKitTest.php170Drupal\uc_product_kit\Tests\ProductKitTest->testProductKitMutability()
simplexml_import_dom(): Invalid Nodetype to importsimplexml_import_dom(Object) Drupal\simpletest\WebTestBase->parse() Drupal\simpletest\WebTestBase->drupalPostForm(NULL, Array, 'Remove') Drupal\uc_product_kit\Tests\ProductKitTest->testProductKitMutability() Drupal\simpletest\TestBase->run(Array) simpletest_script_run_one_test('14', 'Drupal\uc_product_kit\Tests\ProductKitTest') WarningAssertContentTrait.php138Drupal\simpletest\WebTestBase->parse()
"There are no products in your shopping cart." foundOtherProductKitTest.php173Drupal\uc_product_kit\Tests\ProductKitTest->testProductKitMutability()
Product kit title found.OtherProductKitTest.php186Drupal\uc_product_kit\Tests\ProductKitTest->testProductKitMutability()
Product 1 title shown.OtherProductKitTest.php187Drupal\uc_product_kit\Tests\ProductKitTest->testProductKitMutability()
Product 2 title shown.OtherProductKitTest.php188Drupal\uc_product_kit\Tests\ProductKitTest->testProductKitMutability()
Product 3 title shown.OtherProductKitTest.php189Drupal\uc_product_kit\Tests\ProductKitTest->testProductKitMutability()
Product kit total found.OtherProductKitTest.php192Drupal\uc_product_kit\Tests\ProductKitTest->testProductKitMutability()
simplexml_import_dom(): Invalid Nodetype to importsimplexml_import_dom(Object) Drupal\simpletest\WebTestBase->parse() Drupal\simpletest\WebTestBase->drupalPostForm(NULL, Array, 'Update cart') Drupal\uc_product_kit\Tests\ProductKitTest->testProductKitMutability() Drupal\simpletest\TestBase->run(Array) simpletest_script_run_one_test('14', 'Drupal\uc_product_kit\Tests\ProductKitTest') WarningAssertContentTrait.php138Drupal\simpletest\WebTestBase->parse()
Updated product kit total found.OtherProductKitTest.php196Drupal\uc_product_kit\Tests\ProductKitTest->testProductKitMutability()
simplexml_import_dom(): Invalid Nodetype to importsimplexml_import_dom(Object) Drupal\simpletest\WebTestBase->parse() Drupal\simpletest\WebTestBase->drupalPostForm(NULL, Array, 'Remove') Drupal\uc_product_kit\Tests\ProductKitTest->testProductKitMutability() Drupal\simpletest\TestBase->run(Array) simpletest_script_run_one_test('14', 'Drupal\uc_product_kit\Tests\ProductKitTest') WarningAssertContentTrait.php138Drupal\simpletest\WebTestBase->parse()
"There are no products in your shopping cart." foundOtherProductKitTest.php199Drupal\uc_product_kit\Tests\ProductKitTest->testProductKitMutability()
Product 1 title shown.OtherProductKitTest.php213Drupal\uc_product_kit\Tests\ProductKitTest->testProductKitMutability()
Product 2 title shown.OtherProductKitTest.php214Drupal\uc_product_kit\Tests\ProductKitTest->testProductKitMutability()
Product 3 title shown.OtherProductKitTest.php215Drupal\uc_product_kit\Tests\ProductKitTest->testProductKitMutability()
Product kit total found.OtherProductKitTest.php218Drupal\uc_product_kit\Tests\ProductKitTest->testProductKitMutability()
simplexml_import_dom(): Invalid Nodetype to importsimplexml_import_dom(Object) Drupal\simpletest\WebTestBase->parse() Drupal\simpletest\WebTestBase->drupalPostForm(NULL, Array, 'Update cart') Drupal\uc_product_kit\Tests\ProductKitTest->testProductKitMutability() Drupal\simpletest\TestBase->run(Array) simpletest_script_run_one_test('14', 'Drupal\uc_product_kit\Tests\ProductKitTest') WarningAssertContentTrait.php138Drupal\simpletest\WebTestBase->parse()
Updated product kit total found.OtherProductKitTest.php230Drupal\uc_product_kit\Tests\ProductKitTest->testProductKitMutability()
simplexml_import_dom(): Invalid Nodetype to importsimplexml_import_dom(Object) Drupal\simpletest\WebTestBase->parse() Drupal\simpletest\WebTestBase->drupalPostForm(NULL, Array, 'Remove') Drupal\uc_product_kit\Tests\ProductKitTest->testProductKitMutability() Drupal\simpletest\TestBase->run(Array) simpletest_script_run_one_test('14', 'Drupal\uc_product_kit\Tests\ProductKitTest') WarningAssertContentTrait.php138Drupal\simpletest\WebTestBase->parse()
simplexml_import_dom(): Invalid Nodetype to importsimplexml_import_dom(Object) Drupal\simpletest\WebTestBase->parse() Drupal\simpletest\WebTestBase->drupalPostForm(NULL, Array, 'Remove') Drupal\uc_product_kit\Tests\ProductKitTest->testProductKitMutability() Drupal\simpletest\TestBase->run(Array) simpletest_script_run_one_test('14', 'Drupal\uc_product_kit\Tests\ProductKitTest') WarningAssertContentTrait.php138Drupal\simpletest\WebTestBase->parse()
simplexml_import_dom(): Invalid Nodetype to importsimplexml_import_dom(Object) Drupal\simpletest\WebTestBase->parse() Drupal\simpletest\WebTestBase->drupalPostForm(NULL, Array, 'Remove') Drupal\uc_product_kit\Tests\ProductKitTest->testProductKitMutability() Drupal\simpletest\TestBase->run(Array) simpletest_script_run_one_test('14', 'Drupal\uc_product_kit\Tests\ProductKitTest') WarningAssertContentTrait.php138Drupal\simpletest\WebTestBase->parse()
"There are no products in your shopping cart." foundOtherProductKitTest.php235Drupal\uc_product_kit\Tests\ProductKitTest->testProductKitMutability()
Class 'Drupal\uc_cart\Controller\Cart' not foundPHP Fatal errorCartController.php25Unknown
Class 'Drupal\uc_cart\Controller\Cart' not foundPHP Fatal errorCartController.php25Unknown
Class 'Drupal\uc_cart\Controller\Cart' not foundPHP Fatal errorCartController.php25Unknown
Class 'Drupal\uc_cart\Controller\Cart' not foundPHP Fatal errorCartController.php25Unknown
Class 'Drupal\uc_cart\Controller\Cart' not foundPHP Fatal errorCartController.php25Unknown
Class 'Drupal\uc_cart\Controller\Cart' not foundPHP Fatal errorCartController.php25Unknown
ExpandDrupal\uc_quote\Tests\QuoteTest4575
MessageGroupFilenameLineFunctionStatus
simplexml_import_dom(): Invalid Nodetype to importsimplexml_import_dom(Object) Drupal\simpletest\WebTestBase->parse() Drupal\simpletest\WebTestBase->drupalPostForm('cart', Array, Object) Drupal\uc_quote\Tests\QuoteTest->testNoQuote() Drupal\simpletest\TestBase->run(Array) simpletest_script_run_one_test('4', 'Drupal\uc_quote\Tests\QuoteTest') WarningAssertContentTrait.php138Drupal\simpletest\WebTestBase->parse()
Class 'Drupal\uc_cart\Controller\Cart' not foundPHP Fatal errorCartController.php25Unknown
Class 'Drupal\uc_cart\Controller\Cart' not foundPHP Fatal errorCartController.php25Unknown
simplexml_import_dom(): Invalid Nodetype to importsimplexml_import_dom(Object) Drupal\simpletest\WebTestBase->parse() Drupal\simpletest\WebTestBase->drupalPostForm('cart', Array, Object) Drupal\uc_quote\Tests\QuoteTest->testQuote() Drupal\simpletest\TestBase->run(Array) simpletest_script_run_one_test('4', 'Drupal\uc_quote\Tests\QuoteTest') WarningAssertContentTrait.php138Drupal\simpletest\WebTestBase->parse()
The default quote option is availableOtherQuoteTest.php175Drupal\uc_quote\Tests\QuoteTest->testQuote()
The second quote option is availableOtherQuoteTest.php176Drupal\uc_quote\Tests\QuoteTest->testQuote()
Order total includes the default quote.OtherQuoteTest.php177Drupal\uc_quote\Tests\QuoteTest->testQuote()
simplexml_import_dom(): Invalid Nodetype to importsimplexml_import_dom(Object) Drupal\simpletest\WebTestBase->parse() Drupal\simpletest\WebTestBase->xpath('//*[@name="panes[quotes][quotes][quote_option]" and @value="flatrate_2---0"]') Drupal\simpletest\WebTestBase->drupalPostAjaxForm(NULL, Array, Array, NULL, Array, Array, NULL, NULL) Drupal\uc_store\Tests\UbercartTestBase->ucPostAjax(NULL, Array, Array) Drupal\uc_quote\Tests\QuoteTest->testQuote() Drupal\simpletest\TestBase->run(Array) simpletest_script_run_one_test('4', 'Drupal\uc_quote\Tests\QuoteTest') WarningAssertContentTrait.php138Drupal\simpletest\WebTestBase->parse()
Undefined index: ajaxDrupal\simpletest\WebTestBase->drupalPostAjaxForm(NULL, Array, Array, NULL, Array, Array, NULL, NULL) Drupal\uc_store\Tests\UbercartTestBase->ucPostAjax(NULL, Array, Array) Drupal\uc_quote\Tests\QuoteTest->testQuote() Drupal\simpletest\TestBase->run(Array) simpletest_script_run_one_test('4', 'Drupal\uc_quote\Tests\QuoteTest') NoticeWebTestBase.php1869Drupal\simpletest\WebTestBase->drupalPostAjaxForm()
Exception: No #ajax path specified. in Drupal\simpletest\WebTestBase->drupalPostAjaxForm() (line 1905 of /var/lib/drupaltestbot/sites/default/files/checkout/core/modules/simpletest/src/WebTestBase.php). Drupal\simpletest\WebTestBase->drupalPostAjaxForm(NULL, Array, Array, NULL, Array, Array, NULL, NULL) Drupal\uc_store\Tests\UbercartTestBase->ucPostAjax(NULL, Array, Array) Drupal\uc_quote\Tests\QuoteTest->testQuote() Drupal\simpletest\TestBase->run(Array) simpletest_script_run_one_test('4', 'Drupal\uc_quote\Tests\QuoteTest') Uncaught exceptionWebTestBase.php1905Drupal\simpletest\WebTestBase->drupalPostAjaxForm()
Class 'Drupal\uc_cart\Controller\Cart' not foundPHP Fatal errorCartController.php25Unknown
Class 'Drupal\uc_cart\Controller\Cart' not foundPHP Fatal errorCartController.php25Unknown
ExpandDrupal\uc_role\Tests\RoleCheckoutTest1810
MessageGroupFilenameLineFunctionStatus
The test did not complete due to a fatal error.Completion checkRoleCheckoutTest.php38Drupal\uc_role\Tests\RoleCheckoutTest->testCheckoutRoleAssignment()
ExpandDrupal\uc_role\Tests\RoleTest2921
MessageGroupFilenameLineFunctionStatus
The test did not complete due to a fatal error.Completion checkRoleTest.php21Drupal\uc_role\Tests\RoleTest->testRolePurchaseCheckout()
simplexml_import_dom(): Invalid Nodetype to importsimplexml_import_dom(Object) Drupal\simpletest\WebTestBase->parse() Drupal\simpletest\WebTestBase->drupalPostForm('cart', Array, 'Checkout') Drupal\uc_store\Tests\UbercartTestBase->checkout() Drupal\uc_role\Tests\RoleTest->testRolePurchaseCheckout() Drupal\simpletest\TestBase->run(Array) simpletest_script_run_one_test('21', 'Drupal\uc_role\Tests\RoleTest') WarningAssertContentTrait.php138Drupal\simpletest\WebTestBase->parse()
Viewed cart page: Billing pane has been displayed.OtherUbercartTestBase.php249Drupal\uc_store\Tests\UbercartTestBase->checkout()
ExpandDrupal\uc_stock\Tests\StockTest83142
MessageGroupFilenameLineFunctionStatus
simplexml_import_dom(): Invalid Nodetype to importsimplexml_import_dom(Object) Drupal\simpletest\WebTestBase->parse() Drupal\simpletest\WebTestBase->drupalPostForm('cart', Array, 'Checkout') Drupal\uc_store\Tests\UbercartTestBase->checkout() Drupal\uc_stock\Tests\StockTest->testStockDecrement() Drupal\simpletest\TestBase->run(Array) simpletest_script_run_one_test('15', 'Drupal\uc_stock\Tests\StockTest') WarningAssertContentTrait.php138Drupal\simpletest\WebTestBase->parse()
Viewed cart page: Billing pane has been displayed.OtherUbercartTestBase.php249Drupal\uc_store\Tests\UbercartTestBase->checkout()
Value 696 is equal to value '716'.OtherStockTest.php81Drupal\uc_stock\Tests\StockTest->testStockDecrement()
Class 'Drupal\uc_cart\Controller\Cart' not foundPHP Fatal errorCartController.php25Unknown
Class 'Drupal\uc_cart\Controller\Cart' not foundPHP Fatal errorCartController.php25Unknown
Call to undefined method Drupal\uc_cart\CartManager::entityManager()PHP Fatal errorCartManager.php85Unknown
simplexml_import_dom(): Invalid Nodetype to importsimplexml_import_dom(Object) Drupal\simpletest\WebTestBase->parse() Drupal\simpletest\WebTestBase->drupalPostForm('cart', Array, 'Checkout') Drupal\uc_store\Tests\UbercartTestBase->checkout() Drupal\uc_stock\Tests\StockTest->testStockThresholdMail() Drupal\simpletest\TestBase->run(Array) simpletest_script_run_one_test('15', 'Drupal\uc_stock\Tests\StockTest') WarningAssertContentTrait.php138Drupal\simpletest\WebTestBase->parse()
Viewed cart page: Billing pane has been displayed.OtherUbercartTestBase.php249Drupal\uc_store\Tests\UbercartTestBase->checkout()
Threshold mail recipient is correct. Value NULL is equal to value 'simpletest@example.com'.OtherStockTest.php103Drupal\uc_stock\Tests\StockTest->testStockThresholdMail()
Threshold mail subject is correct.OtherStockTest.php104Drupal\uc_stock\Tests\StockTest->testStockThresholdMail()
Mail body contains product title.OtherStockTest.php105Drupal\uc_stock\Tests\StockTest->testStockThresholdMail()
Mail body contains SKU.OtherStockTest.php106Drupal\uc_stock\Tests\StockTest->testStockThresholdMail()
Mail body contains quantity.OtherStockTest.php107Drupal\uc_stock\Tests\StockTest->testStockThresholdMail()
Class 'Drupal\uc_cart\Controller\Cart' not foundPHP Fatal errorCartController.php25Unknown
Class 'Drupal\uc_cart\Controller\Cart' not foundPHP Fatal errorCartController.php25Unknown
Call to undefined method Drupal\uc_cart\CartManager::entityManager()PHP Fatal errorCartManager.php85Unknown
ExpandDrupal\uc_store\Tests\AjaxTest1924
MessageGroupFilenameLineFunctionStatus
simplexml_import_dom(): Invalid Nodetype to importsimplexml_import_dom(Object) Drupal\simpletest\WebTestBase->parse() Drupal\simpletest\WebTestBase->drupalPostForm('cart', Array, Object) Drupal\uc_store\Tests\AjaxTest->testCheckoutAjax() Drupal\simpletest\TestBase->run(Array) simpletest_script_run_one_test('17', 'Drupal\uc_store\Tests\AjaxTest') WarningAssertContentTrait.php138Drupal\simpletest\WebTestBase->parse()
simplexml_import_dom(): Invalid Nodetype to importsimplexml_import_dom(Object) Drupal\simpletest\WebTestBase->parse() Drupal\simpletest\WebTestBase->xpath('//*[@name="panes[billing][zone]"]') Drupal\simpletest\WebTestBase->drupalPostAjaxForm(NULL, Array, 'panes[billing][zone]', NULL, Array, Array, NULL, NULL) Drupal\uc_store\Tests\UbercartTestBase->ucPostAjax(NULL, Array, 'panes[billing][zone]') Drupal\uc_store\Tests\AjaxTest->testCheckoutAjax() Drupal\simpletest\TestBase->run(Array) simpletest_script_run_one_test('17', 'Drupal\uc_store\Tests\AjaxTest') WarningAssertContentTrait.php138Drupal\simpletest\WebTestBase->parse()
Undefined index: ajaxDrupal\simpletest\WebTestBase->drupalPostAjaxForm(NULL, Array, 'panes[billing][zone]', NULL, Array, Array, NULL, NULL) Drupal\uc_store\Tests\UbercartTestBase->ucPostAjax(NULL, Array, 'panes[billing][zone]') Drupal\uc_store\Tests\AjaxTest->testCheckoutAjax() Drupal\simpletest\TestBase->run(Array) simpletest_script_run_one_test('17', 'Drupal\uc_store\Tests\AjaxTest') NoticeWebTestBase.php1869Drupal\simpletest\WebTestBase->drupalPostAjaxForm()
Exception: No #ajax path specified. in Drupal\simpletest\WebTestBase->drupalPostAjaxForm() (line 1905 of /var/lib/drupaltestbot/sites/default/files/checkout/core/modules/simpletest/src/WebTestBase.php). Drupal\simpletest\WebTestBase->drupalPostAjaxForm(NULL, Array, 'panes[billing][zone]', NULL, Array, Array, NULL, NULL) Drupal\uc_store\Tests\UbercartTestBase->ucPostAjax(NULL, Array, 'panes[billing][zone]') Drupal\uc_store\Tests\AjaxTest->testCheckoutAjax() Drupal\simpletest\TestBase->run(Array) simpletest_script_run_one_test('17', 'Drupal\uc_store\Tests\AjaxTest') Uncaught exceptionWebTestBase.php1905Drupal\simpletest\WebTestBase->drupalPostAjaxForm()
Class 'Drupal\uc_cart\Controller\Cart' not foundPHP Fatal errorCartController.php25Unknown
Class 'Drupal\uc_cart\Controller\Cart' not foundPHP Fatal errorCartController.php25Unknown
ExpandDrupal\uc_tax\Tests\InclusiveTaxTest1830
MessageGroupFilenameLineFunctionStatus
Order subtotal is correct on cart page.OtherInclusiveTaxTest.php96Drupal\uc_tax\Tests\InclusiveTaxTest->testProductKitAttributes()
Class 'Drupal\uc_cart\Controller\Cart' not foundPHP Fatal errorCartController.php25Unknown
Class 'Drupal\uc_cart\Controller\Cart' not foundPHP Fatal errorCartController.php25Unknown
ExpandDrupal\uc_tax\Tests\StoredTaxTest81123
MessageGroupFilenameLineFunctionStatus
simplexml_import_dom(): Invalid Nodetype to importsimplexml_import_dom(Object) Drupal\simpletest\WebTestBase->parse() Drupal\simpletest\WebTestBase->drupalPostForm('cart', Array, 'Checkout') Drupal\uc_tax\Tests\StoredTaxTest->testTaxDisplay() Drupal\simpletest\TestBase->run(Array) simpletest_script_run_one_test('23', 'Drupal\uc_tax\Tests\StoredTaxTest') WarningAssertContentTrait.php138Drupal\simpletest\WebTestBase->parse()
Viewed cart page: Billing pane has been displayed.OtherStoredTaxTest.php74Drupal\uc_tax\Tests\StoredTaxTest->testTaxDisplay()
Tax line item displayed.OtherStoredTaxTest.php75Drupal\uc_tax\Tests\StoredTaxTest->testTaxDisplay()
Correct tax amount displayed.OtherStoredTaxTest.php76Drupal\uc_tax\Tests\StoredTaxTest->testTaxDisplay()
Stored tax line item has the correct amount after rate changeOtherStoredTaxTest.php112Drupal\uc_tax\Tests\StoredTaxTest->testTaxDisplay()
The tax line item was saved to the order after applicable product changeOtherStoredTaxTest.php121Drupal\uc_tax\Tests\StoredTaxTest->testTaxDisplay()
Stored tax line item has the correct amount after applicable product changeOtherStoredTaxTest.php121Drupal\uc_tax\Tests\StoredTaxTest->testTaxDisplay()
Found the tax line item ID after applicable product changeBrowserStoredTaxTest.php121Drupal\uc_tax\Tests\StoredTaxTest->testTaxDisplay()
strpos(): Empty needlestrpos(' Skip to main content Order 1 Status message Order changes saved. Ship to: First name Last name Company Street address City State/Province - None -AdanaAdıyamanAfyonAksarayAmasyaAnkaraAntalyaArdahanArtvinAydınAğrıBalıkesirBartınBatmanBayburtBilecikBingölBitlisBoluBurdurBursaDenizliDiyarbakırDüzceEdirneElazığErzincanErzurumEskişehirGaziantepGiresunGümüşhaneHakkâriHatayIspartaIğdırKahramanmaraşKarabükKaramanKarsKastamonuKayseriKilisKocaeliKonyaKütahyaKırklareliKırıkkaleKırşehirMalatyaManisaMardinMuğlaMuşNevşehirNiğdeOrduOsmaniyeRizeSakaryaSamsunSiirtSinopSivasTekirdağTokatTrabzonTunceliUşakVanYalovaYozgatZonguldakÇanakkaleÇankırıÇorumİstanbulİzmirİçelŞanlıurfaŞırnak Country BangladeshCôte d'IvoireMontserratNauruNepalSwitzerlandTanzania, United Republic ofTurkey Postal code Bill to: First name Last name Company Street address City State/Province - None -AdanaAdıyamanAfyonAksarayAmasyaAnkaraAntalyaArdahanArtvinAydınAğrıBalıkesirBartınBatmanBayburtBilecikBingölBitlisBoluBurdurBursaDenizliDiyarbakırDüzceEdirneElazığErzincanErzurumEskişehirGaziantepGiresunGümüşhaneHakkâriHatayIspartaIğdırKahramanmaraşKarabükKaramanKarsKastamonuKayseriKilisKocaeliKonyaKütahyaKırklareliKırıkkaleKırşehirMalatyaManisaMardinMuğlaMuşNevşehirNiğdeOrduOsmaniyeRizeSakaryaSamsunSiirtSinopSivasTekirdağTokatTrabzonTunceliUşakVanYalovaYozgatZonguldakÇanakkaleÇankırıÇorumİstanbulİzmirİçelŞanlıurfaŞırnak Country BangladeshCôte d'IvoireMontserratNauruNepalSwitzerlandTanzania, United Republic ofTurkey Postal code Customer info: Customer number E-mail address Payment: Payment method Free orderCheckCash on deliveryOther Products: Remove Quantity Name SKU Weight Units Cost Price Quantity Title SKU Weight Units PoundsKilogramsOuncesGrams Cost $ Price $ Add a line item Empty line Subtotal:$2,711.00 Order total:$2,711.00Admin comments:No admin comments have been entered for this order.Add an admin comment Admin comments are only seen by store administrators. Delete Primary tabs View Edit(active tab) Invoice Log {"path":{"baseUrl":"\/checkout\/","scriptPath":null,"pathPrefix":"","currentPath":"admin\/store\/orders\/1\/edit","currentPathIsAdmin":true,"isFront":false,"currentLanguage":"en"},"pluralDelimiter":"\u0003","ajaxPageState":{"libraries":"classy\/base,classy\/messages,core\/drupal.active-link,core\/drupal.ajax,core\/drupal.collapse,core\/drupal.tableresponsive,core\/html5shiv,core\/jquery.form,core\/normalize,system\/admin,uc_order\/uc_order.scripts,uc_order\/uc_order.styles,uc_product\/uc_product.styles,uc_store\/uc_store.styles","theme":"classy","theme_token":null},"ajaxTrustedUrl":{"form_action_cc611e1d":true,"\/checkout\/admin\/store\/orders\/1\/edit?ajax_form=1":true},"ucURL":{"adminOrders":"\/checkout\/admin\/store\/orders"},"ajax":{"edit-submit":{"callback":"uc_order_pane_line_items_update","event":"mousedown","keypress":true,"prevent":"click","url":"\/checkout\/admin\/store\/orders\/1\/edit?ajax_form=1","dialogType":"ajax","submit":{"_triggering_element_name":"op","_triggering_element_value":"Add line"}},"edit-add-blank-line-button":{"callback":"uc_order_pane_products_ajax_callback","wrapper":"product-controls","event":"mousedown","keypress":true,"prevent":"click","url":"\/checkout\/admin\/store\/orders\/1\/edit?ajax_form=1","dialogType":"ajax","submit":{"_triggering_element_name":"op","_triggering_element_value":"Add blank line"}},"edit-add-product-button":{"callback":"uc_order_pane_products_ajax_callback","wrapper":"product-controls","event":"mousedown","keypress":true,"prevent":"click","url":"\/checkout\/admin\/store\/orders\/1\/edit?ajax_form=1","dialogType":"ajax","submit":{"_triggering_element_name":"op","_triggering_element_value":"Add product"}},"edit-payment-method":{"callback":"uc_payment_order_pane_ajax_callback","progress":{"type":"throbber"},"wrapper":"payment-details","event":"change","url":"\/checkout\/admin\/store\/orders\/1\/edit?ajax_form=1","dialogType":"ajax","submit":{"_triggering_element_name":"payment_method"}},"edit-bill-to-country":{"callback":["Drupal\\uc_store\\Element\\UcAddress","updateZone"],"wrapper":"uc-store-address-zone-wrapper","progress":{"type":"throbber"},"event":"change","url":"\/checkout\/admin\/store\/orders\/1\/edit?ajax_form=1","dialogType":"ajax","submit":{"_triggering_element_name":"bill_to[country]"}},"edit-ship-to-country":{"callback":["Drupal\\uc_store\\Element\\UcAddress","updateZone"],"wrapper":"uc-store-address-zone-wrapper","progress":{"type":"throbber"},"event":"change","url":"\/checkout\/admin\/store\/orders\/1\/edit?ajax_form=1","dialogType":"ajax","submit":{"_triggering_element_name":"ship_to[country]"}}},"user":{"uid":"2","permissionsHash":"ac2e1569974406d87697502d728c486c12ef36b3ede5a87d998dc95143805b46"}} ', '') Drupal\simpletest\WebTestBase->assertTextHelper(NULL, 'Found the tax title after applicable product change', 'Other', ) Drupal\simpletest\WebTestBase->assertText(NULL, 'Found the tax title after applicable product change') Drupal\uc_tax\Tests\StoredTaxTest->assertTaxLineCorrect(, 0.2, 'after applicable product change') Drupal\uc_tax\Tests\StoredTaxTest->testTaxDisplay() Drupal\simpletest\TestBase->run(Array) simpletest_script_run_one_test('23', 'Drupal\uc_tax\Tests\StoredTaxTest') WarningAssertContentTrait.php614Drupal\simpletest\WebTestBase->assertTextHelper()
Found the tax title after applicable product changeOtherStoredTaxTest.php121Drupal\uc_tax\Tests\StoredTaxTest->testTaxDisplay()
strpos(): Empty needlestrpos(' Skip to main content Order 1 Status message Order changes saved. Ship to: First name Last name Company Street address City State/Province - None -AdanaAdıyamanAfyonAksarayAmasyaAnkaraAntalyaArdahanArtvinAydınAğrıBalıkesirBartınBatmanBayburtBilecikBingölBitlisBoluBurdurBursaDenizliDiyarbakırDüzceEdirneElazığErzincanErzurumEskişehirGaziantepGiresunGümüşhaneHakkâriHatayIspartaIğdırKahramanmaraşKarabükKaramanKarsKastamonuKayseriKilisKocaeliKonyaKütahyaKırklareliKırıkkaleKırşehirMalatyaManisaMardinMuğlaMuşNevşehirNiğdeOrduOsmaniyeRizeSakaryaSamsunSiirtSinopSivasTekirdağTokatTrabzonTunceliUşakVanYalovaYozgatZonguldakÇanakkaleÇankırıÇorumİstanbulİzmirİçelŞanlıurfaŞırnak Country BangladeshCôte d'IvoireMontserratNauruNepalSwitzerlandTanzania, United Republic ofTurkey Postal code Bill to: First name Last name Company Street address City State/Province - None -AdanaAdıyamanAfyonAksarayAmasyaAnkaraAntalyaArdahanArtvinAydınAğrıBalıkesirBartınBatmanBayburtBilecikBingölBitlisBoluBurdurBursaDenizliDiyarbakırDüzceEdirneElazığErzincanErzurumEskişehirGaziantepGiresunGümüşhaneHakkâriHatayIspartaIğdırKahramanmaraşKarabükKaramanKarsKastamonuKayseriKilisKocaeliKonyaKütahyaKırklareliKırıkkaleKırşehirMalatyaManisaMardinMuğlaMuşNevşehirNiğdeOrduOsmaniyeRizeSakaryaSamsunSiirtSinopSivasTekirdağTokatTrabzonTunceliUşakVanYalovaYozgatZonguldakÇanakkaleÇankırıÇorumİstanbulİzmirİçelŞanlıurfaŞırnak Country BangladeshCôte d'IvoireMontserratNauruNepalSwitzerlandTanzania, United Republic ofTurkey Postal code Customer info: Customer number E-mail address Payment: Payment method Free orderCheckCash on deliveryOther Products: Remove Quantity Name SKU Weight Units Cost Price Quantity Title SKU Weight Units PoundsKilogramsOuncesGrams Cost $ Price $ Add a line item Empty line Subtotal:$2,711.00 Order total:$2,711.00Admin comments:No admin comments have been entered for this order.Add an admin comment Admin comments are only seen by store administrators. Delete Primary tabs View Edit(active tab) Invoice Log {"path":{"baseUrl":"\/checkout\/","scriptPath":null,"pathPrefix":"","currentPath":"admin\/store\/orders\/1\/edit","currentPathIsAdmin":true,"isFront":false,"currentLanguage":"en"},"pluralDelimiter":"\u0003","ajaxPageState":{"libraries":"classy\/base,classy\/messages,core\/drupal.active-link,core\/drupal.ajax,core\/drupal.collapse,core\/drupal.tableresponsive,core\/html5shiv,core\/jquery.form,core\/normalize,system\/admin,uc_order\/uc_order.scripts,uc_order\/uc_order.styles,uc_product\/uc_product.styles,uc_store\/uc_store.styles","theme":"classy","theme_token":null},"ajaxTrustedUrl":{"form_action_cc611e1d":true,"\/checkout\/admin\/store\/orders\/1\/edit?ajax_form=1":true},"ucURL":{"adminOrders":"\/checkout\/admin\/store\/orders"},"ajax":{"edit-submit":{"callback":"uc_order_pane_line_items_update","event":"mousedown","keypress":true,"prevent":"click","url":"\/checkout\/admin\/store\/orders\/1\/edit?ajax_form=1","dialogType":"ajax","submit":{"_triggering_element_name":"op","_triggering_element_value":"Add line"}},"edit-add-blank-line-button":{"callback":"uc_order_pane_products_ajax_callback","wrapper":"product-controls","event":"mousedown","keypress":true,"prevent":"click","url":"\/checkout\/admin\/store\/orders\/1\/edit?ajax_form=1","dialogType":"ajax","submit":{"_triggering_element_name":"op","_triggering_element_value":"Add blank line"}},"edit-add-product-button":{"callback":"uc_order_pane_products_ajax_callback","wrapper":"product-controls","event":"mousedown","keypress":true,"prevent":"click","url":"\/checkout\/admin\/store\/orders\/1\/edit?ajax_form=1","dialogType":"ajax","submit":{"_triggering_element_name":"op","_triggering_element_value":"Add product"}},"edit-payment-method":{"callback":"uc_payment_order_pane_ajax_callback","progress":{"type":"throbber"},"wrapper":"payment-details","event":"change","url":"\/checkout\/admin\/store\/orders\/1\/edit?ajax_form=1","dialogType":"ajax","submit":{"_triggering_element_name":"payment_method"}},"edit-bill-to-country":{"callback":["Drupal\\uc_store\\Element\\UcAddress","updateZone"],"wrapper":"uc-store-address-zone-wrapper","progress":{"type":"throbber"},"event":"change","url":"\/checkout\/admin\/store\/orders\/1\/edit?ajax_form=1","dialogType":"ajax","submit":{"_triggering_element_name":"bill_to[country]"}},"edit-ship-to-country":{"callback":["Drupal\\uc_store\\Element\\UcAddress","updateZone"],"wrapper":"uc-store-address-zone-wrapper","progress":{"type":"throbber"},"event":"change","url":"\/checkout\/admin\/store\/orders\/1\/edit?ajax_form=1","dialogType":"ajax","submit":{"_triggering_element_name":"ship_to[country]"}}},"user":{"uid":"2","permissionsHash":"ac2e1569974406d87697502d728c486c12ef36b3ede5a87d998dc95143805b46"}} ', '') Drupal\simpletest\WebTestBase->assertTextHelper(NULL, 'Tax display has the correct amount after applicable product change', 'Other', ) Drupal\simpletest\WebTestBase->assertText(NULL, 'Tax display has the correct amount after applicable product change') Drupal\uc_tax\Tests\StoredTaxTest->assertTaxLineCorrect(, 0.2, 'after applicable product change') Drupal\uc_tax\Tests\StoredTaxTest->testTaxDisplay() Drupal\simpletest\TestBase->run(Array) simpletest_script_run_one_test('23', 'Drupal\uc_tax\Tests\StoredTaxTest') WarningAssertContentTrait.php614Drupal\simpletest\WebTestBase->assertTextHelper()
Tax display has the correct amount after applicable product changeOtherStoredTaxTest.php121Drupal\uc_tax\Tests\StoredTaxTest->testTaxDisplay()
Class 'Drupal\uc_cart\Controller\Cart' not foundPHP Fatal errorCartController.php25Unknown
Class 'Drupal\uc_cart\Controller\Cart' not foundPHP Fatal errorCartController.php25Unknown
Call to undefined method Drupal\uc_cart\CartManager::entityManager()PHP Fatal errorCartManager.php85Unknown

All

Test namePassFailException
ExpandDrupal\uc_attribute\Tests\AttributeTest411202
MessageGroupFilenameLineFunctionStatus
Attribute and selected option found in cartOtherAttributeTest.php745Drupal\uc_attribute\Tests\AttributeTest->testProductAttribute()
Adjusted price found in cartOtherAttributeTest.php746Drupal\uc_attribute\Tests\AttributeTest->testProductAttribute()
simplexml_import_dom(): Invalid Nodetype to importsimplexml_import_dom(Object) Drupal\simpletest\WebTestBase->parse() Drupal\simpletest\WebTestBase->drupalPostForm(NULL, Array, 'Checkout') Drupal\uc_attribute\Tests\AttributeTest->testProductAttribute() Drupal\simpletest\TestBase->run(Array) simpletest_script_run_one_test('5', 'Drupal\uc_attribute\Tests\AttributeTest') WarningAssertContentTrait.php138Drupal\simpletest\WebTestBase->parse()
Attribute and selected option found at checkoutOtherAttributeTest.php750Drupal\uc_attribute\Tests\AttributeTest->testProductAttribute()
Adjusted price found at checkoutOtherAttributeTest.php751Drupal\uc_attribute\Tests\AttributeTest->testProductAttribute()
simplexml_import_dom(): Invalid Nodetype to importsimplexml_import_dom(Object) Drupal\simpletest\WebTestBase->parse() Drupal\simpletest\WebTestBase->drupalPostForm('cart', Array, 'Checkout') Drupal\uc_store\Tests\UbercartTestBase->checkout() Drupal\uc_attribute\Tests\AttributeTest->testProductAttribute() Drupal\simpletest\TestBase->run(Array) simpletest_script_run_one_test('5', 'Drupal\uc_attribute\Tests\AttributeTest') WarningAssertContentTrait.php138Drupal\simpletest\WebTestBase->parse()
Viewed cart page: Billing pane has been displayed.OtherUbercartTestBase.php249Drupal\uc_store\Tests\UbercartTestBase->checkout()
Class 'Drupal\uc_cart\Controller\Cart' not foundPHP Fatal errorCartController.php25Unknown
Class 'Drupal\uc_cart\Controller\Cart' not foundPHP Fatal errorCartController.php25Unknown
Call to undefined method Drupal\uc_cart\CartManager::entityManager()PHP Fatal errorCartManager.php85Unknown
Option selected on cart item.OtherAttributeTest.php806Drupal\uc_attribute\Tests\AttributeTest->testAttributeAddToCart()
Product has adjusted price.OtherAttributeTest.php807Drupal\uc_attribute\Tests\AttributeTest->testAttributeAddToCart()
Option selected on cart item.OtherAttributeTest.php806Drupal\uc_attribute\Tests\AttributeTest->testAttributeAddToCart()
Product has adjusted price.OtherAttributeTest.php807Drupal\uc_attribute\Tests\AttributeTest->testAttributeAddToCart()
Option selected on cart item.OtherAttributeTest.php806Drupal\uc_attribute\Tests\AttributeTest->testAttributeAddToCart()
Product has adjusted price.OtherAttributeTest.php807Drupal\uc_attribute\Tests\AttributeTest->testAttributeAddToCart()
Option selected on cart item.OtherAttributeTest.php806Drupal\uc_attribute\Tests\AttributeTest->testAttributeAddToCart()
Product has adjusted price.OtherAttributeTest.php807Drupal\uc_attribute\Tests\AttributeTest->testAttributeAddToCart()
Class 'Drupal\uc_cart\Controller\Cart' not foundPHP Fatal errorCartController.php25Unknown
Class 'Drupal\uc_cart\Controller\Cart' not foundPHP Fatal errorCartController.php25Unknown
Class 'Drupal\uc_cart\Controller\Cart' not foundPHP Fatal errorCartController.php25Unknown
Class 'Drupal\uc_cart\Controller\Cart' not foundPHP Fatal errorCartController.php25Unknown
ExpandDrupal\uc_cart\Tests\CartBlockTest6320
MessageGroupFilenameLineFunctionStatus
Class 'Drupal\uc_cart\Controller\Cart' not foundPHP Fatal errorCartController.php25Unknown
Class 'Drupal\uc_cart\Controller\Cart' not foundPHP Fatal errorCartController.php25Unknown
ExpandDrupal\uc_cart\Tests\CartCheckoutTest29110428
MessageGroupFilenameLineFunctionStatus
"There are no products in your shopping cart." foundOtherCartCheckoutTest.php117Drupal\uc_cart\Tests\CartCheckoutTest->testCart()
"fC20RC2u added to your shopping cart." foundOtherCartCheckoutTest.php121Drupal\uc_cart\Tests\CartCheckoutTest->testCart()
"hook_uc_cart_item_insert fired" foundOtherCartCheckoutTest.php122Drupal\uc_cart\Tests\CartCheckoutTest->testCart()
The product is in the cart.OtherCartCheckoutTest.php126Drupal\uc_cart\Tests\CartCheckoutTest->testCart()
simplexml_import_dom(): Invalid Nodetype to importsimplexml_import_dom(Object) Drupal\simpletest\WebTestBase->parse() Drupal\simpletest\WebTestBase->xpath('//textarea[@name="items[0][qty]"]|//input[@name="items[0][qty]"]|//select[@name="items[0][qty]"]') Drupal\simpletest\WebTestBase->assertFieldByXPath('//textarea[@name="items[0][qty]"]|//input[@name="items[0][qty]"]|//select[@name="items[0][qty]"]', 1, 'The product quantity is 1.', 'Browser') Drupal\simpletest\WebTestBase->assertFieldByName('items[0][qty]', 1, 'The product quantity is 1.') Drupal\uc_cart\Tests\CartCheckoutTest->testCart() Drupal\simpletest\TestBase->run(Array) simpletest_script_run_one_test('6', 'Drupal\uc_cart\Tests\CartCheckoutTest') WarningAssertContentTrait.php138Drupal\simpletest\WebTestBase->parse()
The product quantity is 1.BrowserCartCheckoutTest.php127Drupal\uc_cart\Tests\CartCheckoutTest->testCart()
"Your item(s) have been updated." foundOtherCartCheckoutTest.php131Drupal\uc_cart\Tests\CartCheckoutTest->testCart()
"hook_uc_cart_item_update fired" foundOtherCartCheckoutTest.php132Drupal\uc_cart\Tests\CartCheckoutTest->testCart()
simplexml_import_dom(): Invalid Nodetype to importsimplexml_import_dom(Object) Drupal\simpletest\WebTestBase->parse() Drupal\simpletest\WebTestBase->xpath('//textarea[@name="items[0][qty]"]|//input[@name="items[0][qty]"]|//select[@name="items[0][qty]"]') Drupal\simpletest\WebTestBase->assertFieldByXPath('//textarea[@name="items[0][qty]"]|//input[@name="items[0][qty]"]|//select[@name="items[0][qty]"]', 2, 'The product quantity is 2.', 'Browser') Drupal\simpletest\WebTestBase->assertFieldByName('items[0][qty]', 2, 'The product quantity is 2.') Drupal\uc_cart\Tests\CartCheckoutTest->testCart() Drupal\simpletest\TestBase->run(Array) simpletest_script_run_one_test('6', 'Drupal\uc_cart\Tests\CartCheckoutTest') WarningAssertContentTrait.php138Drupal\simpletest\WebTestBase->parse()
The product quantity is 2.BrowserCartCheckoutTest.php136Drupal\uc_cart\Tests\CartCheckoutTest->testCart()
simplexml_import_dom(): Invalid Nodetype to importsimplexml_import_dom(Object) Drupal\simpletest\WebTestBase->parse() Drupal\simpletest\WebTestBase->drupalPostForm('cart', Array, Object) Drupal\uc_cart\Tests\CartCheckoutTest->testCart() Drupal\simpletest\TestBase->run(Array) simpletest_script_run_one_test('6', 'Drupal\uc_cart\Tests\CartCheckoutTest') WarningAssertContentTrait.php138Drupal\simpletest\WebTestBase->parse()
"Your cart has been updated." foundOtherCartCheckoutTest.php141Drupal\uc_cart\Tests\CartCheckoutTest->testCart()
simplexml_import_dom(): Invalid Nodetype to importsimplexml_import_dom(Object) Drupal\simpletest\WebTestBase->parse() Drupal\simpletest\WebTestBase->xpath('//textarea[@name="items[0][qty]"]|//input[@name="items[0][qty]"]|//select[@name="items[0][qty]"]') Drupal\simpletest\WebTestBase->assertFieldByXPath('//textarea[@name="items[0][qty]"]|//input[@name="items[0][qty]"]|//select[@name="items[0][qty]"]', 34, 'The product quantity was updated.', 'Browser') Drupal\simpletest\WebTestBase->assertFieldByName('items[0][qty]', 34, 'The product quantity was updated.') Drupal\uc_cart\Tests\CartCheckoutTest->testCart() Drupal\simpletest\TestBase->run(Array) simpletest_script_run_one_test('6', 'Drupal\uc_cart\Tests\CartCheckoutTest') WarningAssertContentTrait.php138Drupal\simpletest\WebTestBase->parse()
The product quantity was updated.BrowserCartCheckoutTest.php142Drupal\uc_cart\Tests\CartCheckoutTest->testCart()
"hook_uc_cart_item_update fired" foundOtherCartCheckoutTest.php143Drupal\uc_cart\Tests\CartCheckoutTest->testCart()
simplexml_import_dom(): Invalid Nodetype to importsimplexml_import_dom(Object) Drupal\simpletest\WebTestBase->parse() Drupal\simpletest\WebTestBase->drupalPostForm('cart', Array, Object) Drupal\uc_cart\Tests\CartCheckoutTest->testCart() Drupal\simpletest\TestBase->run(Array) simpletest_script_run_one_test('6', 'Drupal\uc_cart\Tests\CartCheckoutTest') WarningAssertContentTrait.php138Drupal\simpletest\WebTestBase->parse()
"Your cart has been updated." foundOtherCartCheckoutTest.php147Drupal\uc_cart\Tests\CartCheckoutTest->testCart()
"There are no products in your shopping cart." foundOtherCartCheckoutTest.php148Drupal\uc_cart\Tests\CartCheckoutTest->testCart()
"hook_uc_cart_item_delete fired" foundOtherCartCheckoutTest.php149Drupal\uc_cart\Tests\CartCheckoutTest->testCart()
simplexml_import_dom(): Invalid Nodetype to importsimplexml_import_dom(Object) Drupal\simpletest\WebTestBase->parse() Drupal\simpletest\WebTestBase->drupalPostForm('cart', Array, Object) Drupal\uc_cart\Tests\CartCheckoutTest->testCart() Drupal\simpletest\TestBase->run(Array) simpletest_script_run_one_test('6', 'Drupal\uc_cart\Tests\CartCheckoutTest') WarningAssertContentTrait.php138Drupal\simpletest\WebTestBase->parse()
"fC20RC2u removed from your shopping cart." foundOtherCartCheckoutTest.php154Drupal\uc_cart\Tests\CartCheckoutTest->testCart()
"There are no products in your shopping cart." foundOtherCartCheckoutTest.php155Drupal\uc_cart\Tests\CartCheckoutTest->testCart()
"hook_uc_cart_item_delete fired" foundOtherCartCheckoutTest.php156Drupal\uc_cart\Tests\CartCheckoutTest->testCart()
simplexml_import_dom(): Invalid Nodetype to importsimplexml_import_dom(Object) Drupal\simpletest\WebTestBase->parse() Drupal\simpletest\WebTestBase->drupalPostForm('cart', Array, Object) Drupal\uc_cart\Tests\CartCheckoutTest->testCart() Drupal\simpletest\TestBase->run(Array) simpletest_script_run_one_test('6', 'Drupal\uc_cart\Tests\CartCheckoutTest') WarningAssertContentTrait.php138Drupal\simpletest\WebTestBase->parse()
simplexml_import_dom(): Invalid Nodetype to importsimplexml_import_dom(Object) Drupal\simpletest\WebTestBase->parse() Drupal\simpletest\WebTestBase->drupalPostForm(NULL, Array, Object) Drupal\uc_cart\Tests\CartCheckoutTest->testCart() Drupal\simpletest\TestBase->run(Array) simpletest_script_run_one_test('6', 'Drupal\uc_cart\Tests\CartCheckoutTest') WarningAssertContentTrait.php138Drupal\simpletest\WebTestBase->parse()
"There are no products in your shopping cart." foundOtherCartCheckoutTest.php165Drupal\uc_cart\Tests\CartCheckoutTest->testCart()
"hook_uc_cart_item_delete fired" foundOtherCartCheckoutTest.php166Drupal\uc_cart\Tests\CartCheckoutTest->testCart()
Class 'Drupal\uc_cart\Controller\Cart' not foundPHP Fatal errorCartController.php25Unknown
Class 'Drupal\uc_cart\Controller\Cart' not foundPHP Fatal errorCartController.php25Unknown
Class 'Drupal\uc_cart\Controller\Cart' not foundPHP Fatal errorCartController.php25Unknown
Class 'Drupal\uc_cart\Controller\Cart' not foundPHP Fatal errorCartController.php25Unknown
Class 'Drupal\uc_cart\Controller\Cart' not foundPHP Fatal errorCartController.php25Unknown
Class 'Drupal\uc_cart\Controller\Cart' not foundPHP Fatal errorCartController.php25Unknown
Class 'Drupal\uc_cart\Controller\Cart' not foundPHP Fatal errorCartController.php25Unknown
Class 'Drupal\uc_cart\Controller\Cart' not foundPHP Fatal errorCartController.php25Unknown
Class 'Drupal\uc_cart\Controller\Cart' not foundPHP Fatal errorCartController.php25Unknown
Class 'Drupal\uc_cart\Controller\Cart' not foundPHP Fatal errorCartController.php25Unknown
Class 'Drupal\uc_cart\Controller\Cart' not foundPHP Fatal errorCartController.php25Unknown
Class 'Drupal\uc_cart\Controller\Cart' not foundPHP Fatal errorCartController.php25Unknown
"prw8Pdsv added to your shopping cart." foundOtherCartCheckoutTest.php173Drupal\uc_cart\Tests\CartCheckoutTest->testCartMerge()
"prw8Pdsv added to your shopping cart." foundOtherCartCheckoutTest.php178Drupal\uc_cart\Tests\CartCheckoutTest->testCartMerge()
The product remains in the cart after logging in.OtherCartCheckoutTest.php183Drupal\uc_cart\Tests\CartCheckoutTest->testCartMerge()
simplexml_import_dom(): Invalid Nodetype to importsimplexml_import_dom(Object) Drupal\simpletest\WebTestBase->parse() Drupal\simpletest\WebTestBase->xpath('//textarea[@name="items[0][qty]"]|//input[@name="items[0][qty]"]|//select[@name="items[0][qty]"]') Drupal\simpletest\WebTestBase->assertFieldByXPath('//textarea[@name="items[0][qty]"]|//input[@name="items[0][qty]"]|//select[@name="items[0][qty]"]', 2, 'The product quantity is 2.', 'Browser') Drupal\simpletest\WebTestBase->assertFieldByName('items[0][qty]', 2, 'The product quantity is 2.') Drupal\uc_cart\Tests\CartCheckoutTest->testCartMerge() Drupal\simpletest\TestBase->run(Array) simpletest_script_run_one_test('6', 'Drupal\uc_cart\Tests\CartCheckoutTest') WarningAssertContentTrait.php138Drupal\simpletest\WebTestBase->parse()
The product quantity is 2.BrowserCartCheckoutTest.php184Drupal\uc_cart\Tests\CartCheckoutTest->testCartMerge()
Class 'Drupal\uc_cart\Controller\Cart' not foundPHP Fatal errorCartController.php25Unknown
Class 'Drupal\uc_cart\Controller\Cart' not foundPHP Fatal errorCartController.php25Unknown
Class 'Drupal\uc_cart\Controller\Cart' not foundPHP Fatal errorCartController.php25Unknown
"There are no products in your shopping cart." foundOtherCartCheckoutTest.php194Drupal\uc_cart\Tests\CartCheckoutTest->testDeletedCartItem()
Class 'Drupal\uc_cart\Controller\Cart' not foundPHP Fatal errorCartController.php25Unknown
Class 'Drupal\uc_cart\Controller\Cart' not foundPHP Fatal errorCartController.php25Unknown
simplexml_import_dom(): Invalid Nodetype to importsimplexml_import_dom(Object) Drupal\simpletest\WebTestBase->parse() Drupal\simpletest\WebTestBase->drupalPostForm('cart', Array, 'Checkout') Drupal\uc_store\Tests\UbercartTestBase->checkout() Drupal\uc_cart\Tests\CartCheckoutTest->testAuthenticatedCheckout() Drupal\simpletest\TestBase->run(Array) simpletest_script_run_one_test('6', 'Drupal\uc_cart\Tests\CartCheckoutTest') WarningAssertContentTrait.php138Drupal\simpletest\WebTestBase->parse()
Viewed cart page: Billing pane has been displayed.OtherUbercartTestBase.php249Drupal\uc_store\Tests\UbercartTestBase->checkout()
Raw "Your order is complete!" foundOtherCartCheckoutTest.php217Drupal\uc_cart\Tests\CartCheckoutTest->testAuthenticatedCheckout()
Raw "While logged in" foundOtherCartCheckoutTest.php218Drupal\uc_cart\Tests\CartCheckoutTest->testAuthenticatedCheckout()
"There are no products in your shopping cart." foundOtherCartCheckoutTest.php222Drupal\uc_cart\Tests\CartCheckoutTest->testAuthenticatedCheckout()
Class 'Drupal\uc_cart\Controller\Cart' not foundPHP Fatal errorCartController.php25Unknown
Class 'Drupal\uc_cart\Controller\Cart' not foundPHP Fatal errorCartController.php25Unknown
Call to undefined method Drupal\uc_cart\CartManager::entityManager()PHP Fatal errorCartManager.php85Unknown
Class 'Drupal\uc_cart\Controller\Cart' not foundPHP Fatal errorCartController.php25Unknown
simplexml_import_dom(): Invalid Nodetype to importsimplexml_import_dom(Object) Drupal\simpletest\WebTestBase->parse() Drupal\simpletest\WebTestBase->drupalPostForm('cart', Array, 'Checkout') Drupal\uc_store\Tests\UbercartTestBase->checkout() Drupal\uc_cart\Tests\CartCheckoutTest->testAnonymousCheckoutAccountGenerated() Drupal\simpletest\TestBase->run(Array) simpletest_script_run_one_test('6', 'Drupal\uc_cart\Tests\CartCheckoutTest') WarningAssertContentTrait.php138Drupal\simpletest\WebTestBase->parse()
Viewed cart page: Billing pane has been displayed.OtherUbercartTestBase.php249Drupal\uc_store\Tests\UbercartTestBase->checkout()
Raw "Your order is complete!" foundOtherCartCheckoutTest.php228Drupal\uc_cart\Tests\CartCheckoutTest->testAnonymousCheckoutAccountGenerated()
New username is not empty.OtherCartCheckoutTest.php234Drupal\uc_cart\Tests\CartCheckoutTest->testAnonymousCheckoutAccountGenerated()
New password is not empty.OtherCartCheckoutTest.php235Drupal\uc_cart\Tests\CartCheckoutTest->testAnonymousCheckoutAccountGenerated()
Trying to get property of non-objectDrupal\uc_cart\Tests\CartCheckoutTest->testAnonymousCheckoutAccountGenerated() Drupal\simpletest\TestBase->run(Array) simpletest_script_run_one_test('6', 'Drupal\uc_cart\Tests\CartCheckoutTest') NoticeCartCheckoutTest.php236Drupal\uc_cart\Tests\CartCheckoutTest->testAnonymousCheckoutAccountGenerated()
Trying to get property of non-objectDrupal\uc_cart\Tests\CartCheckoutTest->testAnonymousCheckoutAccountGenerated() Drupal\simpletest\TestBase->run(Array) simpletest_script_run_one_test('6', 'Drupal\uc_cart\Tests\CartCheckoutTest') NoticeCartCheckoutTest.php236Drupal\uc_cart\Tests\CartCheckoutTest->testAnonymousCheckoutAccountGenerated()
Mail body contains username.OtherCartCheckoutTest.php236Drupal\uc_cart\Tests\CartCheckoutTest->testAnonymousCheckoutAccountGenerated()
Trying to get property of non-objectDrupal\uc_cart\Tests\CartCheckoutTest->testAnonymousCheckoutAccountGenerated() Drupal\simpletest\TestBase->run(Array) simpletest_script_run_one_test('6', 'Drupal\uc_cart\Tests\CartCheckoutTest') NoticeCartCheckoutTest.php241Drupal\uc_cart\Tests\CartCheckoutTest->testAnonymousCheckoutAccountGenerated()
Trying to get property of non-objectDrupal\uc_cart\Tests\CartCheckoutTest->testAnonymousCheckoutAccountGenerated() Drupal\simpletest\TestBase->run(Array) simpletest_script_run_one_test('6', 'Drupal\uc_cart\Tests\CartCheckoutTest') NoticeCartCheckoutTest.php241Drupal\uc_cart\Tests\CartCheckoutTest->testAnonymousCheckoutAccountGenerated()
Invoice body contains username.OtherCartCheckoutTest.php241Drupal\uc_cart\Tests\CartCheckoutTest->testAnonymousCheckoutAccountGenerated()
Trying to get property of non-objectDrupal\uc_cart\Tests\CartCheckoutTest->testAnonymousCheckoutAccountGenerated() Drupal\simpletest\TestBase->run(Array) simpletest_script_run_one_test('6', 'Drupal\uc_cart\Tests\CartCheckoutTest') NoticeCartCheckoutTest.php242Drupal\uc_cart\Tests\CartCheckoutTest->testAnonymousCheckoutAccountGenerated()
Invoice body contains password.OtherCartCheckoutTest.php242Drupal\uc_cart\Tests\CartCheckoutTest->testAnonymousCheckoutAccountGenerated()
Trying to get property of non-objectDrupal\uc_cart\Tests\CartCheckoutTest->testAnonymousCheckoutAccountGenerated() Drupal\simpletest\TestBase->run(Array) simpletest_script_run_one_test('6', 'Drupal\uc_cart\Tests\CartCheckoutTest') NoticeCartCheckoutTest.php245Drupal\uc_cart\Tests\CartCheckoutTest->testAnonymousCheckoutAccountGenerated()
Trying to get property of non-objectDrupal\uc_cart\Tests\CartCheckoutTest->testAnonymousCheckoutAccountGenerated() Drupal\simpletest\TestBase->run(Array) simpletest_script_run_one_test('6', 'Drupal\uc_cart\Tests\CartCheckoutTest') NoticeCartCheckoutTest.php245Drupal\uc_cart\Tests\CartCheckoutTest->testAnonymousCheckoutAccountGenerated()
strpos(): Empty needlestrpos('', '') Drupal\simpletest\WebTestBase->assertTextHelper(NULL, 'Username is shown on screen.', 'Other', ) Drupal\simpletest\WebTestBase->assertText(NULL, 'Username is shown on screen.') Drupal\uc_cart\Tests\CartCheckoutTest->testAnonymousCheckoutAccountGenerated() Drupal\simpletest\TestBase->run(Array) simpletest_script_run_one_test('6', 'Drupal\uc_cart\Tests\CartCheckoutTest') WarningAssertContentTrait.php614Drupal\simpletest\WebTestBase->assertTextHelper()
Username is shown on screen.OtherCartCheckoutTest.php245Drupal\uc_cart\Tests\CartCheckoutTest->testAnonymousCheckoutAccountGenerated()
Trying to get property of non-objectDrupal\uc_cart\Tests\CartCheckoutTest->testAnonymousCheckoutAccountGenerated() Drupal\simpletest\TestBase->run(Array) simpletest_script_run_one_test('6', 'Drupal\uc_cart\Tests\CartCheckoutTest') NoticeCartCheckoutTest.php246Drupal\uc_cart\Tests\CartCheckoutTest->testAnonymousCheckoutAccountGenerated()
strpos(): Empty needlestrpos('', '') Drupal\simpletest\WebTestBase->assertTextHelper(NULL, 'Password is shown on screen.', 'Other', ) Drupal\simpletest\WebTestBase->assertText(NULL, 'Password is shown on screen.') Drupal\uc_cart\Tests\CartCheckoutTest->testAnonymousCheckoutAccountGenerated() Drupal\simpletest\TestBase->run(Array) simpletest_script_run_one_test('6', 'Drupal\uc_cart\Tests\CartCheckoutTest') WarningAssertContentTrait.php614Drupal\simpletest\WebTestBase->assertTextHelper()
Password is shown on screen.OtherCartCheckoutTest.php246Drupal\uc_cart\Tests\CartCheckoutTest->testAnonymousCheckoutAccountGenerated()
"There are no products in your shopping cart." foundOtherCartCheckoutTest.php250Drupal\uc_cart\Tests\CartCheckoutTest->testAnonymousCheckoutAccountGenerated()
Trying to get property of non-objectDrupal\uc_cart\Tests\CartCheckoutTest->testAnonymousCheckoutAccountGenerated() Drupal\simpletest\TestBase->run(Array) simpletest_script_run_one_test('6', 'Drupal\uc_cart\Tests\CartCheckoutTest') NoticeCartCheckoutTest.php254Drupal\uc_cart\Tests\CartCheckoutTest->testAnonymousCheckoutAccountGenerated()
Trying to get property of non-objectDrupal\uc_cart\Tests\CartCheckoutTest->testAnonymousCheckoutAccountGenerated() Drupal\simpletest\TestBase->run(Array) simpletest_script_run_one_test('6', 'Drupal\uc_cart\Tests\CartCheckoutTest') NoticeCartCheckoutTest.php254Drupal\uc_cart\Tests\CartCheckoutTest->testAnonymousCheckoutAccountGenerated()
Trying to get property of non-objectDrupal\uc_cart\Tests\CartCheckoutTest->testAnonymousCheckoutAccountGenerated() Drupal\simpletest\TestBase->run(Array) simpletest_script_run_one_test('6', 'Drupal\uc_cart\Tests\CartCheckoutTest') NoticeCartCheckoutTest.php255Drupal\uc_cart\Tests\CartCheckoutTest->testAnonymousCheckoutAccountGenerated()
Failed to set field name to OtherCartCheckoutTest.php257Drupal\uc_cart\Tests\CartCheckoutTest->testAnonymousCheckoutAccountGenerated()
Failed to set field pass to OtherCartCheckoutTest.php257Drupal\uc_cart\Tests\CartCheckoutTest->testAnonymousCheckoutAccountGenerated()
Found the requested form fields at userOtherCartCheckoutTest.php257Drupal\uc_cart\Tests\CartCheckoutTest->testAnonymousCheckoutAccountGenerated()
Class 'Drupal\uc_cart\Controller\Cart' not foundPHP Fatal errorCartController.php25Unknown
Class 'Drupal\uc_cart\Controller\Cart' not foundPHP Fatal errorCartController.php25Unknown
Call to undefined method Drupal\uc_cart\CartManager::entityManager()PHP Fatal errorCartManager.php85Unknown
Class 'Drupal\uc_cart\Controller\Cart' not foundPHP Fatal errorCartController.php25Unknown
simplexml_import_dom(): Invalid Nodetype to importsimplexml_import_dom(Object) Drupal\simpletest\WebTestBase->parse() Drupal\simpletest\WebTestBase->drupalPostForm('cart', Array, 'Checkout') Drupal\uc_store\Tests\UbercartTestBase->checkout(Array) Drupal\uc_cart\Tests\CartCheckoutTest->testAnonymousCheckoutAccountProvided() Drupal\simpletest\TestBase->run(Array) simpletest_script_run_one_test('6', 'Drupal\uc_cart\Tests\CartCheckoutTest') WarningAssertContentTrait.php138Drupal\simpletest\WebTestBase->parse()
Viewed cart page: Billing pane has been displayed.OtherUbercartTestBase.php249Drupal\uc_store\Tests\UbercartTestBase->checkout()
Raw "Your order is complete!" foundOtherCartCheckoutTest.php279Drupal\uc_cart\Tests\CartCheckoutTest->testAnonymousCheckoutAccountProvided()
Username is shown on screen.OtherCartCheckoutTest.php280Drupal\uc_cart\Tests\CartCheckoutTest->testAnonymousCheckoutAccountProvided()
Mail body contains username.OtherCartCheckoutTest.php286Drupal\uc_cart\Tests\CartCheckoutTest->testAnonymousCheckoutAccountProvided()
Invoice body contains username.OtherCartCheckoutTest.php291Drupal\uc_cart\Tests\CartCheckoutTest->testAnonymousCheckoutAccountProvided()
"There are no products in your shopping cart." foundOtherCartCheckoutTest.php296Drupal\uc_cart\Tests\CartCheckoutTest->testAnonymousCheckoutAccountProvided()
Class 'Drupal\uc_cart\Controller\Cart' not foundPHP Fatal errorCartController.php25Unknown
Class 'Drupal\uc_cart\Controller\Cart' not foundPHP Fatal errorCartController.php25Unknown
Call to undefined method Drupal\uc_cart\CartManager::entityManager()PHP Fatal errorCartManager.php85Unknown
Class 'Drupal\uc_cart\Controller\Cart' not foundPHP Fatal errorCartController.php25Unknown
simplexml_import_dom(): Invalid Nodetype to importsimplexml_import_dom(Object) Drupal\simpletest\WebTestBase->parse() Drupal\simpletest\WebTestBase->drupalPostForm('cart', Array, 'Checkout') Drupal\uc_store\Tests\UbercartTestBase->checkout(Array) Drupal\uc_cart\Tests\CartCheckoutTest->testAnonymousCheckoutAccountExists() Drupal\simpletest\TestBase->run(Array) simpletest_script_run_one_test('6', 'Drupal\uc_cart\Tests\CartCheckoutTest') WarningAssertContentTrait.php138Drupal\simpletest\WebTestBase->parse()
Viewed cart page: Billing pane has been displayed.OtherUbercartTestBase.php249Drupal\uc_store\Tests\UbercartTestBase->checkout()
Raw "Your order is complete!" foundOtherCartCheckoutTest.php309Drupal\uc_cart\Tests\CartCheckoutTest->testAnonymousCheckoutAccountExists()
Raw "order has been attached to the account we found" foundOtherCartCheckoutTest.php310Drupal\uc_cart\Tests\CartCheckoutTest->testAnonymousCheckoutAccountExists()
"There are no products in your shopping cart." foundOtherCartCheckoutTest.php314Drupal\uc_cart\Tests\CartCheckoutTest->testAnonymousCheckoutAccountExists()
Class 'Drupal\uc_cart\Controller\Cart' not foundPHP Fatal errorCartController.php25Unknown
Class 'Drupal\uc_cart\Controller\Cart' not foundPHP Fatal errorCartController.php25Unknown
Call to undefined method Drupal\uc_cart\CartManager::entityManager()PHP Fatal errorCartManager.php85Unknown
Class 'Drupal\uc_cart\Controller\Cart' not foundPHP Fatal errorCartController.php25Unknown
"Your order is complete!" foundOtherCartCheckoutTest.php346Drupal\uc_cart\Tests\CartCheckoutTest->testCheckoutNewUsername()
"A new account has been created" foundOtherCartCheckoutTest.php347Drupal\uc_cart\Tests\CartCheckoutTest->testCheckoutNewUsername()
Class 'Drupal\uc_cart\Controller\Cart' not foundPHP Fatal errorCartController.php25Unknown
Call to undefined method Drupal\uc_cart\CartManager::entityManager()PHP Fatal errorCartManager.php85Unknown
simplexml_import_dom(): Invalid Nodetype to importsimplexml_import_dom(Object) Drupal\simpletest\WebTestBase->parse() Drupal\simpletest\WebTestBase->drupalPostForm('cart', Array, 'Checkout') Drupal\uc_store\Tests\UbercartTestBase->checkout() Drupal\uc_cart\Tests\CartCheckoutTest->testCheckoutBlockedUser() Drupal\simpletest\TestBase->run(Array) simpletest_script_run_one_test('6', 'Drupal\uc_cart\Tests\CartCheckoutTest') WarningAssertContentTrait.php138Drupal\simpletest\WebTestBase->parse()
Viewed cart page: Billing pane has been displayed.OtherUbercartTestBase.php249Drupal\uc_store\Tests\UbercartTestBase->checkout()
Raw "Your order is complete!" foundOtherCartCheckoutTest.php362Drupal\uc_cart\Tests\CartCheckoutTest->testCheckoutBlockedUser()
Blocked user email found.OtherCartCheckoutTest.php366Drupal\uc_cart\Tests\CartCheckoutTest->testCheckoutBlockedUser()
Class 'Drupal\uc_cart\Controller\Cart' not foundPHP Fatal errorCartController.php25Unknown
Class 'Drupal\uc_cart\Controller\Cart' not foundPHP Fatal errorCartController.php25Unknown
Call to undefined method Drupal\uc_cart\CartManager::entityManager()PHP Fatal errorCartManager.php85Unknown
simplexml_import_dom(): Invalid Nodetype to importsimplexml_import_dom(Object) Drupal\simpletest\WebTestBase->parse() Drupal\simpletest\WebTestBase->drupalPostForm('cart', Array, 'Checkout') Drupal\uc_store\Tests\UbercartTestBase->checkout() Drupal\uc_cart\Tests\CartCheckoutTest->testCheckoutLogin() Drupal\simpletest\TestBase->run(Array) simpletest_script_run_one_test('6', 'Drupal\uc_cart\Tests\CartCheckoutTest') WarningAssertContentTrait.php138Drupal\simpletest\WebTestBase->parse()
Viewed cart page: Billing pane has been displayed.OtherUbercartTestBase.php249Drupal\uc_store\Tests\UbercartTestBase->checkout()
Raw "Your order is complete!" foundOtherCartCheckoutTest.php383Drupal\uc_cart\Tests\CartCheckoutTest->testCheckoutLogin()
Raw "you are already logged in" foundOtherCartCheckoutTest.php384Drupal\uc_cart\Tests\CartCheckoutTest->testCheckoutLogin()
User is logged in.OtherCartCheckoutTest.php388Drupal\uc_cart\Tests\CartCheckoutTest->testCheckoutLogin()
"There are no products in your shopping cart." foundOtherCartCheckoutTest.php392Drupal\uc_cart\Tests\CartCheckoutTest->testCheckoutLogin()
Class 'Drupal\uc_cart\Controller\Cart' not foundPHP Fatal errorCartController.php25Unknown
Class 'Drupal\uc_cart\Controller\Cart' not foundPHP Fatal errorCartController.php25Unknown
Call to undefined method Drupal\uc_cart\CartManager::entityManager()PHP Fatal errorCartManager.php85Unknown
Class 'Drupal\uc_cart\Controller\Cart' not foundPHP Fatal errorCartController.php25Unknown
The test did not complete due to a fatal error.Completion checkCartCheckoutTest.php395Drupal\uc_cart\Tests\CartCheckoutTest->testCheckoutComplete()
ExpandDrupal\uc_cart\Tests\CartSettingsTest132188
MessageGroupFilenameLineFunctionStatus
"vnWhV2s8 added to your shopping cart." foundOtherCartSettingsTest.php31Drupal\uc_cart\Tests\CartSettingsTest->testAddToCartMessage()
simplexml_import_dom(): Invalid Nodetype to importsimplexml_import_dom(Object) Drupal\simpletest\WebTestBase->parse() Drupal\simpletest\WebTestBase->drupalPostForm('cart', Array, 'Remove') Drupal\uc_cart\Tests\CartSettingsTest->testAddToCartMessage() Drupal\simpletest\TestBase->run(Array) simpletest_script_run_one_test('8', 'Drupal\uc_cart\Tests\CartSettingsTest') WarningAssertContentTrait.php138Drupal\simpletest\WebTestBase->parse()
Class 'Drupal\uc_cart\Controller\Cart' not foundPHP Fatal errorCartController.php25Unknown
Class 'Drupal\uc_cart\Controller\Cart' not foundPHP Fatal errorCartController.php25Unknown
Class 'Drupal\uc_cart\Controller\Cart' not foundPHP Fatal errorCartController.php25Unknown
simplexml_import_dom(): Invalid Nodetype to importsimplexml_import_dom(Object) Drupal\simpletest\WebTestBase->parse() Drupal\simpletest\WebTestBase->drupalPostForm('cart', Array, Object) Drupal\uc_cart\Tests\CartSettingsTest->testMinimumSubtotal() Drupal\simpletest\TestBase->run(Array) simpletest_script_run_one_test('8', 'Drupal\uc_cart\Tests\CartSettingsTest') WarningAssertContentTrait.php138Drupal\simpletest\WebTestBase->parse()
Prevented checkout below the minimum order total.OtherCartSettingsTest.php113Drupal\uc_cart\Tests\CartSettingsTest->testMinimumSubtotal()
simplexml_import_dom(): Invalid Nodetype to importsimplexml_import_dom(Object) Drupal\simpletest\WebTestBase->parse() Drupal\simpletest\WebTestBase->drupalPostForm('cart', Array, Object) Drupal\uc_cart\Tests\CartSettingsTest->testMinimumSubtotal() Drupal\simpletest\TestBase->run(Array) simpletest_script_run_one_test('8', 'Drupal\uc_cart\Tests\CartSettingsTest') WarningAssertContentTrait.php138Drupal\simpletest\WebTestBase->parse()
"Enter your billing address and information here." foundOtherCartSettingsTest.php126Drupal\uc_cart\Tests\CartSettingsTest->testMinimumSubtotal()
Class 'Drupal\uc_cart\Controller\Cart' not foundPHP Fatal errorCartController.php25Unknown
Class 'Drupal\uc_cart\Controller\Cart' not foundPHP Fatal errorCartController.php25Unknown
Class 'Drupal\uc_cart\Controller\Cart' not foundPHP Fatal errorCartController.php25Unknown
Class 'Drupal\uc_cart\Controller\Cart' not foundPHP Fatal errorCartController.php25Unknown
simplexml_import_dom(): Invalid Nodetype to importsimplexml_import_dom(Object) Drupal\simpletest\WebTestBase->parse() Drupal\simpletest\WebTestBase->xpath('//a[normalize-space(text())=:label]', Array) Drupal\simpletest\WebTestBase->assertLink(Object, 0, 'Continue shopping link appears on the page.') Drupal\uc_cart\Tests\CartSettingsTest->testContinueShopping() Drupal\simpletest\TestBase->run(Array) simpletest_script_run_one_test('8', 'Drupal\uc_cart\Tests\CartSettingsTest') WarningAssertContentTrait.php138Drupal\simpletest\WebTestBase->parse()
Continue shopping link appears on the page.OtherCartSettingsTest.php140Drupal\uc_cart\Tests\CartSettingsTest->testContinueShopping()
simplexml_import_dom(): Invalid Nodetype to importsimplexml_import_dom(Object) Drupal\simpletest\WebTestBase->parse() Drupal\simpletest\WebTestBase->xpath('//a[@href="/checkout/node/1"]') Drupal\uc_cart\Tests\CartSettingsTest->testContinueShopping() Drupal\simpletest\TestBase->run(Array) simpletest_script_run_one_test('8', 'Drupal\uc_cart\Tests\CartSettingsTest') WarningAssertContentTrait.php138Drupal\simpletest\WebTestBase->parse()
Continue shopping link returns to the product page.OtherCartSettingsTest.php145Drupal\uc_cart\Tests\CartSettingsTest->testContinueShopping()
simplexml_import_dom(): Invalid Nodetype to importsimplexml_import_dom(Object) Drupal\simpletest\WebTestBase->parse() Drupal\simpletest\WebTestBase->drupalPostForm('cart', Array, Object) Drupal\uc_cart\Tests\CartSettingsTest->testContinueShopping() Drupal\simpletest\TestBase->run(Array) simpletest_script_run_one_test('8', 'Drupal\uc_cart\Tests\CartSettingsTest') WarningAssertContentTrait.php138Drupal\simpletest\WebTestBase->parse()
Continue shopping button takes the user to the correct URL.OtherCartSettingsTest.php179Drupal\uc_cart\Tests\CartSettingsTest->testContinueShopping()
Class 'Drupal\uc_cart\Controller\Cart' not foundPHP Fatal errorCartController.php25Unknown
Class 'Drupal\uc_cart\Controller\Cart' not foundPHP Fatal errorCartController.php25Unknown
simplexml_import_dom(): Invalid Nodetype to importsimplexml_import_dom(Object) Drupal\simpletest\WebTestBase->parse() Drupal\simpletest\WebTestBase->xpath('//a[normalize-space(text())=:label]', Array) Drupal\simpletest\WebTestBase->assertLink('ehaMDVJt', 0, 'The breadcrumb link text is set correctly.') Drupal\uc_cart\Tests\CartSettingsTest->testCartBreadcrumb() Drupal\simpletest\TestBase->run(Array) simpletest_script_run_one_test('8', 'Drupal\uc_cart\Tests\CartSettingsTest') WarningAssertContentTrait.php138Drupal\simpletest\WebTestBase->parse()
The breadcrumb link text is set correctly.OtherCartSettingsTest.php213Drupal\uc_cart\Tests\CartSettingsTest->testCartBreadcrumb()
simplexml_import_dom(): Invalid Nodetype to importsimplexml_import_dom(Object) Drupal\simpletest\WebTestBase->parse() Drupal\simpletest\WebTestBase->xpath('//a[@href="http://ec2-52-88-182-40.us-west-2.compute.amazonaws.com/checkout/ruA7CcLC"]') Drupal\uc_cart\Tests\CartSettingsTest->testCartBreadcrumb() Drupal\simpletest\TestBase->run(Array) simpletest_script_run_one_test('8', 'Drupal\uc_cart\Tests\CartSettingsTest') WarningAssertContentTrait.php138Drupal\simpletest\WebTestBase->parse()
The breadcrumb link is set correctly.OtherCartSettingsTest.php218Drupal\uc_cart\Tests\CartSettingsTest->testCartBreadcrumb()
Class 'Drupal\uc_cart\Controller\Cart' not foundPHP Fatal errorCartController.php25Unknown
ExpandDrupal\uc_cart\Tests\CheckoutSettingsTest4932
MessageGroupFilenameLineFunctionStatus
simplexml_import_dom(): Invalid Nodetype to importsimplexml_import_dom(Object) Drupal\simpletest\WebTestBase->parse() Drupal\simpletest\WebTestBase->xpath('//input[@value="Checkout"]') Drupal\uc_cart\Tests\CheckoutSettingsTest->testEnableCheckout() Drupal\simpletest\TestBase->run(Array) simpletest_script_run_one_test('7', 'Drupal\uc_cart\Tests\CheckoutSettingsTest') WarningAssertContentTrait.php138Drupal\simpletest\WebTestBase->parse()
Class 'Drupal\uc_cart\Controller\Cart' not foundPHP Fatal errorCartController.php25Unknown
simplexml_import_dom(): Invalid Nodetype to importsimplexml_import_dom(Object) Drupal\simpletest\WebTestBase->parse() Drupal\simpletest\WebTestBase->drupalPostForm('cart', Array, Object) Drupal\uc_cart\Tests\CheckoutSettingsTest->testAnonymousCheckout() Drupal\simpletest\TestBase->run(Array) simpletest_script_run_one_test('7', 'Drupal\uc_cart\Tests\CheckoutSettingsTest') WarningAssertContentTrait.php138Drupal\simpletest\WebTestBase->parse()
Class 'Drupal\uc_cart\Controller\Cart' not foundPHP Fatal errorCartController.php25Unknown
Class 'Drupal\uc_cart\Controller\Cart' not foundPHP Fatal errorCartController.php25Unknown
ExpandDrupal\uc_cart_links\Tests\CartLinksTest348346
MessageGroupFilenameLineFunctionStatus
Product title correct in cart.OtherCartLinksTest.php157Drupal\uc_cart_links\Tests\CartLinksTest->testCartLinksBasicFunctionality()
simplexml_import_dom(): Invalid Nodetype to importsimplexml_import_dom(Object) Drupal\simpletest\WebTestBase->parse() Drupal\simpletest\WebTestBase->xpath('//textarea[@name="items[0][qty]"]|//input[@name="items[0][qty]"]|//select[@name="items[0][qty]"]') Drupal\simpletest\WebTestBase->assertFieldByXPath('//textarea[@name="items[0][qty]"]|//input[@name="items[0][qty]"]|//select[@name="items[0][qty]"]', 8, 'Product quantity correct in cart.', 'Browser') Drupal\simpletest\WebTestBase->assertFieldByName('items[0][qty]', 8, 'Product quantity correct in cart.') Drupal\uc_cart_links\Tests\CartLinksTest->testCartLinksBasicFunctionality() Drupal\simpletest\TestBase->run(Array) simpletest_script_run_one_test('10', 'Drupal\uc_cart_links\Tests\CartLinksTest') WarningAssertContentTrait.php138Drupal\simpletest\WebTestBase->parse()
Product quantity correct in cart.BrowserCartLinksTest.php162Drupal\uc_cart_links\Tests\CartLinksTest->testCartLinksBasicFunctionality()
Attribute dWukzlj8 correct in cart.OtherCartLinksTest.php169Drupal\uc_cart_links\Tests\CartLinksTest->testCartLinksBasicFunctionality()
Option sDd7nl8Z correct in cart.OtherCartLinksTest.php175Drupal\uc_cart_links\Tests\CartLinksTest->testCartLinksBasicFunctionality()
Attribute pFSnxjKJ correct in cart.OtherCartLinksTest.php169Drupal\uc_cart_links\Tests\CartLinksTest->testCartLinksBasicFunctionality()
Option jTULMcxR correct in cart.OtherCartLinksTest.php175Drupal\uc_cart_links\Tests\CartLinksTest->testCartLinksBasicFunctionality()
Attribute y8jwyFYM correct in cart.OtherCartLinksTest.php169Drupal\uc_cart_links\Tests\CartLinksTest->testCartLinksBasicFunctionality()
Option lapwZZsvZIQM correct in cart.OtherCartLinksTest.php175Drupal\uc_cart_links\Tests\CartLinksTest->testCartLinksBasicFunctionality()
simplexml_import_dom(): Invalid Nodetype to importsimplexml_import_dom(Object) Drupal\simpletest\WebTestBase->parse() Drupal\simpletest\WebTestBase->drupalPostForm('cart', Array, Object) Drupal\uc_cart_links\Tests\CartLinksTest->testCartLinksBasicFunctionality() Drupal\simpletest\TestBase->run(Array) simpletest_script_run_one_test('10', 'Drupal\uc_cart_links\Tests\CartLinksTest') WarningAssertContentTrait.php138Drupal\simpletest\WebTestBase->parse()
"There are no products in your shopping cart." foundOtherCartLinksTest.php190Drupal\uc_cart_links\Tests\CartLinksTest->testCartLinksBasicFunctionality()
Product title correct in cart.OtherCartLinksTest.php157Drupal\uc_cart_links\Tests\CartLinksTest->testCartLinksBasicFunctionality()
simplexml_import_dom(): Invalid Nodetype to importsimplexml_import_dom(Object) Drupal\simpletest\WebTestBase->parse() Drupal\simpletest\WebTestBase->xpath('//textarea[@name="items[0][qty]"]|//input[@name="items[0][qty]"]|//select[@name="items[0][qty]"]') Drupal\simpletest\WebTestBase->assertFieldByXPath('//textarea[@name="items[0][qty]"]|//input[@name="items[0][qty]"]|//select[@name="items[0][qty]"]', 10, 'Product quantity correct in cart.', 'Browser') Drupal\simpletest\WebTestBase->assertFieldByName('items[0][qty]', 10, 'Product quantity correct in cart.') Drupal\uc_cart_links\Tests\CartLinksTest->testCartLinksBasicFunctionality() Drupal\simpletest\TestBase->run(Array) simpletest_script_run_one_test('10', 'Drupal\uc_cart_links\Tests\CartLinksTest') WarningAssertContentTrait.php138Drupal\simpletest\WebTestBase->parse()
Product quantity correct in cart.BrowserCartLinksTest.php162Drupal\uc_cart_links\Tests\CartLinksTest->testCartLinksBasicFunctionality()
Attribute lX2Dbfrr correct in cart.OtherCartLinksTest.php169Drupal\uc_cart_links\Tests\CartLinksTest->testCartLinksBasicFunctionality()
Option iZ2u2OSd correct in cart.OtherCartLinksTest.php175Drupal\uc_cart_links\Tests\CartLinksTest->testCartLinksBasicFunctionality()
Attribute sycsmLh0 correct in cart.OtherCartLinksTest.php169Drupal\uc_cart_links\Tests\CartLinksTest->testCartLinksBasicFunctionality()
Option bFDipeSt correct in cart.OtherCartLinksTest.php175Drupal\uc_cart_links\Tests\CartLinksTest->testCartLinksBasicFunctionality()
Attribute mGWDtrS8 correct in cart.OtherCartLinksTest.php169Drupal\uc_cart_links\Tests\CartLinksTest->testCartLinksBasicFunctionality()
Option sN3JVJHY correct in cart.OtherCartLinksTest.php175Drupal\uc_cart_links\Tests\CartLinksTest->testCartLinksBasicFunctionality()
Option eoHoinev correct in cart.OtherCartLinksTest.php175Drupal\uc_cart_links\Tests\CartLinksTest->testCartLinksBasicFunctionality()
Option kw6yx0MT correct in cart.OtherCartLinksTest.php175Drupal\uc_cart_links\Tests\CartLinksTest->testCartLinksBasicFunctionality()
simplexml_import_dom(): Invalid Nodetype to importsimplexml_import_dom(Object) Drupal\simpletest\WebTestBase->parse() Drupal\simpletest\WebTestBase->drupalPostForm('cart', Array, Object) Drupal\uc_cart_links\Tests\CartLinksTest->testCartLinksBasicFunctionality() Drupal\simpletest\TestBase->run(Array) simpletest_script_run_one_test('10', 'Drupal\uc_cart_links\Tests\CartLinksTest') WarningAssertContentTrait.php138Drupal\simpletest\WebTestBase->parse()
"There are no products in your shopping cart." foundOtherCartLinksTest.php190Drupal\uc_cart_links\Tests\CartLinksTest->testCartLinksBasicFunctionality()
Class 'Drupal\uc_cart\Controller\Cart' not foundPHP Fatal errorCartController.php25Unknown
Class 'Drupal\uc_cart\Controller\Cart' not foundPHP Fatal errorCartController.php25Unknown
Class 'Drupal\uc_cart\Controller\Cart' not foundPHP Fatal errorCartController.php25Unknown
Class 'Drupal\uc_cart\Controller\Cart' not foundPHP Fatal errorCartController.php25Unknown
simplexml_import_dom(): Invalid Nodetype to importsimplexml_import_dom(Object) Drupal\simpletest\WebTestBase->parse() Drupal\simpletest\WebTestBase->drupalPostForm('cart', Array, Object) Drupal\uc_cart_links\Tests\CartLinksTest->testCartLinksProductActionMessage() Drupal\simpletest\TestBase->run(Array) simpletest_script_run_one_test('10', 'Drupal\uc_cart_links\Tests\CartLinksTest') WarningAssertContentTrait.php138Drupal\simpletest\WebTestBase->parse()
"There are no products in your shopping cart." foundOtherCartLinksTest.php232Drupal\uc_cart_links\Tests\CartLinksTest->testCartLinksProductActionMessage()
Class 'Drupal\uc_cart\Controller\Cart' not foundPHP Fatal errorCartController.php25Unknown
Product title correct in cart.OtherCartLinksTest.php299Drupal\uc_cart_links\Tests\CartLinksTest->testCartLinksAllowEmptying()
Cart was not emptied by Cart Link.OtherCartLinksTest.php316Drupal\uc_cart_links\Tests\CartLinksTest->testCartLinksAllowEmptying()
Cart was not emptied by Cart Link.OtherCartLinksTest.php320Drupal\uc_cart_links\Tests\CartLinksTest->testCartLinksAllowEmptying()
Class 'Drupal\uc_cart\Controller\Cart' not foundPHP Fatal errorCartController.php25Unknown
Class 'Drupal\uc_cart\Controller\Cart' not foundPHP Fatal errorCartController.php25Unknown
Class 'Drupal\uc_cart\Controller\Cart' not foundPHP Fatal errorCartController.php25Unknown
simplexml_import_dom(): Invalid Nodetype to importsimplexml_import_dom(Object) Drupal\simpletest\WebTestBase->parse() Drupal\simpletest\WebTestBase->drupalPostForm('cart', Array, Object) Drupal\uc_cart_links\Tests\CartLinksTest->testCartLinksMessages() Drupal\simpletest\TestBase->run(Array) simpletest_script_run_one_test('10', 'Drupal\uc_cart_links\Tests\CartLinksTest') WarningAssertContentTrait.php138Drupal\simpletest\WebTestBase->parse()
"There are no products in your shopping cart." foundOtherCartLinksTest.php467Drupal\uc_cart_links\Tests\CartLinksTest->testCartLinksMessages()
Class 'Drupal\uc_cart\Controller\Cart' not foundPHP Fatal errorCartController.php25Unknown
ExpandDrupal\uc_catalog\Tests\CatalogTest8320
MessageGroupFilenameLineFunctionStatus
"aGl5jbMv added to your shopping cart." foundOtherCatalogTest.php46Drupal\uc_catalog\Tests\CatalogTest->testCatalog()
Class 'Drupal\uc_cart\Controller\Cart' not foundPHP Fatal errorCartController.php25Unknown
ExpandDrupal\uc_country\Tests\CountryManagerTest500
MessageGroupFilenameLineFunctionStatus
Array ( ) DebugCountryManagerTest.php44Drupal\uc_country\Tests\CountryManagerTest->testServiceOverride()
Count = 0DebugCountryManagerTest.php45Drupal\uc_country\Tests\CountryManagerTest->testServiceOverride()
LeafDrupal\uc_country\Tests\CountryTest9100
ExpandDrupal\uc_credit\Tests\CreditCardTest251611
MessageGroupFilenameLineFunctionStatus
simplexml_import_dom(): Invalid Nodetype to importsimplexml_import_dom(Object) Drupal\simpletest\WebTestBase->parse() Drupal\simpletest\WebTestBase->drupalPostForm('cart', Array, 'Checkout') Drupal\uc_store\Tests\UbercartTestBase->checkout(Array) Drupal\uc_credit\Tests\CreditCardTest->testCheckout() Drupal\simpletest\TestBase->run(Array) simpletest_script_run_one_test('1', 'Drupal\uc_credit\Tests\CreditCardTest') WarningAssertContentTrait.php138Drupal\simpletest\WebTestBase->parse()
Viewed cart page: Billing pane has been displayed.OtherUbercartTestBase.php249Drupal\uc_store\Tests\UbercartTestBase->checkout()
"Your order is complete!" foundOtherCreditCardTest.php255Drupal\uc_credit\Tests\CreditCardTest->testCheckout()
Class 'Drupal\uc_cart\Controller\Cart' not foundPHP Fatal errorCartController.php25Unknown
Class 'Drupal\uc_cart\Controller\Cart' not foundPHP Fatal errorCartController.php25Unknown
Call to undefined method Drupal\uc_cart\CartManager::entityManager()PHP Fatal errorCartManager.php85Unknown
Card with expiry date 9/2015 passed validation.OtherCreditCardTest.php278Drupal\uc_credit\Tests\CreditCardTest->testExpiryDate()
Card with expiry date 10/2015 passed validation.OtherCreditCardTest.php278Drupal\uc_credit\Tests\CreditCardTest->testExpiryDate()
Card with expiry date 11/2015 passed validation.OtherCreditCardTest.php278Drupal\uc_credit\Tests\CreditCardTest->testExpiryDate()
Card with expiry date 12/2015 passed validation.OtherCreditCardTest.php278Drupal\uc_credit\Tests\CreditCardTest->testExpiryDate()
Card with expiry date 1/2016 passed validation.OtherCreditCardTest.php278Drupal\uc_credit\Tests\CreditCardTest->testExpiryDate()
Card with expiry date 2/2016 passed validation.OtherCreditCardTest.php278Drupal\uc_credit\Tests\CreditCardTest->testExpiryDate()
Card with expiry date 3/2016 passed validation.OtherCreditCardTest.php278Drupal\uc_credit\Tests\CreditCardTest->testExpiryDate()
Card with expiry date 4/2016 passed validation.OtherCreditCardTest.php278Drupal\uc_credit\Tests\CreditCardTest->testExpiryDate()
Card with expiry date 5/2016 passed validation.OtherCreditCardTest.php278Drupal\uc_credit\Tests\CreditCardTest->testExpiryDate()
Card with expiry date 6/2016 passed validation.OtherCreditCardTest.php278Drupal\uc_credit\Tests\CreditCardTest->testExpiryDate()
Card with expiry date 7/2016 passed validation.OtherCreditCardTest.php278Drupal\uc_credit\Tests\CreditCardTest->testExpiryDate()
Card with expiry date 8/2016 passed validation.OtherCreditCardTest.php278Drupal\uc_credit\Tests\CreditCardTest->testExpiryDate()
Card with expiry date 9/2016 passed validation.OtherCreditCardTest.php278Drupal\uc_credit\Tests\CreditCardTest->testExpiryDate()
Card with expiry date 10/2016 passed validation.OtherCreditCardTest.php278Drupal\uc_credit\Tests\CreditCardTest->testExpiryDate()
Card with expiry date 11/2016 passed validation.OtherCreditCardTest.php278Drupal\uc_credit\Tests\CreditCardTest->testExpiryDate()
Card with expiry date 12/2016 passed validation.OtherCreditCardTest.php278Drupal\uc_credit\Tests\CreditCardTest->testExpiryDate()
Card with expiry date 1/2017 passed validation.OtherCreditCardTest.php278Drupal\uc_credit\Tests\CreditCardTest->testExpiryDate()
Card with expiry date 2/2017 passed validation.OtherCreditCardTest.php278Drupal\uc_credit\Tests\CreditCardTest->testExpiryDate()
Card with expiry date 3/2017 passed validation.OtherCreditCardTest.php278Drupal\uc_credit\Tests\CreditCardTest->testExpiryDate()
Card with expiry date 4/2017 passed validation.OtherCreditCardTest.php278Drupal\uc_credit\Tests\CreditCardTest->testExpiryDate()
Card with expiry date 5/2017 passed validation.OtherCreditCardTest.php278Drupal\uc_credit\Tests\CreditCardTest->testExpiryDate()
Card with expiry date 6/2017 passed validation.OtherCreditCardTest.php278Drupal\uc_credit\Tests\CreditCardTest->testExpiryDate()
Card with expiry date 7/2017 passed validation.OtherCreditCardTest.php278Drupal\uc_credit\Tests\CreditCardTest->testExpiryDate()
Card with expiry date 8/2017 passed validation.OtherCreditCardTest.php278Drupal\uc_credit\Tests\CreditCardTest->testExpiryDate()
Card with expiry date 9/2017 passed validation.OtherCreditCardTest.php278Drupal\uc_credit\Tests\CreditCardTest->testExpiryDate()
Card with expiry date 10/2017 passed validation.OtherCreditCardTest.php278Drupal\uc_credit\Tests\CreditCardTest->testExpiryDate()
Card with expiry date 11/2017 passed validation.OtherCreditCardTest.php278Drupal\uc_credit\Tests\CreditCardTest->testExpiryDate()
Card with expiry date 12/2017 passed validation.OtherCreditCardTest.php278Drupal\uc_credit\Tests\CreditCardTest->testExpiryDate()
Call to undefined method Drupal\uc_cart\CartManager::entityManager()PHP Fatal errorCartManager.php85Unknown
Call to undefined method Drupal\uc_cart\CartManager::entityManager()PHP Fatal errorCartManager.php85Unknown
Call to undefined method Drupal\uc_cart\CartManager::entityManager()PHP Fatal errorCartManager.php85Unknown
Call to undefined method Drupal\uc_cart\CartManager::entityManager()PHP Fatal errorCartManager.php85Unknown
Call to undefined method Drupal\uc_cart\CartManager::entityManager()PHP Fatal errorCartManager.php85Unknown
Call to undefined method Drupal\uc_cart\CartManager::entityManager()PHP Fatal errorCartManager.php85Unknown
Call to undefined method Drupal\uc_cart\CartManager::entityManager()PHP Fatal errorCartManager.php85Unknown
Call to undefined method Drupal\uc_cart\CartManager::entityManager()PHP Fatal errorCartManager.php85Unknown
Call to undefined method Drupal\uc_cart\CartManager::entityManager()PHP Fatal errorCartManager.php85Unknown
Call to undefined method Drupal\uc_cart\CartManager::entityManager()PHP Fatal errorCartManager.php85Unknown
Call to undefined method Drupal\uc_cart\CartManager::entityManager()PHP Fatal errorCartManager.php85Unknown
Call to undefined method Drupal\uc_cart\CartManager::entityManager()PHP Fatal errorCartManager.php85Unknown
Call to undefined method Drupal\uc_cart\CartManager::entityManager()PHP Fatal errorCartManager.php85Unknown
Call to undefined method Drupal\uc_cart\CartManager::entityManager()PHP Fatal errorCartManager.php85Unknown
Call to undefined method Drupal\uc_cart\CartManager::entityManager()PHP Fatal errorCartManager.php85Unknown
Call to undefined method Drupal\uc_cart\CartManager::entityManager()PHP Fatal errorCartManager.php85Unknown
Call to undefined method Drupal\uc_cart\CartManager::entityManager()PHP Fatal errorCartManager.php85Unknown
Call to undefined method Drupal\uc_cart\CartManager::entityManager()PHP Fatal errorCartManager.php85Unknown
Call to undefined method Drupal\uc_cart\CartManager::entityManager()PHP Fatal errorCartManager.php85Unknown
Call to undefined method Drupal\uc_cart\CartManager::entityManager()PHP Fatal errorCartManager.php85Unknown
Call to undefined method Drupal\uc_cart\CartManager::entityManager()PHP Fatal errorCartManager.php85Unknown
Call to undefined method Drupal\uc_cart\CartManager::entityManager()PHP Fatal errorCartManager.php85Unknown
Call to undefined method Drupal\uc_cart\CartManager::entityManager()PHP Fatal errorCartManager.php85Unknown
Call to undefined method Drupal\uc_cart\CartManager::entityManager()PHP Fatal errorCartManager.php85Unknown
Call to undefined method Drupal\uc_cart\CartManager::entityManager()PHP Fatal errorCartManager.php85Unknown
Call to undefined method Drupal\uc_cart\CartManager::entityManager()PHP Fatal errorCartManager.php85Unknown
Call to undefined method Drupal\uc_cart\CartManager::entityManager()PHP Fatal errorCartManager.php85Unknown
Call to undefined method Drupal\uc_cart\CartManager::entityManager()PHP Fatal errorCartManager.php85Unknown
LeafDrupal\uc_order\Tests\OrderTest22400
ExpandDrupal\uc_payment\Tests\PaymentPaneTest101112
MessageGroupFilenameLineFunctionStatus
Class 'Drupal\uc_cart\Controller\Cart' not foundPHP Fatal errorCartController.php25Unknown
Class 'Drupal\uc_cart\Controller\Cart' not foundPHP Fatal errorCartController.php25Unknown
simplexml_import_dom(): Invalid Nodetype to importsimplexml_import_dom(Object) Drupal\simpletest\WebTestBase->parse() Drupal\simpletest\WebTestBase->drupalPostForm('cart', Array, Object) Drupal\uc_payment\Tests\PaymentPaneTest->testFreeOrders() Drupal\simpletest\TestBase->run(Array) simpletest_script_run_one_test('2', 'Drupal\uc_payment\Tests\PaymentPaneTest') WarningAssertContentTrait.php138Drupal\simpletest\WebTestBase->parse()
simplexml_import_dom(): Invalid Nodetype to importsimplexml_import_dom(Object) Drupal\simpletest\WebTestBase->parse() Drupal\simpletest\WebTestBase->drupalPostForm('cart', Array, Object) Drupal\uc_payment\Tests\PaymentPaneTest->testFreeOrders() Drupal\simpletest\TestBase->run(Array) simpletest_script_run_one_test('2', 'Drupal\uc_payment\Tests\PaymentPaneTest') WarningAssertContentTrait.php138Drupal\simpletest\WebTestBase->parse()
"Check or money order" not foundOtherPaymentPaneTest.php97Drupal\uc_payment\Tests\PaymentPaneTest->testFreeOrders()
"No payment required" foundOtherPaymentPaneTest.php98Drupal\uc_payment\Tests\PaymentPaneTest->testFreeOrders()
"Continue with checkout to complete your order." foundOtherPaymentPaneTest.php99Drupal\uc_payment\Tests\PaymentPaneTest->testFreeOrders()
"Subtotal: $0.00" foundOtherPaymentPaneTest.php100Drupal\uc_payment\Tests\PaymentPaneTest->testFreeOrders()
Class 'Drupal\uc_cart\Controller\Cart' not foundPHP Fatal errorCartController.php25Unknown
Class 'Drupal\uc_cart\Controller\Cart' not foundPHP Fatal errorCartController.php25Unknown
Class 'Drupal\uc_cart\Controller\Cart' not foundPHP Fatal errorCartController.php25Unknown
Class 'Drupal\uc_cart\Controller\Cart' not foundPHP Fatal errorCartController.php25Unknown
Class 'Drupal\uc_cart\Controller\Cart' not foundPHP Fatal errorCartController.php25Unknown
ExpandDrupal\uc_payment_pack\Tests\PaymentPackTest139111
MessageGroupFilenameLineFunctionStatus
simplexml_import_dom(): Invalid Nodetype to importsimplexml_import_dom(Object) Drupal\simpletest\WebTestBase->parse() Drupal\simpletest\WebTestBase->xpath('//a[normalize-space(text())=:label]', Array) Drupal\simpletest\WebTestBase->assertNoLink('Receive Check') Drupal\uc_payment_pack\Tests\PaymentPackTest->testCheck() Drupal\simpletest\TestBase->run(Array) simpletest_script_run_one_test('3', 'Drupal\uc_payment_pack\Tests\PaymentPackTest') WarningAssertContentTrait.php138Drupal\simpletest\WebTestBase->parse()
Check clear date found.OtherPaymentPackTest.php124Drupal\uc_payment_pack\Tests\PaymentPackTest->testCheck()
"Check received" foundOtherPaymentPackTest.php128Drupal\uc_payment_pack\Tests\PaymentPackTest->testCheck()
"Expected clear date:" foundOtherPaymentPackTest.php129Drupal\uc_payment_pack\Tests\PaymentPackTest->testCheck()
Check clear date found.OtherPaymentPackTest.php130Drupal\uc_payment_pack\Tests\PaymentPackTest->testCheck()
Class 'Drupal\uc_cart\Controller\Cart' not foundPHP Fatal errorCartController.php25Unknown
Call to undefined method Drupal\uc_cart\CartManager::entityManager()PHP Fatal errorCartManager.php85Unknown
Call to undefined method Drupal\uc_cart\CartManager::entityManager()PHP Fatal errorCartManager.php85Unknown
Class 'Drupal\uc_cart\Controller\Cart' not foundPHP Fatal errorCartController.php25Unknown
Call to undefined method Drupal\uc_cart\CartManager::entityManager()PHP Fatal errorCartManager.php85Unknown
Class 'Drupal\uc_cart\Controller\Cart' not foundPHP Fatal errorCartController.php25Unknown
Call to undefined method Drupal\uc_cart\CartManager::entityManager()PHP Fatal errorCartManager.php85Unknown
ExpandDrupal\uc_product\Tests\ProductTest14940
MessageGroupFilenameLineFunctionStatus
"hdqMEI5A added to your shopping cart." foundOtherProductTest.php222Drupal\uc_product\Tests\ProductTest->testProductQuantity()
"Your item(s) have been updated." foundOtherProductTest.php226Drupal\uc_product\Tests\ProductTest->testProductQuantity()
Class 'Drupal\uc_cart\Controller\Cart' not foundPHP Fatal errorCartController.php25Unknown
Class 'Drupal\uc_cart\Controller\Cart' not foundPHP Fatal errorCartController.php25Unknown
ExpandDrupal\uc_product_kit\Tests\ProductKitTest121238
MessageGroupFilenameLineFunctionStatus
Product kit title found.OtherProductKitTest.php160Drupal\uc_product_kit\Tests\ProductKitTest->testProductKitMutability()
Product kit total found.OtherProductKitTest.php166Drupal\uc_product_kit\Tests\ProductKitTest->testProductKitMutability()
simplexml_import_dom(): Invalid Nodetype to importsimplexml_import_dom(Object) Drupal\simpletest\WebTestBase->parse() Drupal\simpletest\WebTestBase->drupalPostForm(NULL, Array, 'Update cart') Drupal\uc_product_kit\Tests\ProductKitTest->testProductKitMutability() Drupal\simpletest\TestBase->run(Array) simpletest_script_run_one_test('14', 'Drupal\uc_product_kit\Tests\ProductKitTest') WarningAssertContentTrait.php138Drupal\simpletest\WebTestBase->parse()
Updated product kit total found.OtherProductKitTest.php170Drupal\uc_product_kit\Tests\ProductKitTest->testProductKitMutability()
simplexml_import_dom(): Invalid Nodetype to importsimplexml_import_dom(Object) Drupal\simpletest\WebTestBase->parse() Drupal\simpletest\WebTestBase->drupalPostForm(NULL, Array, 'Remove') Drupal\uc_product_kit\Tests\ProductKitTest->testProductKitMutability() Drupal\simpletest\TestBase->run(Array) simpletest_script_run_one_test('14', 'Drupal\uc_product_kit\Tests\ProductKitTest') WarningAssertContentTrait.php138Drupal\simpletest\WebTestBase->parse()
"There are no products in your shopping cart." foundOtherProductKitTest.php173Drupal\uc_product_kit\Tests\ProductKitTest->testProductKitMutability()
Product kit title found.OtherProductKitTest.php186Drupal\uc_product_kit\Tests\ProductKitTest->testProductKitMutability()
Product 1 title shown.OtherProductKitTest.php187Drupal\uc_product_kit\Tests\ProductKitTest->testProductKitMutability()
Product 2 title shown.OtherProductKitTest.php188Drupal\uc_product_kit\Tests\ProductKitTest->testProductKitMutability()
Product 3 title shown.OtherProductKitTest.php189Drupal\uc_product_kit\Tests\ProductKitTest->testProductKitMutability()
Product kit total found.OtherProductKitTest.php192Drupal\uc_product_kit\Tests\ProductKitTest->testProductKitMutability()
simplexml_import_dom(): Invalid Nodetype to importsimplexml_import_dom(Object) Drupal\simpletest\WebTestBase->parse() Drupal\simpletest\WebTestBase->drupalPostForm(NULL, Array, 'Update cart') Drupal\uc_product_kit\Tests\ProductKitTest->testProductKitMutability() Drupal\simpletest\TestBase->run(Array) simpletest_script_run_one_test('14', 'Drupal\uc_product_kit\Tests\ProductKitTest') WarningAssertContentTrait.php138Drupal\simpletest\WebTestBase->parse()
Updated product kit total found.OtherProductKitTest.php196Drupal\uc_product_kit\Tests\ProductKitTest->testProductKitMutability()
simplexml_import_dom(): Invalid Nodetype to importsimplexml_import_dom(Object) Drupal\simpletest\WebTestBase->parse() Drupal\simpletest\WebTestBase->drupalPostForm(NULL, Array, 'Remove') Drupal\uc_product_kit\Tests\ProductKitTest->testProductKitMutability() Drupal\simpletest\TestBase->run(Array) simpletest_script_run_one_test('14', 'Drupal\uc_product_kit\Tests\ProductKitTest') WarningAssertContentTrait.php138Drupal\simpletest\WebTestBase->parse()
"There are no products in your shopping cart." foundOtherProductKitTest.php199Drupal\uc_product_kit\Tests\ProductKitTest->testProductKitMutability()
Product 1 title shown.OtherProductKitTest.php213Drupal\uc_product_kit\Tests\ProductKitTest->testProductKitMutability()
Product 2 title shown.OtherProductKitTest.php214Drupal\uc_product_kit\Tests\ProductKitTest->testProductKitMutability()
Product 3 title shown.OtherProductKitTest.php215Drupal\uc_product_kit\Tests\ProductKitTest->testProductKitMutability()
Product kit total found.OtherProductKitTest.php218Drupal\uc_product_kit\Tests\ProductKitTest->testProductKitMutability()
simplexml_import_dom(): Invalid Nodetype to importsimplexml_import_dom(Object) Drupal\simpletest\WebTestBase->parse() Drupal\simpletest\WebTestBase->drupalPostForm(NULL, Array, 'Update cart') Drupal\uc_product_kit\Tests\ProductKitTest->testProductKitMutability() Drupal\simpletest\TestBase->run(Array) simpletest_script_run_one_test('14', 'Drupal\uc_product_kit\Tests\ProductKitTest') WarningAssertContentTrait.php138Drupal\simpletest\WebTestBase->parse()
Updated product kit total found.OtherProductKitTest.php230Drupal\uc_product_kit\Tests\ProductKitTest->testProductKitMutability()
simplexml_import_dom(): Invalid Nodetype to importsimplexml_import_dom(Object) Drupal\simpletest\WebTestBase->parse() Drupal\simpletest\WebTestBase->drupalPostForm(NULL, Array, 'Remove') Drupal\uc_product_kit\Tests\ProductKitTest->testProductKitMutability() Drupal\simpletest\TestBase->run(Array) simpletest_script_run_one_test('14', 'Drupal\uc_product_kit\Tests\ProductKitTest') WarningAssertContentTrait.php138Drupal\simpletest\WebTestBase->parse()
simplexml_import_dom(): Invalid Nodetype to importsimplexml_import_dom(Object) Drupal\simpletest\WebTestBase->parse() Drupal\simpletest\WebTestBase->drupalPostForm(NULL, Array, 'Remove') Drupal\uc_product_kit\Tests\ProductKitTest->testProductKitMutability() Drupal\simpletest\TestBase->run(Array) simpletest_script_run_one_test('14', 'Drupal\uc_product_kit\Tests\ProductKitTest') WarningAssertContentTrait.php138Drupal\simpletest\WebTestBase->parse()
simplexml_import_dom(): Invalid Nodetype to importsimplexml_import_dom(Object) Drupal\simpletest\WebTestBase->parse() Drupal\simpletest\WebTestBase->drupalPostForm(NULL, Array, 'Remove') Drupal\uc_product_kit\Tests\ProductKitTest->testProductKitMutability() Drupal\simpletest\TestBase->run(Array) simpletest_script_run_one_test('14', 'Drupal\uc_product_kit\Tests\ProductKitTest') WarningAssertContentTrait.php138Drupal\simpletest\WebTestBase->parse()
"There are no products in your shopping cart." foundOtherProductKitTest.php235Drupal\uc_product_kit\Tests\ProductKitTest->testProductKitMutability()
Class 'Drupal\uc_cart\Controller\Cart' not foundPHP Fatal errorCartController.php25Unknown
Class 'Drupal\uc_cart\Controller\Cart' not foundPHP Fatal errorCartController.php25Unknown
Class 'Drupal\uc_cart\Controller\Cart' not foundPHP Fatal errorCartController.php25Unknown
Class 'Drupal\uc_cart\Controller\Cart' not foundPHP Fatal errorCartController.php25Unknown
Class 'Drupal\uc_cart\Controller\Cart' not foundPHP Fatal errorCartController.php25Unknown
Class 'Drupal\uc_cart\Controller\Cart' not foundPHP Fatal errorCartController.php25Unknown
ExpandDrupal\uc_quote\Tests\QuoteTest4575
MessageGroupFilenameLineFunctionStatus
simplexml_import_dom(): Invalid Nodetype to importsimplexml_import_dom(Object) Drupal\simpletest\WebTestBase->parse() Drupal\simpletest\WebTestBase->drupalPostForm('cart', Array, Object) Drupal\uc_quote\Tests\QuoteTest->testNoQuote() Drupal\simpletest\TestBase->run(Array) simpletest_script_run_one_test('4', 'Drupal\uc_quote\Tests\QuoteTest') WarningAssertContentTrait.php138Drupal\simpletest\WebTestBase->parse()
Class 'Drupal\uc_cart\Controller\Cart' not foundPHP Fatal errorCartController.php25Unknown
Class 'Drupal\uc_cart\Controller\Cart' not foundPHP Fatal errorCartController.php25Unknown
simplexml_import_dom(): Invalid Nodetype to importsimplexml_import_dom(Object) Drupal\simpletest\WebTestBase->parse() Drupal\simpletest\WebTestBase->drupalPostForm('cart', Array, Object) Drupal\uc_quote\Tests\QuoteTest->testQuote() Drupal\simpletest\TestBase->run(Array) simpletest_script_run_one_test('4', 'Drupal\uc_quote\Tests\QuoteTest') WarningAssertContentTrait.php138Drupal\simpletest\WebTestBase->parse()
The default quote option is availableOtherQuoteTest.php175Drupal\uc_quote\Tests\QuoteTest->testQuote()
The second quote option is availableOtherQuoteTest.php176Drupal\uc_quote\Tests\QuoteTest->testQuote()
Order total includes the default quote.OtherQuoteTest.php177Drupal\uc_quote\Tests\QuoteTest->testQuote()
simplexml_import_dom(): Invalid Nodetype to importsimplexml_import_dom(Object) Drupal\simpletest\WebTestBase->parse() Drupal\simpletest\WebTestBase->xpath('//*[@name="panes[quotes][quotes][quote_option]" and @value="flatrate_2---0"]') Drupal\simpletest\WebTestBase->drupalPostAjaxForm(NULL, Array, Array, NULL, Array, Array, NULL, NULL) Drupal\uc_store\Tests\UbercartTestBase->ucPostAjax(NULL, Array, Array) Drupal\uc_quote\Tests\QuoteTest->testQuote() Drupal\simpletest\TestBase->run(Array) simpletest_script_run_one_test('4', 'Drupal\uc_quote\Tests\QuoteTest') WarningAssertContentTrait.php138Drupal\simpletest\WebTestBase->parse()
Undefined index: ajaxDrupal\simpletest\WebTestBase->drupalPostAjaxForm(NULL, Array, Array, NULL, Array, Array, NULL, NULL) Drupal\uc_store\Tests\UbercartTestBase->ucPostAjax(NULL, Array, Array) Drupal\uc_quote\Tests\QuoteTest->testQuote() Drupal\simpletest\TestBase->run(Array) simpletest_script_run_one_test('4', 'Drupal\uc_quote\Tests\QuoteTest') NoticeWebTestBase.php1869Drupal\simpletest\WebTestBase->drupalPostAjaxForm()
Exception: No #ajax path specified. in Drupal\simpletest\WebTestBase->drupalPostAjaxForm() (line 1905 of /var/lib/drupaltestbot/sites/default/files/checkout/core/modules/simpletest/src/WebTestBase.php). Drupal\simpletest\WebTestBase->drupalPostAjaxForm(NULL, Array, Array, NULL, Array, Array, NULL, NULL) Drupal\uc_store\Tests\UbercartTestBase->ucPostAjax(NULL, Array, Array) Drupal\uc_quote\Tests\QuoteTest->testQuote() Drupal\simpletest\TestBase->run(Array) simpletest_script_run_one_test('4', 'Drupal\uc_quote\Tests\QuoteTest') Uncaught exceptionWebTestBase.php1905Drupal\simpletest\WebTestBase->drupalPostAjaxForm()
Class 'Drupal\uc_cart\Controller\Cart' not foundPHP Fatal errorCartController.php25Unknown
Class 'Drupal\uc_cart\Controller\Cart' not foundPHP Fatal errorCartController.php25Unknown
ExpandDrupal\uc_role\Tests\RoleCheckoutTest1810
MessageGroupFilenameLineFunctionStatus
The test did not complete due to a fatal error.Completion checkRoleCheckoutTest.php38Drupal\uc_role\Tests\RoleCheckoutTest->testCheckoutRoleAssignment()
ExpandDrupal\uc_role\Tests\RoleTest2921
MessageGroupFilenameLineFunctionStatus
The test did not complete due to a fatal error.Completion checkRoleTest.php21Drupal\uc_role\Tests\RoleTest->testRolePurchaseCheckout()
simplexml_import_dom(): Invalid Nodetype to importsimplexml_import_dom(Object) Drupal\simpletest\WebTestBase->parse() Drupal\simpletest\WebTestBase->drupalPostForm('cart', Array, 'Checkout') Drupal\uc_store\Tests\UbercartTestBase->checkout() Drupal\uc_role\Tests\RoleTest->testRolePurchaseCheckout() Drupal\simpletest\TestBase->run(Array) simpletest_script_run_one_test('21', 'Drupal\uc_role\Tests\RoleTest') WarningAssertContentTrait.php138Drupal\simpletest\WebTestBase->parse()
Viewed cart page: Billing pane has been displayed.OtherUbercartTestBase.php249Drupal\uc_store\Tests\UbercartTestBase->checkout()
ExpandDrupal\uc_stock\Tests\StockTest83142
MessageGroupFilenameLineFunctionStatus
simplexml_import_dom(): Invalid Nodetype to importsimplexml_import_dom(Object) Drupal\simpletest\WebTestBase->parse() Drupal\simpletest\WebTestBase->drupalPostForm('cart', Array, 'Checkout') Drupal\uc_store\Tests\UbercartTestBase->checkout() Drupal\uc_stock\Tests\StockTest->testStockDecrement() Drupal\simpletest\TestBase->run(Array) simpletest_script_run_one_test('15', 'Drupal\uc_stock\Tests\StockTest') WarningAssertContentTrait.php138Drupal\simpletest\WebTestBase->parse()
Viewed cart page: Billing pane has been displayed.OtherUbercartTestBase.php249Drupal\uc_store\Tests\UbercartTestBase->checkout()
Value 696 is equal to value '716'.OtherStockTest.php81Drupal\uc_stock\Tests\StockTest->testStockDecrement()
Class 'Drupal\uc_cart\Controller\Cart' not foundPHP Fatal errorCartController.php25Unknown
Class 'Drupal\uc_cart\Controller\Cart' not foundPHP Fatal errorCartController.php25Unknown
Call to undefined method Drupal\uc_cart\CartManager::entityManager()PHP Fatal errorCartManager.php85Unknown
simplexml_import_dom(): Invalid Nodetype to importsimplexml_import_dom(Object) Drupal\simpletest\WebTestBase->parse() Drupal\simpletest\WebTestBase->drupalPostForm('cart', Array, 'Checkout') Drupal\uc_store\Tests\UbercartTestBase->checkout() Drupal\uc_stock\Tests\StockTest->testStockThresholdMail() Drupal\simpletest\TestBase->run(Array) simpletest_script_run_one_test('15', 'Drupal\uc_stock\Tests\StockTest') WarningAssertContentTrait.php138Drupal\simpletest\WebTestBase->parse()
Viewed cart page: Billing pane has been displayed.OtherUbercartTestBase.php249Drupal\uc_store\Tests\UbercartTestBase->checkout()
Threshold mail recipient is correct. Value NULL is equal to value 'simpletest@example.com'.OtherStockTest.php103Drupal\uc_stock\Tests\StockTest->testStockThresholdMail()
Threshold mail subject is correct.OtherStockTest.php104Drupal\uc_stock\Tests\StockTest->testStockThresholdMail()
Mail body contains product title.OtherStockTest.php105Drupal\uc_stock\Tests\StockTest->testStockThresholdMail()
Mail body contains SKU.OtherStockTest.php106Drupal\uc_stock\Tests\StockTest->testStockThresholdMail()
Mail body contains quantity.OtherStockTest.php107Drupal\uc_stock\Tests\StockTest->testStockThresholdMail()
Class 'Drupal\uc_cart\Controller\Cart' not foundPHP Fatal errorCartController.php25Unknown
Class 'Drupal\uc_cart\Controller\Cart' not foundPHP Fatal errorCartController.php25Unknown
Call to undefined method Drupal\uc_cart\CartManager::entityManager()PHP Fatal errorCartManager.php85Unknown
LeafDrupal\uc_store\Tests\AddressTest1600
ExpandDrupal\uc_store\Tests\AjaxTest1924
MessageGroupFilenameLineFunctionStatus
simplexml_import_dom(): Invalid Nodetype to importsimplexml_import_dom(Object) Drupal\simpletest\WebTestBase->parse() Drupal\simpletest\WebTestBase->drupalPostForm('cart', Array, Object) Drupal\uc_store\Tests\AjaxTest->testCheckoutAjax() Drupal\simpletest\TestBase->run(Array) simpletest_script_run_one_test('17', 'Drupal\uc_store\Tests\AjaxTest') WarningAssertContentTrait.php138Drupal\simpletest\WebTestBase->parse()
simplexml_import_dom(): Invalid Nodetype to importsimplexml_import_dom(Object) Drupal\simpletest\WebTestBase->parse() Drupal\simpletest\WebTestBase->xpath('//*[@name="panes[billing][zone]"]') Drupal\simpletest\WebTestBase->drupalPostAjaxForm(NULL, Array, 'panes[billing][zone]', NULL, Array, Array, NULL, NULL) Drupal\uc_store\Tests\UbercartTestBase->ucPostAjax(NULL, Array, 'panes[billing][zone]') Drupal\uc_store\Tests\AjaxTest->testCheckoutAjax() Drupal\simpletest\TestBase->run(Array) simpletest_script_run_one_test('17', 'Drupal\uc_store\Tests\AjaxTest') WarningAssertContentTrait.php138Drupal\simpletest\WebTestBase->parse()
Undefined index: ajaxDrupal\simpletest\WebTestBase->drupalPostAjaxForm(NULL, Array, 'panes[billing][zone]', NULL, Array, Array, NULL, NULL) Drupal\uc_store\Tests\UbercartTestBase->ucPostAjax(NULL, Array, 'panes[billing][zone]') Drupal\uc_store\Tests\AjaxTest->testCheckoutAjax() Drupal\simpletest\TestBase->run(Array) simpletest_script_run_one_test('17', 'Drupal\uc_store\Tests\AjaxTest') NoticeWebTestBase.php1869Drupal\simpletest\WebTestBase->drupalPostAjaxForm()
Exception: No #ajax path specified. in Drupal\simpletest\WebTestBase->drupalPostAjaxForm() (line 1905 of /var/lib/drupaltestbot/sites/default/files/checkout/core/modules/simpletest/src/WebTestBase.php). Drupal\simpletest\WebTestBase->drupalPostAjaxForm(NULL, Array, 'panes[billing][zone]', NULL, Array, Array, NULL, NULL) Drupal\uc_store\Tests\UbercartTestBase->ucPostAjax(NULL, Array, 'panes[billing][zone]') Drupal\uc_store\Tests\AjaxTest->testCheckoutAjax() Drupal\simpletest\TestBase->run(Array) simpletest_script_run_one_test('17', 'Drupal\uc_store\Tests\AjaxTest') Uncaught exceptionWebTestBase.php1905Drupal\simpletest\WebTestBase->drupalPostAjaxForm()
Class 'Drupal\uc_cart\Controller\Cart' not foundPHP Fatal errorCartController.php25Unknown
Class 'Drupal\uc_cart\Controller\Cart' not foundPHP Fatal errorCartController.php25Unknown
LeafDrupal\uc_store\Tests\StoreTest3500
ExpandDrupal\uc_tax\Tests\InclusiveTaxTest1830
MessageGroupFilenameLineFunctionStatus
Order subtotal is correct on cart page.OtherInclusiveTaxTest.php96Drupal\uc_tax\Tests\InclusiveTaxTest->testProductKitAttributes()
Class 'Drupal\uc_cart\Controller\Cart' not foundPHP Fatal errorCartController.php25Unknown
Class 'Drupal\uc_cart\Controller\Cart' not foundPHP Fatal errorCartController.php25Unknown
ExpandDrupal\uc_tax\Tests\StoredTaxTest81123
MessageGroupFilenameLineFunctionStatus
simplexml_import_dom(): Invalid Nodetype to importsimplexml_import_dom(Object) Drupal\simpletest\WebTestBase->parse() Drupal\simpletest\WebTestBase->drupalPostForm('cart', Array, 'Checkout') Drupal\uc_tax\Tests\StoredTaxTest->testTaxDisplay() Drupal\simpletest\TestBase->run(Array) simpletest_script_run_one_test('23', 'Drupal\uc_tax\Tests\StoredTaxTest') WarningAssertContentTrait.php138Drupal\simpletest\WebTestBase->parse()
Viewed cart page: Billing pane has been displayed.OtherStoredTaxTest.php74Drupal\uc_tax\Tests\StoredTaxTest->testTaxDisplay()
Tax line item displayed.OtherStoredTaxTest.php75Drupal\uc_tax\Tests\StoredTaxTest->testTaxDisplay()
Correct tax amount displayed.OtherStoredTaxTest.php76Drupal\uc_tax\Tests\StoredTaxTest->testTaxDisplay()
Stored tax line item has the correct amount after rate changeOtherStoredTaxTest.php112Drupal\uc_tax\Tests\StoredTaxTest->testTaxDisplay()
The tax line item was saved to the order after applicable product changeOtherStoredTaxTest.php121Drupal\uc_tax\Tests\StoredTaxTest->testTaxDisplay()
Stored tax line item has the correct amount after applicable product changeOtherStoredTaxTest.php121Drupal\uc_tax\Tests\StoredTaxTest->testTaxDisplay()
Found the tax line item ID after applicable product changeBrowserStoredTaxTest.php121Drupal\uc_tax\Tests\StoredTaxTest->testTaxDisplay()
strpos(): Empty needlestrpos(' Skip to main content Order 1 Status message Order changes saved. Ship to: First name Last name Company Street address City State/Province - None -AdanaAdıyamanAfyonAksarayAmasyaAnkaraAntalyaArdahanArtvinAydınAğrıBalıkesirBartınBatmanBayburtBilecikBingölBitlisBoluBurdurBursaDenizliDiyarbakırDüzceEdirneElazığErzincanErzurumEskişehirGaziantepGiresunGümüşhaneHakkâriHatayIspartaIğdırKahramanmaraşKarabükKaramanKarsKastamonuKayseriKilisKocaeliKonyaKütahyaKırklareliKırıkkaleKırşehirMalatyaManisaMardinMuğlaMuşNevşehirNiğdeOrduOsmaniyeRizeSakaryaSamsunSiirtSinopSivasTekirdağTokatTrabzonTunceliUşakVanYalovaYozgatZonguldakÇanakkaleÇankırıÇorumİstanbulİzmirİçelŞanlıurfaŞırnak Country BangladeshCôte d'IvoireMontserratNauruNepalSwitzerlandTanzania, United Republic ofTurkey Postal code Bill to: First name Last name Company Street address City State/Province - None -AdanaAdıyamanAfyonAksarayAmasyaAnkaraAntalyaArdahanArtvinAydınAğrıBalıkesirBartınBatmanBayburtBilecikBingölBitlisBoluBurdurBursaDenizliDiyarbakırDüzceEdirneElazığErzincanErzurumEskişehirGaziantepGiresunGümüşhaneHakkâriHatayIspartaIğdırKahramanmaraşKarabükKaramanKarsKastamonuKayseriKilisKocaeliKonyaKütahyaKırklareliKırıkkaleKırşehirMalatyaManisaMardinMuğlaMuşNevşehirNiğdeOrduOsmaniyeRizeSakaryaSamsunSiirtSinopSivasTekirdağTokatTrabzonTunceliUşakVanYalovaYozgatZonguldakÇanakkaleÇankırıÇorumİstanbulİzmirİçelŞanlıurfaŞırnak Country BangladeshCôte d'IvoireMontserratNauruNepalSwitzerlandTanzania, United Republic ofTurkey Postal code Customer info: Customer number E-mail address Payment: Payment method Free orderCheckCash on deliveryOther Products: Remove Quantity Name SKU Weight Units Cost Price Quantity Title SKU Weight Units PoundsKilogramsOuncesGrams Cost $ Price $ Add a line item Empty line Subtotal:$2,711.00 Order total:$2,711.00Admin comments:No admin comments have been entered for this order.Add an admin comment Admin comments are only seen by store administrators. Delete Primary tabs View Edit(active tab) Invoice Log {"path":{"baseUrl":"\/checkout\/","scriptPath":null,"pathPrefix":"","currentPath":"admin\/store\/orders\/1\/edit","currentPathIsAdmin":true,"isFront":false,"currentLanguage":"en"},"pluralDelimiter":"\u0003","ajaxPageState":{"libraries":"classy\/base,classy\/messages,core\/drupal.active-link,core\/drupal.ajax,core\/drupal.collapse,core\/drupal.tableresponsive,core\/html5shiv,core\/jquery.form,core\/normalize,system\/admin,uc_order\/uc_order.scripts,uc_order\/uc_order.styles,uc_product\/uc_product.styles,uc_store\/uc_store.styles","theme":"classy","theme_token":null},"ajaxTrustedUrl":{"form_action_cc611e1d":true,"\/checkout\/admin\/store\/orders\/1\/edit?ajax_form=1":true},"ucURL":{"adminOrders":"\/checkout\/admin\/store\/orders"},"ajax":{"edit-submit":{"callback":"uc_order_pane_line_items_update","event":"mousedown","keypress":true,"prevent":"click","url":"\/checkout\/admin\/store\/orders\/1\/edit?ajax_form=1","dialogType":"ajax","submit":{"_triggering_element_name":"op","_triggering_element_value":"Add line"}},"edit-add-blank-line-button":{"callback":"uc_order_pane_products_ajax_callback","wrapper":"product-controls","event":"mousedown","keypress":true,"prevent":"click","url":"\/checkout\/admin\/store\/orders\/1\/edit?ajax_form=1","dialogType":"ajax","submit":{"_triggering_element_name":"op","_triggering_element_value":"Add blank line"}},"edit-add-product-button":{"callback":"uc_order_pane_products_ajax_callback","wrapper":"product-controls","event":"mousedown","keypress":true,"prevent":"click","url":"\/checkout\/admin\/store\/orders\/1\/edit?ajax_form=1","dialogType":"ajax","submit":{"_triggering_element_name":"op","_triggering_element_value":"Add product"}},"edit-payment-method":{"callback":"uc_payment_order_pane_ajax_callback","progress":{"type":"throbber"},"wrapper":"payment-details","event":"change","url":"\/checkout\/admin\/store\/orders\/1\/edit?ajax_form=1","dialogType":"ajax","submit":{"_triggering_element_name":"payment_method"}},"edit-bill-to-country":{"callback":["Drupal\\uc_store\\Element\\UcAddress","updateZone"],"wrapper":"uc-store-address-zone-wrapper","progress":{"type":"throbber"},"event":"change","url":"\/checkout\/admin\/store\/orders\/1\/edit?ajax_form=1","dialogType":"ajax","submit":{"_triggering_element_name":"bill_to[country]"}},"edit-ship-to-country":{"callback":["Drupal\\uc_store\\Element\\UcAddress","updateZone"],"wrapper":"uc-store-address-zone-wrapper","progress":{"type":"throbber"},"event":"change","url":"\/checkout\/admin\/store\/orders\/1\/edit?ajax_form=1","dialogType":"ajax","submit":{"_triggering_element_name":"ship_to[country]"}}},"user":{"uid":"2","permissionsHash":"ac2e1569974406d87697502d728c486c12ef36b3ede5a87d998dc95143805b46"}} ', '') Drupal\simpletest\WebTestBase->assertTextHelper(NULL, 'Found the tax title after applicable product change', 'Other', ) Drupal\simpletest\WebTestBase->assertText(NULL, 'Found the tax title after applicable product change') Drupal\uc_tax\Tests\StoredTaxTest->assertTaxLineCorrect(, 0.2, 'after applicable product change') Drupal\uc_tax\Tests\StoredTaxTest->testTaxDisplay() Drupal\simpletest\TestBase->run(Array) simpletest_script_run_one_test('23', 'Drupal\uc_tax\Tests\StoredTaxTest') WarningAssertContentTrait.php614Drupal\simpletest\WebTestBase->assertTextHelper()
Found the tax title after applicable product changeOtherStoredTaxTest.php121Drupal\uc_tax\Tests\StoredTaxTest->testTaxDisplay()
strpos(): Empty needlestrpos(' Skip to main content Order 1 Status message Order changes saved. Ship to: First name Last name Company Street address City State/Province - None -AdanaAdıyamanAfyonAksarayAmasyaAnkaraAntalyaArdahanArtvinAydınAğrıBalıkesirBartınBatmanBayburtBilecikBingölBitlisBoluBurdurBursaDenizliDiyarbakırDüzceEdirneElazığErzincanErzurumEskişehirGaziantepGiresunGümüşhaneHakkâriHatayIspartaIğdırKahramanmaraşKarabükKaramanKarsKastamonuKayseriKilisKocaeliKonyaKütahyaKırklareliKırıkkaleKırşehirMalatyaManisaMardinMuğlaMuşNevşehirNiğdeOrduOsmaniyeRizeSakaryaSamsunSiirtSinopSivasTekirdağTokatTrabzonTunceliUşakVanYalovaYozgatZonguldakÇanakkaleÇankırıÇorumİstanbulİzmirİçelŞanlıurfaŞırnak Country BangladeshCôte d'IvoireMontserratNauruNepalSwitzerlandTanzania, United Republic ofTurkey Postal code Bill to: First name Last name Company Street address City State/Province - None -AdanaAdıyamanAfyonAksarayAmasyaAnkaraAntalyaArdahanArtvinAydınAğrıBalıkesirBartınBatmanBayburtBilecikBingölBitlisBoluBurdurBursaDenizliDiyarbakırDüzceEdirneElazığErzincanErzurumEskişehirGaziantepGiresunGümüşhaneHakkâriHatayIspartaIğdırKahramanmaraşKarabükKaramanKarsKastamonuKayseriKilisKocaeliKonyaKütahyaKırklareliKırıkkaleKırşehirMalatyaManisaMardinMuğlaMuşNevşehirNiğdeOrduOsmaniyeRizeSakaryaSamsunSiirtSinopSivasTekirdağTokatTrabzonTunceliUşakVanYalovaYozgatZonguldakÇanakkaleÇankırıÇorumİstanbulİzmirİçelŞanlıurfaŞırnak Country BangladeshCôte d'IvoireMontserratNauruNepalSwitzerlandTanzania, United Republic ofTurkey Postal code Customer info: Customer number E-mail address Payment: Payment method Free orderCheckCash on deliveryOther Products: Remove Quantity Name SKU Weight Units Cost Price Quantity Title SKU Weight Units PoundsKilogramsOuncesGrams Cost $ Price $ Add a line item Empty line Subtotal:$2,711.00 Order total:$2,711.00Admin comments:No admin comments have been entered for this order.Add an admin comment Admin comments are only seen by store administrators. Delete Primary tabs View Edit(active tab) Invoice Log {"path":{"baseUrl":"\/checkout\/","scriptPath":null,"pathPrefix":"","currentPath":"admin\/store\/orders\/1\/edit","currentPathIsAdmin":true,"isFront":false,"currentLanguage":"en"},"pluralDelimiter":"\u0003","ajaxPageState":{"libraries":"classy\/base,classy\/messages,core\/drupal.active-link,core\/drupal.ajax,core\/drupal.collapse,core\/drupal.tableresponsive,core\/html5shiv,core\/jquery.form,core\/normalize,system\/admin,uc_order\/uc_order.scripts,uc_order\/uc_order.styles,uc_product\/uc_product.styles,uc_store\/uc_store.styles","theme":"classy","theme_token":null},"ajaxTrustedUrl":{"form_action_cc611e1d":true,"\/checkout\/admin\/store\/orders\/1\/edit?ajax_form=1":true},"ucURL":{"adminOrders":"\/checkout\/admin\/store\/orders"},"ajax":{"edit-submit":{"callback":"uc_order_pane_line_items_update","event":"mousedown","keypress":true,"prevent":"click","url":"\/checkout\/admin\/store\/orders\/1\/edit?ajax_form=1","dialogType":"ajax","submit":{"_triggering_element_name":"op","_triggering_element_value":"Add line"}},"edit-add-blank-line-button":{"callback":"uc_order_pane_products_ajax_callback","wrapper":"product-controls","event":"mousedown","keypress":true,"prevent":"click","url":"\/checkout\/admin\/store\/orders\/1\/edit?ajax_form=1","dialogType":"ajax","submit":{"_triggering_element_name":"op","_triggering_element_value":"Add blank line"}},"edit-add-product-button":{"callback":"uc_order_pane_products_ajax_callback","wrapper":"product-controls","event":"mousedown","keypress":true,"prevent":"click","url":"\/checkout\/admin\/store\/orders\/1\/edit?ajax_form=1","dialogType":"ajax","submit":{"_triggering_element_name":"op","_triggering_element_value":"Add product"}},"edit-payment-method":{"callback":"uc_payment_order_pane_ajax_callback","progress":{"type":"throbber"},"wrapper":"payment-details","event":"change","url":"\/checkout\/admin\/store\/orders\/1\/edit?ajax_form=1","dialogType":"ajax","submit":{"_triggering_element_name":"payment_method"}},"edit-bill-to-country":{"callback":["Drupal\\uc_store\\Element\\UcAddress","updateZone"],"wrapper":"uc-store-address-zone-wrapper","progress":{"type":"throbber"},"event":"change","url":"\/checkout\/admin\/store\/orders\/1\/edit?ajax_form=1","dialogType":"ajax","submit":{"_triggering_element_name":"bill_to[country]"}},"edit-ship-to-country":{"callback":["Drupal\\uc_store\\Element\\UcAddress","updateZone"],"wrapper":"uc-store-address-zone-wrapper","progress":{"type":"throbber"},"event":"change","url":"\/checkout\/admin\/store\/orders\/1\/edit?ajax_form=1","dialogType":"ajax","submit":{"_triggering_element_name":"ship_to[country]"}}},"user":{"uid":"2","permissionsHash":"ac2e1569974406d87697502d728c486c12ef36b3ede5a87d998dc95143805b46"}} ', '') Drupal\simpletest\WebTestBase->assertTextHelper(NULL, 'Tax display has the correct amount after applicable product change', 'Other', ) Drupal\simpletest\WebTestBase->assertText(NULL, 'Tax display has the correct amount after applicable product change') Drupal\uc_tax\Tests\StoredTaxTest->assertTaxLineCorrect(, 0.2, 'after applicable product change') Drupal\uc_tax\Tests\StoredTaxTest->testTaxDisplay() Drupal\simpletest\TestBase->run(Array) simpletest_script_run_one_test('23', 'Drupal\uc_tax\Tests\StoredTaxTest') WarningAssertContentTrait.php614Drupal\simpletest\WebTestBase->assertTextHelper()
Tax display has the correct amount after applicable product changeOtherStoredTaxTest.php121Drupal\uc_tax\Tests\StoredTaxTest->testTaxDisplay()
Class 'Drupal\uc_cart\Controller\Cart' not foundPHP Fatal errorCartController.php25Unknown
Class 'Drupal\uc_cart\Controller\Cart' not foundPHP Fatal errorCartController.php25Unknown
Call to undefined method Drupal\uc_cart\CartManager::entityManager()PHP Fatal errorCartManager.php85Unknown