2574001-remove-config-file-storage-service.patch

Test status
StatusResult
Last receivedThu, 09/24/2015 - 12:19:59
Last requestedThu, 09/24/2015 - 12:20:01
Last testedThu, 09/24/2015 - 12:20:20
Test count1
Environment status
PHP 5.5 MySQLfail
File information
File2574001-remove-config-file-storage-service.patch
BranchConfiguration development - 8.x-1.x
LinkIssue Link
SummaryFAILED: [[SimpleTest]]: [PHP 5.5 MySQL] 2 pass(es), 0 fail(s), and 2 exception(s).
Details

PHP 5.5 MySQL

  1. Setup environment
  2. Detect an invalid patch URL
  3. Detect invalid repository information
  4. Detect invalid patch format
  5. Detect a non-applicable patch
  6. Detect invalid PHP syntax
  7. Detect a Drupal installation failure
  8. Detect a test run failure
  9. Detect a failing test
    Review the test failures below then if necessary run them locally until the problem has been fixed.
  10. Complete test suite with all tests passing
2 pass(es), 0 fail(s), and 2 exception(s)

Non-pass

Test namePassFailException
ExpandDrupal\config_devel\Tests\ConfigDevelSubscriberEntityTest101
MessageGroupFilenameLineFunctionStatus
Drupal\Core\Config\Schema\SchemaIncompleteException: Schema errors for config_devel.settings with the following errors: config_devel.settings:langcode missing schema in Drupal\Core\Config\Testing\ConfigSchemaChecker->onConfigSave() (line 98 of /var/lib/drupaltestbot/sites/default/files/checkout/core/lib/Drupal/Core/Config/Testing/ConfigSchemaChecker.php). Drupal\Core\Config\Testing\ConfigSchemaChecker->onConfigSave(Object, 'config.save', Object) Drupal\Component\EventDispatcher\ContainerAwareEventDispatcher->dispatch('config.save', Object) Drupal\Core\Config\Config->save(1) Drupal\Core\Config\ConfigInstaller->createConfiguration('', Array) Drupal\Core\Config\ConfigInstaller->installDefaultConfig('module', 'config_devel') Drupal\Core\ProxyClass\Config\ConfigInstaller->installDefaultConfig('module', 'config_devel') Drupal\config_devel\Tests\ConfigDevelSubscriberTestBase->testSubscribers() Drupal\simpletest\TestBase->run(Array) simpletest_script_run_one_test('2', 'Drupal\config_devel\Tests\ConfigDevelSubscriberEntityTest') Uncaught exceptionConfigSchemaChecker.php98Drupal\Core\Config\Testing\ConfigSchemaChecker->onConfigSave()
ExpandDrupal\config_devel\Tests\ConfigDevelSubscriberRawTest101
MessageGroupFilenameLineFunctionStatus
Drupal\Core\Config\Schema\SchemaIncompleteException: Schema errors for config_devel.settings with the following errors: config_devel.settings:langcode missing schema in Drupal\Core\Config\Testing\ConfigSchemaChecker->onConfigSave() (line 98 of /var/lib/drupaltestbot/sites/default/files/checkout/core/lib/Drupal/Core/Config/Testing/ConfigSchemaChecker.php). Drupal\Core\Config\Testing\ConfigSchemaChecker->onConfigSave(Object, 'config.save', Object) Drupal\Component\EventDispatcher\ContainerAwareEventDispatcher->dispatch('config.save', Object) Drupal\Core\Config\Config->save(1) Drupal\Core\Config\ConfigInstaller->createConfiguration('', Array) Drupal\Core\Config\ConfigInstaller->installDefaultConfig('module', 'config_devel') Drupal\Core\ProxyClass\Config\ConfigInstaller->installDefaultConfig('module', 'config_devel') Drupal\config_devel\Tests\ConfigDevelSubscriberTestBase->testSubscribers() Drupal\simpletest\TestBase->run(Array) simpletest_script_run_one_test('1', 'Drupal\config_devel\Tests\ConfigDevelSubscriberRawTest') Uncaught exceptionConfigSchemaChecker.php98Drupal\Core\Config\Testing\ConfigSchemaChecker->onConfigSave()

All

Test namePassFailException
ExpandDrupal\config_devel\Tests\ConfigDevelSubscriberEntityTest101
MessageGroupFilenameLineFunctionStatus
Drupal\Core\Config\Schema\SchemaIncompleteException: Schema errors for config_devel.settings with the following errors: config_devel.settings:langcode missing schema in Drupal\Core\Config\Testing\ConfigSchemaChecker->onConfigSave() (line 98 of /var/lib/drupaltestbot/sites/default/files/checkout/core/lib/Drupal/Core/Config/Testing/ConfigSchemaChecker.php). Drupal\Core\Config\Testing\ConfigSchemaChecker->onConfigSave(Object, 'config.save', Object) Drupal\Component\EventDispatcher\ContainerAwareEventDispatcher->dispatch('config.save', Object) Drupal\Core\Config\Config->save(1) Drupal\Core\Config\ConfigInstaller->createConfiguration('', Array) Drupal\Core\Config\ConfigInstaller->installDefaultConfig('module', 'config_devel') Drupal\Core\ProxyClass\Config\ConfigInstaller->installDefaultConfig('module', 'config_devel') Drupal\config_devel\Tests\ConfigDevelSubscriberTestBase->testSubscribers() Drupal\simpletest\TestBase->run(Array) simpletest_script_run_one_test('2', 'Drupal\config_devel\Tests\ConfigDevelSubscriberEntityTest') Uncaught exceptionConfigSchemaChecker.php98Drupal\Core\Config\Testing\ConfigSchemaChecker->onConfigSave()
ExpandDrupal\config_devel\Tests\ConfigDevelSubscriberRawTest101
MessageGroupFilenameLineFunctionStatus
Drupal\Core\Config\Schema\SchemaIncompleteException: Schema errors for config_devel.settings with the following errors: config_devel.settings:langcode missing schema in Drupal\Core\Config\Testing\ConfigSchemaChecker->onConfigSave() (line 98 of /var/lib/drupaltestbot/sites/default/files/checkout/core/lib/Drupal/Core/Config/Testing/ConfigSchemaChecker.php). Drupal\Core\Config\Testing\ConfigSchemaChecker->onConfigSave(Object, 'config.save', Object) Drupal\Component\EventDispatcher\ContainerAwareEventDispatcher->dispatch('config.save', Object) Drupal\Core\Config\Config->save(1) Drupal\Core\Config\ConfigInstaller->createConfiguration('', Array) Drupal\Core\Config\ConfigInstaller->installDefaultConfig('module', 'config_devel') Drupal\Core\ProxyClass\Config\ConfigInstaller->installDefaultConfig('module', 'config_devel') Drupal\config_devel\Tests\ConfigDevelSubscriberTestBase->testSubscribers() Drupal\simpletest\TestBase->run(Array) simpletest_script_run_one_test('1', 'Drupal\config_devel\Tests\ConfigDevelSubscriberRawTest') Uncaught exceptionConfigSchemaChecker.php98Drupal\Core\Config\Testing\ConfigSchemaChecker->onConfigSave()