Response_object-1420364-43.patch

Test status
StatusResult
Last receivedWed, 09/23/2015 - 14:02:00
Last requestedWed, 09/23/2015 - 15:56:54
Last testedWed, 09/23/2015 - 15:59:55
Test count1
Environment status
PHP 5.5 MySQLfail
File information
FileResponse_object-1420364-43.patch
BranchTranslation Management Tool - 8.x-1.x
LinkIssue Link
SummaryFAILED: [[SimpleTest]]: [PHP 5.5 MySQL] 2,255 pass(es), 209 fail(s), and 139 exception(s).
Details

PHP 5.5 MySQL

  1. Setup environment
  2. Detect an invalid patch URL
  3. Detect invalid repository information
  4. Detect invalid patch format
  5. Detect a non-applicable patch
  6. Detect invalid PHP syntax
  7. Detect a Drupal installation failure
  8. Detect a test run failure
  9. Detect a failing test
    Review the test failures below then if necessary run them locally until the problem has been fixed.
  10. Complete test suite with all tests passing
2,255 pass(es), 209 fail(s), and 139 exception(s)

Non-pass

Test namePassFailException
ExpandDrupal\tmgmt\Tests\TMGMTCartTest4743
MessageGroupFilenameLineFunctionStatus
Undefined variable: translatorNoticeJobForm.php508Drupal\tmgmt\Form\JobForm->checkoutSettingsForm()
Undefined variable: translatorNoticeJobForm.php512Drupal\tmgmt\Form\JobForm->checkoutSettingsForm()
"One job needs to be checked out." foundOtherTMGMTCartTest.php84Drupal\tmgmt\Tests\TMGMTCartTest->testCartEnforceSourceLanguage()
Raw "One item skipped as for the language English it was not possible to retrieve a translation." foundOtherTMGMTCartTest.php85Drupal\tmgmt\Tests\TMGMTCartTest->testCartEnforceSourceLanguage()
"You have enforced the the job source language which most likely resulted in having a translation of your original content as the job source text. You should review the job translation received from the translator carefully to prevent the content quality loss." foundOtherTMGMTCartTest.php86Drupal\tmgmt\Tests\TMGMTCartTest->testCartEnforceSourceLanguage()
simplexml_import_dom(): Invalid Nodetype to importsimplexml_import_dom(Object) Drupal\simpletest\WebTestBase->parse() Drupal\simpletest\WebTestBase->drupalPostForm(NULL, Array, Object) Drupal\tmgmt\Tests\TMGMTCartTest->testCartEnforceSourceLanguage() Drupal\simpletest\TestBase->run(Array) simpletest_script_run_one_test('14', 'Drupal\tmgmt\Tests\TMGMTCartTest') WarningAssertContentTrait.php138Drupal\simpletest\WebTestBase->parse()
Call to a member function getPluginId() on a non-objectPHP Fatal errorJobForm.php512Unknown
ExpandDrupal\tmgmt\Tests\TMGMTUiTest4725754
MessageGroupFilenameLineFunctionStatus
Undefined variable: translatorNoticeJobForm.php508Drupal\tmgmt\Form\JobForm->checkoutSettingsForm()
Undefined variable: translatorNoticeJobForm.php512Drupal\tmgmt\Form\JobForm->checkoutSettingsForm()
"test_source:test:1" foundOtherTMGMTUiTest.php68Drupal\tmgmt\Tests\TMGMTUiTest->testCheckoutForm()
Undefined variable: translatorNoticeJobForm.php508Drupal\tmgmt\Form\JobForm->checkoutSettingsForm()
Undefined variable: translatorNoticeJobForm.php512Drupal\tmgmt\Form\JobForm->checkoutSettingsForm()
"test_source:test:1" foundOtherTMGMTUiTest.php79Drupal\tmgmt\Tests\TMGMTUiTest->testCheckoutForm()
"test_source:test:2" foundOtherTMGMTUiTest.php80Drupal\tmgmt\Tests\TMGMTUiTest->testCheckoutForm()
"test_source:test:3" foundOtherTMGMTUiTest.php81Drupal\tmgmt\Tests\TMGMTUiTest->testCheckoutForm()
simplexml_import_dom(): Invalid Nodetype to importsimplexml_import_dom(Object) Drupal\simpletest\WebTestBase->parse() Drupal\simpletest\WebTestBase->drupalPostForm(NULL, Array, Object) Drupal\tmgmt\Tests\TMGMTUiTest->testCheckoutForm() Drupal\simpletest\TestBase->run(Array) simpletest_script_run_one_test('11', 'Drupal\tmgmt\Tests\TMGMTUiTest') WarningAssertContentTrait.php138Drupal\simpletest\WebTestBase->parse()
"Test translator (auto created) can not translate from English to Greek." foundOtherTMGMTUiTest.php91Drupal\tmgmt\Tests\TMGMTUiTest->testCheckoutForm()
simplexml_import_dom(): Invalid Nodetype to importsimplexml_import_dom(Object) Drupal\simpletest\WebTestBase->parse() Drupal\simpletest\WebTestBase->drupalPostForm(NULL, Array, Object) Drupal\tmgmt\Tests\TMGMTUiTest->testCheckoutForm() Drupal\simpletest\TestBase->run(Array) simpletest_script_run_one_test('11', 'Drupal\tmgmt\Tests\TMGMTUiTest') WarningAssertContentTrait.php138Drupal\simpletest\WebTestBase->parse()
Value false is TRUE.OtherTMGMTUiTest.php105Drupal\tmgmt\Tests\TMGMTUiTest->testCheckoutForm()
Value false is TRUE.OtherTMGMTUiTest.php108Drupal\tmgmt\Tests\TMGMTUiTest->testCheckoutForm()
Value false is TRUE.OtherTMGMTUiTest.php108Drupal\tmgmt\Tests\TMGMTUiTest->testCheckoutForm()
Value false is TRUE.OtherTMGMTUiTest.php108Drupal\tmgmt\Tests\TMGMTUiTest->testCheckoutForm()
"Test translation created" foundOtherTMGMTUiTest.php110Drupal\tmgmt\Tests\TMGMTUiTest->testCheckoutForm()
"Job overview" foundOtherTMGMTUiTest.php114Drupal\tmgmt\Tests\TMGMTUiTest->testCheckoutForm()
Value '1' is not equal to value '1'.OtherTMGMTUiTest.php120Drupal\tmgmt\Tests\TMGMTUiTest->testCheckoutForm()
Undefined variable: translatorNoticeJobForm.php508Drupal\tmgmt\Form\JobForm->checkoutSettingsForm()
Undefined variable: translatorNoticeJobForm.php512Drupal\tmgmt\Form\JobForm->checkoutSettingsForm()
"You can provide a label for this job in order to identify it easily later on." foundOtherTMGMTUiTest.php127Drupal\tmgmt\Tests\TMGMTUiTest->testCheckoutForm()
"test_source:test:1" foundOtherTMGMTUiTest.php128Drupal\tmgmt\Tests\TMGMTUiTest->testCheckoutForm()
simplexml_import_dom(): Invalid Nodetype to importsimplexml_import_dom(Object) Drupal\simpletest\WebTestBase->parse() Drupal\simpletest\WebTestBase->drupalPostForm(NULL, Array, Object) Drupal\tmgmt\Tests\TMGMTUiTest->testCheckoutForm() Drupal\simpletest\TestBase->run(Array) simpletest_script_run_one_test('11', 'Drupal\tmgmt\Tests\TMGMTUiTest') WarningAssertContentTrait.php138Drupal\simpletest\WebTestBase->parse()
"Test submit" foundOtherTMGMTUiTest.php135Drupal\tmgmt\Tests\TMGMTUiTest->testCheckoutForm()
Value false is TRUE.OtherTMGMTUiTest.php137Drupal\tmgmt\Tests\TMGMTUiTest->testCheckoutForm()
Undefined variable: translatorNoticeJobForm.php508Drupal\tmgmt\Form\JobForm->checkoutSettingsForm()
Undefined variable: translatorNoticeJobForm.php512Drupal\tmgmt\Form\JobForm->checkoutSettingsForm()
"You can provide a label for this job in order to identify it easily later on." foundOtherTMGMTUiTest.php148Drupal\tmgmt\Tests\TMGMTUiTest->testCheckoutForm()
"test_source:test:1" foundOtherTMGMTUiTest.php149Drupal\tmgmt\Tests\TMGMTUiTest->testCheckoutForm()
simplexml_import_dom(): Invalid Nodetype to importsimplexml_import_dom(Object) Drupal\simpletest\WebTestBase->parse() Drupal\simpletest\WebTestBase->drupalPostForm(NULL, Array, Object) Drupal\tmgmt\Tests\TMGMTUiTest->testCheckoutForm() Drupal\simpletest\TestBase->run(Array) simpletest_script_run_one_test('11', 'Drupal\tmgmt\Tests\TMGMTUiTest') WarningAssertContentTrait.php138Drupal\simpletest\WebTestBase->parse()
"This is not supported" foundOtherTMGMTUiTest.php155Drupal\tmgmt\Tests\TMGMTUiTest->testCheckoutForm()
Value false is TRUE.OtherTMGMTUiTest.php157Drupal\tmgmt\Tests\TMGMTUiTest->testCheckoutForm()
simplexml_import_dom(): Invalid Nodetype to importsimplexml_import_dom(Object) Drupal\simpletest\WebTestBase->parse() Drupal\simpletest\WebTestBase->xpath('//div[contains(@class, @view)]//tbody/tr', Array) Drupal\tmgmt\Tests\TMGMTUiTest->testCheckoutForm() Drupal\simpletest\TestBase->run(Array) simpletest_script_run_one_test('11', 'Drupal\tmgmt\Tests\TMGMTUiTest') WarningAssertContentTrait.php138Drupal\simpletest\WebTestBase->parse()
Value 2 is equal to value 1.OtherTMGMTUiTest.php161Drupal\tmgmt\Tests\TMGMTUiTest->testCheckoutForm()
simplexml_import_dom(): Invalid Nodetype to importsimplexml_import_dom(Object) Drupal\simpletest\WebTestBase->parse() Drupal\simpletest\WebTestBase->xpath('////div[contains(@class, @view)]//td[contains(@class, @field)]/span', Array) Drupal\tmgmt\Tests\TMGMTUiTest->testCheckoutForm() Drupal\simpletest\TestBase->run(Array) simpletest_script_run_one_test('11', 'Drupal\tmgmt\Tests\TMGMTUiTest') WarningAssertContentTrait.php138Drupal\simpletest\WebTestBase->parse()
Value 2 is equal to value 1.OtherTMGMTUiTest.php165Drupal\tmgmt\Tests\TMGMTUiTest->testCheckoutForm()
Invalid argument supplied for foreach()Drupal\tmgmt\Tests\TMGMTUiTest->testCheckoutForm() Drupal\simpletest\TestBase->run(Array) simpletest_script_run_one_test('11', 'Drupal\tmgmt\Tests\TMGMTUiTest') WarningTMGMTUiTest.php166Drupal\tmgmt\Tests\TMGMTUiTest->testCheckoutForm()
simplexml_import_dom(): Invalid Nodetype to importsimplexml_import_dom(Object) Drupal\simpletest\WebTestBase->parse() Drupal\simpletest\WebTestBase->drupalPostForm(NULL, Array, Object) Drupal\tmgmt\Tests\TMGMTUiTest->testCheckoutForm() Drupal\simpletest\TestBase->run(Array) simpletest_script_run_one_test('11', 'Drupal\tmgmt\Tests\TMGMTUiTest') WarningAssertContentTrait.php138Drupal\simpletest\WebTestBase->parse()
"Test translation created" foundOtherTMGMTUiTest.php176Drupal\tmgmt\Tests\TMGMTUiTest->testCheckoutForm()
Undefined variable: translatorNoticeJobForm.php508Drupal\tmgmt\Form\JobForm->checkoutSettingsForm()
Undefined variable: translatorNoticeJobForm.php512Drupal\tmgmt\Form\JobForm->checkoutSettingsForm()
"You can provide a label for this job in order to identify it easily later on." foundOtherTMGMTUiTest.php187Drupal\tmgmt\Tests\TMGMTUiTest->testCheckoutForm()
"test_source:test:1" foundOtherTMGMTUiTest.php188Drupal\tmgmt\Tests\TMGMTUiTest->testCheckoutForm()
simplexml_import_dom(): Invalid Nodetype to importsimplexml_import_dom(Object) Drupal\simpletest\WebTestBase->parse() Drupal\simpletest\WebTestBase->drupalPostForm(NULL, Array, Object) Drupal\tmgmt\Tests\TMGMTUiTest->testCheckoutForm() Drupal\simpletest\TestBase->run(Array) simpletest_script_run_one_test('11', 'Drupal\tmgmt\Tests\TMGMTUiTest') WarningAssertContentTrait.php138Drupal\simpletest\WebTestBase->parse()
"Service not reachable" foundOtherTMGMTUiTest.php194Drupal\tmgmt\Tests\TMGMTUiTest->testCheckoutForm()
"You can provide a label for this job in order to identify it easily later on." foundOtherTMGMTUiTest.php199Drupal\tmgmt\Tests\TMGMTUiTest->testCheckoutForm()
Undefined variable: translatorNoticeJobForm.php508Drupal\tmgmt\Form\JobForm->checkoutSettingsForm()
Undefined variable: translatorNoticeJobForm.php512Drupal\tmgmt\Form\JobForm->checkoutSettingsForm()
"You can provide a label for this job in order to identify it easily later on." foundOtherTMGMTUiTest.php210Drupal\tmgmt\Tests\TMGMTUiTest->testCheckoutForm()
"test_source:test:1" foundOtherTMGMTUiTest.php211Drupal\tmgmt\Tests\TMGMTUiTest->testCheckoutForm()
simplexml_import_dom(): Invalid Nodetype to importsimplexml_import_dom(Object) Drupal\simpletest\WebTestBase->parse() Drupal\simpletest\WebTestBase->drupalPostForm(NULL, Array, Object) Drupal\tmgmt\Tests\TMGMTUiTest->testCheckoutForm() Drupal\simpletest\TestBase->run(Array) simpletest_script_run_one_test('11', 'Drupal\tmgmt\Tests\TMGMTUiTest') WarningAssertContentTrait.php138Drupal\simpletest\WebTestBase->parse()
"Fail" foundOtherTMGMTUiTest.php218Drupal\tmgmt\Tests\TMGMTUiTest->testCheckoutForm()
Undefined variable: translatorNoticeJobForm.php508Drupal\tmgmt\Form\JobForm->checkoutSettingsForm()
Undefined variable: translatorNoticeJobForm.php512Drupal\tmgmt\Form\JobForm->checkoutSettingsForm()
"You can provide a label for this job in order to identify it easily later on." foundOtherTMGMTUiTest.php233Drupal\tmgmt\Tests\TMGMTUiTest->testCheckoutForm()
"test_source:test:1" foundOtherTMGMTUiTest.php234Drupal\tmgmt\Tests\TMGMTUiTest->testCheckoutForm()
simplexml_import_dom(): Invalid Nodetype to importsimplexml_import_dom(Object) Drupal\simpletest\WebTestBase->parse() Drupal\simpletest\WebTestBase->drupalPostForm(NULL, Array, Object) Drupal\tmgmt\Tests\TMGMTUiTest->testCheckoutForm() Drupal\simpletest\TestBase->run(Array) simpletest_script_run_one_test('11', 'Drupal\tmgmt\Tests\TMGMTUiTest') WarningAssertContentTrait.php138Drupal\simpletest\WebTestBase->parse()
"This is not supported." foundOtherTMGMTUiTest.php238Drupal\tmgmt\Tests\TMGMTUiTest->testCheckoutForm()
Value false is TRUE.OtherTMGMTUiTest.php240Drupal\tmgmt\Tests\TMGMTUiTest->testCheckoutForm()
Undefined variable: translatorNoticeJobForm.php508Drupal\tmgmt\Form\JobForm->checkoutSettingsForm()
Undefined variable: translatorNoticeJobForm.php512Drupal\tmgmt\Form\JobForm->checkoutSettingsForm()
simplexml_import_dom(): Invalid Nodetype to importsimplexml_import_dom(Object) Drupal\simpletest\WebTestBase->parse() Drupal\simpletest\WebTestBase->xpath('//*[@name="target_language"]') Drupal\simpletest\WebTestBase->drupalPostAjaxForm('admin/tmgmt/jobs/3', Array, 'target_language') Drupal\tmgmt\Tests\TMGMTUiTest->testCheckoutForm() Drupal\simpletest\TestBase->run(Array) simpletest_script_run_one_test('11', 'Drupal\tmgmt\Tests\TMGMTUiTest') WarningAssertContentTrait.php138Drupal\simpletest\WebTestBase->parse()
Undefined index: ajaxDrupal\simpletest\WebTestBase->drupalPostAjaxForm('admin/tmgmt/jobs/3', Array, 'target_language') Drupal\tmgmt\Tests\TMGMTUiTest->testCheckoutForm() Drupal\simpletest\TestBase->run(Array) simpletest_script_run_one_test('11', 'Drupal\tmgmt\Tests\TMGMTUiTest') NoticeWebTestBase.php1869Drupal\simpletest\WebTestBase->drupalPostAjaxForm()
Exception: No #ajax path specified. in Drupal\simpletest\WebTestBase->drupalPostAjaxForm() (line 1905 of /var/lib/drupaltestbot/sites/default/files/checkout/core/modules/simpletest/src/WebTestBase.php). Drupal\simpletest\WebTestBase->drupalPostAjaxForm('admin/tmgmt/jobs/3', Array, 'target_language') Drupal\tmgmt\Tests\TMGMTUiTest->testCheckoutForm() Drupal\simpletest\TestBase->run(Array) simpletest_script_run_one_test('11', 'Drupal\tmgmt\Tests\TMGMTUiTest') Uncaught exceptionWebTestBase.php1905Drupal\simpletest\WebTestBase->drupalPostAjaxForm()
Call to a member function getPluginId() on a non-objectPHP Fatal errorJobForm.php512Unknown
Call to a member function getPluginId() on a non-objectPHP Fatal errorJobForm.php512Unknown
Call to a member function getPluginId() on a non-objectPHP Fatal errorJobForm.php512Unknown
Call to a member function getPluginId() on a non-objectPHP Fatal errorJobForm.php512Unknown
Call to a member function getPluginId() on a non-objectPHP Fatal errorJobForm.php512Unknown
Call to a member function getPluginId() on a non-objectPHP Fatal errorJobForm.php512Unknown
Call to a member function getPluginId() on a non-objectPHP Fatal errorJobForm.php512Unknown
Call to a member function getPluginId() on a non-objectPHP Fatal errorJobForm.php512Unknown
Undefined variable: translatorNoticeJobForm.php508Drupal\tmgmt\Form\JobForm->checkoutSettingsForm()
Undefined variable: translatorNoticeJobForm.php512Drupal\tmgmt\Form\JobForm->checkoutSettingsForm()
"The translation of test_source:test:1 to German is finished and can now be reviewed." foundOtherTMGMTUiTest.php496Drupal\tmgmt\Tests\TMGMTUiTest->testReview()
simplexml_import_dom(): Invalid Nodetype to importsimplexml_import_dom(Object) Drupal\simpletest\WebTestBase->parse() Drupal\simpletest\WebTestBase->drupalPostForm(NULL, Array, Object) Drupal\tmgmt\Tests\TMGMTUiTest->testReview() Drupal\simpletest\TestBase->run(Array) simpletest_script_run_one_test('11', 'Drupal\tmgmt\Tests\TMGMTUiTest') WarningAssertContentTrait.php138Drupal\simpletest\WebTestBase->parse()
Undefined variable: translatorNoticeJobForm.php508Drupal\tmgmt\Form\JobForm->checkoutSettingsForm()
Undefined variable: translatorNoticeJobForm.php512Drupal\tmgmt\Form\JobForm->checkoutSettingsForm()
Call to a member function getPluginId() on a non-objectPHP Fatal errorJobForm.php512Unknown
Call to a member function getPluginId() on a non-objectPHP Fatal errorJobForm.php512Unknown
Undefined variable: translatorNoticeJobForm.php508Drupal\tmgmt\Form\JobForm->checkoutSettingsForm()
Undefined variable: translatorNoticeJobForm.php512Drupal\tmgmt\Form\JobForm->checkoutSettingsForm()
Raw "20" foundOtherTMGMTUiTest.php556Drupal\tmgmt\Tests\TMGMTUiTest->testSuggestions()
simplexml_import_dom(): Invalid Nodetype to importsimplexml_import_dom(Object) Drupal\simpletest\WebTestBase->parse() Drupal\simpletest\WebTestBase->xpath('//*[@name="op" and @value="Load suggestions"]') Drupal\simpletest\WebTestBase->drupalPostAjaxForm(NULL, Array, Array) Drupal\tmgmt\Tests\TMGMTUiTest->testSuggestions() Drupal\simpletest\TestBase->run(Array) simpletest_script_run_one_test('11', 'Drupal\tmgmt\Tests\TMGMTUiTest') WarningAssertContentTrait.php138Drupal\simpletest\WebTestBase->parse()
Undefined index: ajaxDrupal\simpletest\WebTestBase->drupalPostAjaxForm(NULL, Array, Array) Drupal\tmgmt\Tests\TMGMTUiTest->testSuggestions() Drupal\simpletest\TestBase->run(Array) simpletest_script_run_one_test('11', 'Drupal\tmgmt\Tests\TMGMTUiTest') NoticeWebTestBase.php1869Drupal\simpletest\WebTestBase->drupalPostAjaxForm()
Exception: No #ajax path specified. in Drupal\simpletest\WebTestBase->drupalPostAjaxForm() (line 1905 of /var/lib/drupaltestbot/sites/default/files/checkout/core/modules/simpletest/src/WebTestBase.php). Drupal\simpletest\WebTestBase->drupalPostAjaxForm(NULL, Array, Array) Drupal\tmgmt\Tests\TMGMTUiTest->testSuggestions() Drupal\simpletest\TestBase->run(Array) simpletest_script_run_one_test('11', 'Drupal\tmgmt\Tests\TMGMTUiTest') Uncaught exceptionWebTestBase.php1905Drupal\simpletest\WebTestBase->drupalPostAjaxForm()
Call to a member function getPluginId() on a non-objectPHP Fatal errorJobForm.php512Unknown
Undefined variable: translatorNoticeJobForm.php508Drupal\tmgmt\Form\JobForm->checkoutSettingsForm()
Undefined variable: translatorNoticeJobForm.php512Drupal\tmgmt\Form\JobForm->checkoutSettingsForm()
simplexml_import_dom(): Invalid Nodetype to importsimplexml_import_dom(Object) Drupal\simpletest\WebTestBase->parse() Drupal\simpletest\WebTestBase->drupalPostForm('admin/tmgmt/jobs/1', Array, Object) Drupal\tmgmt\Tests\TMGMTUiTest->testAbortJob() Drupal\simpletest\TestBase->run(Array) simpletest_script_run_one_test('11', 'Drupal\tmgmt\Tests\TMGMTUiTest') WarningAssertContentTrait.php138Drupal\simpletest\WebTestBase->parse()
Undefined variable: translatorNoticeJobForm.php508Drupal\tmgmt\Form\JobForm->checkoutSettingsForm()
Undefined variable: translatorNoticeJobForm.php512Drupal\tmgmt\Form\JobForm->checkoutSettingsForm()
simplexml_import_dom(): Invalid Nodetype to importsimplexml_import_dom(Object) Drupal\simpletest\WebTestBase->parse() Drupal\simpletest\WebTestBase->drupalPostForm('admin/tmgmt/jobs/1', Array, Object) Drupal\tmgmt\Tests\TMGMTUiTest->testAbortJob() Drupal\simpletest\TestBase->run(Array) simpletest_script_run_one_test('11', 'Drupal\tmgmt\Tests\TMGMTUiTest') WarningAssertContentTrait.php138Drupal\simpletest\WebTestBase->parse()
simplexml_import_dom(): Invalid Nodetype to importsimplexml_import_dom(Object) Drupal\simpletest\WebTestBase->parse() Drupal\simpletest\WebTestBase->drupalPostForm(NULL, Array, Object) Drupal\tmgmt\Tests\TMGMTUiTest->testAbortJob() Drupal\simpletest\TestBase->run(Array) simpletest_script_run_one_test('11', 'Drupal\tmgmt\Tests\TMGMTUiTest') WarningAssertContentTrait.php138Drupal\simpletest\WebTestBase->parse()
Value false is TRUE.OtherTMGMTUiTest.php632Drupal\tmgmt\Tests\TMGMTUiTest->testAbortJob()
Value false is TRUE.OtherTMGMTUiTest.php634Drupal\tmgmt\Tests\TMGMTUiTest->testAbortJob()
Value false is TRUE.OtherTMGMTUiTest.php634Drupal\tmgmt\Tests\TMGMTUiTest->testAbortJob()
Value false is TRUE.OtherTMGMTUiTest.php634Drupal\tmgmt\Tests\TMGMTUiTest->testAbortJob()
Undefined variable: translatorNoticeJobForm.php508Drupal\tmgmt\Form\JobForm->checkoutSettingsForm()
Undefined variable: translatorNoticeJobForm.php512Drupal\tmgmt\Form\JobForm->checkoutSettingsForm()
simplexml_import_dom(): Invalid Nodetype to importsimplexml_import_dom(Object) Drupal\simpletest\WebTestBase->parse() Drupal\simpletest\WebTestBase->drupalPostForm('admin/tmgmt/jobs/1', Array, Object) Drupal\tmgmt\Tests\TMGMTUiTest->testAbortJob() Drupal\simpletest\TestBase->run(Array) simpletest_script_run_one_test('11', 'Drupal\tmgmt\Tests\TMGMTUiTest') WarningAssertContentTrait.php138Drupal\simpletest\WebTestBase->parse()
simplexml_import_dom(): Invalid Nodetype to importsimplexml_import_dom(Object) Drupal\simpletest\WebTestBase->parse() Drupal\simpletest\WebTestBase->drupalPostForm(NULL, Array, Object) Drupal\tmgmt\Tests\TMGMTUiTest->testAbortJob() Drupal\simpletest\TestBase->run(Array) simpletest_script_run_one_test('11', 'Drupal\tmgmt\Tests\TMGMTUiTest') WarningAssertContentTrait.php138Drupal\simpletest\WebTestBase->parse()
Raw "This job is a duplicate of the previously aborted job <a href="/checkout/admin/tmgmt/jobs/1">#1</a>" foundOtherTMGMTUiTest.php642Drupal\tmgmt\Tests\TMGMTUiTest->testAbortJob()
Drupal\tmgmt\TMGMTException: The job has no translator assigned. in Drupal\tmgmt\Entity\Job->getTranslator() (line 423 of /var/lib/drupaltestbot/sites/default/files/checkout/sites/default/modules/tmgmt/src/Entity/Job.php). Drupal\tmgmt\Entity\Job->getTranslator() Drupal\tmgmt\Tests\TMGMTUiTest->testAbortJob() Drupal\simpletest\TestBase->run(Array) simpletest_script_run_one_test('11', 'Drupal\tmgmt\Tests\TMGMTUiTest') Uncaught exceptionJob.php423Drupal\tmgmt\Entity\Job->getTranslator()
Call to a member function getPluginId() on a non-objectPHP Fatal errorJobForm.php512Unknown
Call to a member function getPluginId() on a non-objectPHP Fatal errorJobForm.php512Unknown
Call to a member function getPluginId() on a non-objectPHP Fatal errorJobForm.php512Unknown
Undefined variable: translatorNoticeJobForm.php508Drupal\tmgmt\Form\JobForm->checkoutSettingsForm()
Undefined variable: translatorNoticeJobForm.php512Drupal\tmgmt\Form\JobForm->checkoutSettingsForm()
"4 jobs need to be checked out." foundOtherTMGMTUiTest.php787Drupal\tmgmt\Tests\TMGMTUiTest->testCart()
Call to a member function getPluginId() on a non-objectPHP Fatal errorJobForm.php512Unknown
ExpandDrupal\tmgmt_config\Tests\ConfigSourceListTest1895019
MessageGroupFilenameLineFunctionStatus
Undefined variable: translatorNoticeJobForm.php508Drupal\tmgmt\Form\JobForm->checkoutSettingsForm()
Undefined variable: translatorNoticeJobForm.php512Drupal\tmgmt\Form\JobForm->checkoutSettingsForm()
"One job needs to be checked out." foundOtherConfigSourceListTest.php65Drupal\tmgmt_config\Tests\ConfigSourceListTest->testNodeTypeSubmissions()
"Article content type (English to ?, Unprocessed)" foundOtherConfigSourceListTest.php66Drupal\tmgmt_config\Tests\ConfigSourceListTest->testNodeTypeSubmissions()
simplexml_import_dom(): Invalid Nodetype to importsimplexml_import_dom(Object) Drupal\simpletest\WebTestBase->parse() Drupal\simpletest\WebTestBase->drupalPostForm(NULL, Array, Object) Drupal\tmgmt_config\Tests\ConfigSourceListTest->testNodeTypeSubmissions() Drupal\simpletest\TestBase->run(Array) simpletest_script_run_one_test('10', 'Drupal\tmgmt_config\Tests\ConfigSourceListTest') WarningAssertContentTrait.php138Drupal\simpletest\WebTestBase->parse()
Expected 'http://ec2-52-88-182-40.us-west-2.compute.amazonaws.com/checkout/admin/tmgmt/sources/config/node_type' matches current URL (http://ec2-52-88-182-40.us-west-2.compute.amazonaws.com/checkout/admin/tmgmt/jobs/1). Value 'http://ec2-52-88-182-40.us-west-2.compute.amazonaws.com/checkout/admin/tmgmt/jobs/1' is equal to value 'http://ec2-52-88-182-40.us-west-2.compute.amazonaws.com/checkout/admin/tmgmt/sources/config/node_type'.OtherConfigSourceListTest.php72Drupal\tmgmt_config\Tests\ConfigSourceListTest->testNodeTypeSubmissions()
"Test translation created." foundOtherConfigSourceListTest.php74Drupal\tmgmt_config\Tests\ConfigSourceListTest->testNodeTypeSubmissions()
"The translation of Article content type to German is finished and can now be reviewed." foundOtherConfigSourceListTest.php75Drupal\tmgmt_config\Tests\ConfigSourceListTest->testNodeTypeSubmissions()
Undefined variable: translatorNoticeJobForm.php508Drupal\tmgmt\Form\JobForm->checkoutSettingsForm()
Undefined variable: translatorNoticeJobForm.php512Drupal\tmgmt\Form\JobForm->checkoutSettingsForm()
"One job needs to be checked out." foundOtherConfigSourceListTest.php86Drupal\tmgmt_config\Tests\ConfigSourceListTest->testNodeTypeSubmissions()
"Article content type and 1 more (English to ?, Unprocessed)" foundOtherConfigSourceListTest.php87Drupal\tmgmt_config\Tests\ConfigSourceListTest->testNodeTypeSubmissions()
simplexml_import_dom(): Invalid Nodetype to importsimplexml_import_dom(Object) Drupal\simpletest\WebTestBase->parse() Drupal\simpletest\WebTestBase->drupalPostForm(NULL, Array, Object) Drupal\tmgmt_config\Tests\ConfigSourceListTest->testNodeTypeSubmissions() Drupal\simpletest\TestBase->run(Array) simpletest_script_run_one_test('10', 'Drupal\tmgmt_config\Tests\ConfigSourceListTest') WarningAssertContentTrait.php138Drupal\simpletest\WebTestBase->parse()
Expected 'http://ec2-52-88-182-40.us-west-2.compute.amazonaws.com/checkout/admin/tmgmt/sources/config/node_type' matches current URL (http://ec2-52-88-182-40.us-west-2.compute.amazonaws.com/checkout/admin/tmgmt/jobs/2). Value 'http://ec2-52-88-182-40.us-west-2.compute.amazonaws.com/checkout/admin/tmgmt/jobs/2' is equal to value 'http://ec2-52-88-182-40.us-west-2.compute.amazonaws.com/checkout/admin/tmgmt/sources/config/node_type'.OtherConfigSourceListTest.php93Drupal\tmgmt_config\Tests\ConfigSourceListTest->testNodeTypeSubmissions()
"Test translation created." foundOtherConfigSourceListTest.php95Drupal\tmgmt_config\Tests\ConfigSourceListTest->testNodeTypeSubmissions()
"The translation of Article content type to German is finished and can now be reviewed." foundOtherConfigSourceListTest.php96Drupal\tmgmt_config\Tests\ConfigSourceListTest->testNodeTypeSubmissions()
"The translation of Page content type to German is finished and can now be reviewed." foundOtherConfigSourceListTest.php97Drupal\tmgmt_config\Tests\ConfigSourceListTest->testNodeTypeSubmissions()
Call to a member function getPluginId() on a non-objectPHP Fatal errorJobForm.php512Unknown
Call to a member function getPluginId() on a non-objectPHP Fatal errorJobForm.php512Unknown
Undefined variable: translatorNoticeJobForm.php508Drupal\tmgmt\Form\JobForm->checkoutSettingsForm()
Undefined variable: translatorNoticeJobForm.php512Drupal\tmgmt\Form\JobForm->checkoutSettingsForm()
"One job needs to be checked out." foundOtherConfigSourceListTest.php114Drupal\tmgmt_config\Tests\ConfigSourceListTest->testViewTranslation()
"Archive view (English to ?, Unprocessed)" foundOtherConfigSourceListTest.php115Drupal\tmgmt_config\Tests\ConfigSourceListTest->testViewTranslation()
simplexml_import_dom(): Invalid Nodetype to importsimplexml_import_dom(Object) Drupal\simpletest\WebTestBase->parse() Drupal\simpletest\WebTestBase->drupalPostForm(NULL, Array, Object) Drupal\tmgmt_config\Tests\ConfigSourceListTest->testViewTranslation() Drupal\simpletest\TestBase->run(Array) simpletest_script_run_one_test('10', 'Drupal\tmgmt_config\Tests\ConfigSourceListTest') WarningAssertContentTrait.php138Drupal\simpletest\WebTestBase->parse()
Expected 'http://ec2-52-88-182-40.us-west-2.compute.amazonaws.com/checkout/admin/tmgmt/sources/config/view' matches current URL (http://ec2-52-88-182-40.us-west-2.compute.amazonaws.com/checkout/admin/tmgmt/jobs/1). Value 'http://ec2-52-88-182-40.us-west-2.compute.amazonaws.com/checkout/admin/tmgmt/jobs/1' is equal to value 'http://ec2-52-88-182-40.us-west-2.compute.amazonaws.com/checkout/admin/tmgmt/sources/config/view'.OtherConfigSourceListTest.php121Drupal\tmgmt_config\Tests\ConfigSourceListTest->testViewTranslation()
"Test translation created." foundOtherConfigSourceListTest.php123Drupal\tmgmt_config\Tests\ConfigSourceListTest->testViewTranslation()
"The translation of Archive view to German is finished and can now be reviewed." foundOtherConfigSourceListTest.php124Drupal\tmgmt_config\Tests\ConfigSourceListTest->testViewTranslation()
simplexml_import_dom(): Invalid Nodetype to importsimplexml_import_dom(Object) Drupal\simpletest\WebTestBase->parse() Drupal\simpletest\WebTestBase->drupalPostForm(NULL, Array, Object) Drupal\tmgmt_config\Tests\ConfigSourceListTest->testViewTranslation() Drupal\simpletest\TestBase->run(Array) simpletest_script_run_one_test('10', 'Drupal\tmgmt_config\Tests\ConfigSourceListTest') WarningAssertContentTrait.php138Drupal\simpletest\WebTestBase->parse()
"One job needs to be checked out." foundOtherConfigSourceListTest.php137Drupal\tmgmt_config\Tests\ConfigSourceListTest->testViewTranslation()
"Archive view and 3 more (English to ?, Unprocessed)" foundOtherConfigSourceListTest.php138Drupal\tmgmt_config\Tests\ConfigSourceListTest->testViewTranslation()
simplexml_import_dom(): Invalid Nodetype to importsimplexml_import_dom(Object) Drupal\simpletest\WebTestBase->parse() Drupal\simpletest\WebTestBase->drupalPostForm(NULL, Array, Object) Drupal\tmgmt_config\Tests\ConfigSourceListTest->testViewTranslation() Drupal\simpletest\TestBase->run(Array) simpletest_script_run_one_test('10', 'Drupal\tmgmt_config\Tests\ConfigSourceListTest') WarningAssertContentTrait.php138Drupal\simpletest\WebTestBase->parse()
Expected 'http://ec2-52-88-182-40.us-west-2.compute.amazonaws.com/checkout/admin/tmgmt/sources/config/view' matches current URL (http://ec2-52-88-182-40.us-west-2.compute.amazonaws.com/checkout/admin/tmgmt/jobs/1). Value 'http://ec2-52-88-182-40.us-west-2.compute.amazonaws.com/checkout/admin/tmgmt/jobs/1' is equal to value 'http://ec2-52-88-182-40.us-west-2.compute.amazonaws.com/checkout/admin/tmgmt/sources/config/view'.OtherConfigSourceListTest.php144Drupal\tmgmt_config\Tests\ConfigSourceListTest->testViewTranslation()
"Test translation created." foundOtherConfigSourceListTest.php146Drupal\tmgmt_config\Tests\ConfigSourceListTest->testViewTranslation()
"The translation of Archive view to German is finished and can now be reviewed." foundOtherConfigSourceListTest.php147Drupal\tmgmt_config\Tests\ConfigSourceListTest->testViewTranslation()
"The translation of Recent content view to German is finished and can now be reviewed." foundOtherConfigSourceListTest.php148Drupal\tmgmt_config\Tests\ConfigSourceListTest->testViewTranslation()
"The translation of Content view to German is finished and can now be reviewed." foundOtherConfigSourceListTest.php149Drupal\tmgmt_config\Tests\ConfigSourceListTest->testViewTranslation()
"The translation of Job overview view to German is finished and can now be reviewed." foundOtherConfigSourceListTest.php150Drupal\tmgmt_config\Tests\ConfigSourceListTest->testViewTranslation()
simplexml_import_dom(): Invalid Nodetype to importsimplexml_import_dom(Object) Drupal\simpletest\WebTestBase->parse() Drupal\simpletest\WebTestBase->drupalPostForm(NULL, Array, Object) Drupal\tmgmt_config\Tests\ConfigSourceListTest->testViewTranslation() Drupal\simpletest\TestBase->run(Array) simpletest_script_run_one_test('10', 'Drupal\tmgmt_config\Tests\ConfigSourceListTest') WarningAssertContentTrait.php138Drupal\simpletest\WebTestBase->parse()
simplexml_import_dom(): Invalid Nodetype to importsimplexml_import_dom(Object) Drupal\simpletest\WebTestBase->parse() Drupal\simpletest\WebTestBase->xpath('//a[normalize-space()=:label]', Array) Drupal\simpletest\WebTestBase->clickLinkHelper('cart', 0, '//a[normalize-space()=:label]') Drupal\simpletest\WebTestBase->clickLink('cart') Drupal\tmgmt_config\Tests\ConfigSourceListTest->testViewTranslation() Drupal\simpletest\TestBase->run(Array) simpletest_script_run_one_test('10', 'Drupal\tmgmt_config\Tests\ConfigSourceListTest') WarningAssertContentTrait.php138Drupal\simpletest\WebTestBase->parse()
Link cart does not exist on http://ec2-52-88-182-40.us-west-2.compute.amazonaws.com/checkout/admin/tmgmt/jobs/1BrowserConfigSourceListTest.php157Drupal\tmgmt_config\Tests\ConfigSourceListTest->testViewTranslation()
simplexml_import_dom(): Invalid Nodetype to importsimplexml_import_dom(Object) Drupal\simpletest\WebTestBase->parse() Drupal\simpletest\WebTestBase->xpath('//ul[@class="tabs primary"]/li[@class="is-active"]') Drupal\tmgmt_config\Tests\ConfigSourceListTest->testViewTranslation() Drupal\simpletest\TestBase->run(Array) simpletest_script_run_one_test('10', 'Drupal\tmgmt_config\Tests\ConfigSourceListTest') WarningAssertContentTrait.php138Drupal\simpletest\WebTestBase->parse()
Trying to get property of non-objectDrupal\tmgmt_config\Tests\ConfigSourceListTest->testViewTranslation() Drupal\simpletest\TestBase->run(Array) simpletest_script_run_one_test('10', 'Drupal\tmgmt_config\Tests\ConfigSourceListTest') NoticeConfigSourceListTest.php160Drupal\tmgmt_config\Tests\ConfigSourceListTest->testViewTranslation()
Value '' is equal to value 'Cart'.OtherConfigSourceListTest.php161Drupal\tmgmt_config\Tests\ConfigSourceListTest->testViewTranslation()
No title element found on the page.OtherConfigSourceListTest.php162Drupal\tmgmt_config\Tests\ConfigSourceListTest->testViewTranslation()
"Request translation" foundOtherConfigSourceListTest.php163Drupal\tmgmt_config\Tests\ConfigSourceListTest->testViewTranslation()
Call to a member function getPluginId() on a non-objectPHP Fatal errorJobForm.php512Unknown
Undefined variable: translatorNoticeJobForm.php508Drupal\tmgmt\Form\JobForm->checkoutSettingsForm()
Undefined variable: translatorNoticeJobForm.php512Drupal\tmgmt\Form\JobForm->checkoutSettingsForm()
"One job needs to be checked out." foundOtherConfigSourceListTest.php244Drupal\tmgmt_config\Tests\ConfigSourceListTest->testSimpleConfigTranslation()
"System information (English to ?, Unprocessed)" foundOtherConfigSourceListTest.php245Drupal\tmgmt_config\Tests\ConfigSourceListTest->testSimpleConfigTranslation()
simplexml_import_dom(): Invalid Nodetype to importsimplexml_import_dom(Object) Drupal\simpletest\WebTestBase->parse() Drupal\simpletest\WebTestBase->drupalPostForm(NULL, Array, Object) Drupal\tmgmt_config\Tests\ConfigSourceListTest->testSimpleConfigTranslation() Drupal\simpletest\TestBase->run(Array) simpletest_script_run_one_test('10', 'Drupal\tmgmt_config\Tests\ConfigSourceListTest') WarningAssertContentTrait.php138Drupal\simpletest\WebTestBase->parse()
Expected 'http://ec2-52-88-182-40.us-west-2.compute.amazonaws.com/checkout/admin/tmgmt/sources/config/_simple_config' matches current URL (http://ec2-52-88-182-40.us-west-2.compute.amazonaws.com/checkout/admin/tmgmt/jobs/1). Value 'http://ec2-52-88-182-40.us-west-2.compute.amazonaws.com/checkout/admin/tmgmt/jobs/1' is equal to value 'http://ec2-52-88-182-40.us-west-2.compute.amazonaws.com/checkout/admin/tmgmt/sources/config/_simple_config'.OtherConfigSourceListTest.php251Drupal\tmgmt_config\Tests\ConfigSourceListTest->testSimpleConfigTranslation()
Raw "href="/checkout/admin/tmgmt/items/1?destination=admin/tmgmt/sources/config/_simple_config" title="Active job item: Needs review"" foundOtherConfigSourceListTest.php257Drupal\tmgmt_config\Tests\ConfigSourceListTest->testSimpleConfigTranslation()
"Test translation created." foundOtherConfigSourceListTest.php259Drupal\tmgmt_config\Tests\ConfigSourceListTest->testSimpleConfigTranslation()
"The translation of System information to German is finished and can now be reviewed." foundOtherConfigSourceListTest.php260Drupal\tmgmt_config\Tests\ConfigSourceListTest->testSimpleConfigTranslation()
simplexml_import_dom(): Invalid Nodetype to importsimplexml_import_dom(Object) Drupal\simpletest\WebTestBase->parse() Drupal\simpletest\WebTestBase->xpath('//table[@id="edit-items"]/tbody/tr[@class="even"][1]/td[@class="langstatus-de"]/a/@href') Drupal\tmgmt_config\Tests\ConfigSourceListTest->testSimpleConfigTranslation() Drupal\simpletest\TestBase->run(Array) simpletest_script_run_one_test('10', 'Drupal\tmgmt_config\Tests\ConfigSourceListTest') WarningAssertContentTrait.php138Drupal\simpletest\WebTestBase->parse()
Found the Save buttonOtherConfigSourceListTest.php266Drupal\tmgmt_config\Tests\ConfigSourceListTest->testSimpleConfigTranslation()
Found the requested form fields at OtherConfigSourceListTest.php266Drupal\tmgmt_config\Tests\ConfigSourceListTest->testSimpleConfigTranslation()
Failed to set field items[entity.user.admin_form] to 1OtherConfigSourceListTest.php272Drupal\tmgmt_config\Tests\ConfigSourceListTest->testSimpleConfigTranslation()
Found the Request translation buttonOtherConfigSourceListTest.php272Drupal\tmgmt_config\Tests\ConfigSourceListTest->testSimpleConfigTranslation()
Found the requested form fields at OtherConfigSourceListTest.php272Drupal\tmgmt_config\Tests\ConfigSourceListTest->testSimpleConfigTranslation()
"Account settings (English to ?, Unprocessed)" foundOtherConfigSourceListTest.php276Drupal\tmgmt_config\Tests\ConfigSourceListTest->testSimpleConfigTranslation()
Found the Submit to translator buttonOtherConfigSourceListTest.php277Drupal\tmgmt_config\Tests\ConfigSourceListTest->testSimpleConfigTranslation()
Found the requested form fields at OtherConfigSourceListTest.php277Drupal\tmgmt_config\Tests\ConfigSourceListTest->testSimpleConfigTranslation()
Expected 'http://ec2-52-88-182-40.us-west-2.compute.amazonaws.com/checkout/admin/tmgmt/sources/config/_simple_config' matches current URL (http://ec2-52-88-182-40.us-west-2.compute.amazonaws.com/checkout/user/4). Value 'http://ec2-52-88-182-40.us-west-2.compute.amazonaws.com/checkout/user/4' is equal to value 'http://ec2-52-88-182-40.us-west-2.compute.amazonaws.com/checkout/admin/tmgmt/sources/config/_simple_config'.OtherConfigSourceListTest.php280Drupal\tmgmt_config\Tests\ConfigSourceListTest->testSimpleConfigTranslation()
Value 0 is equal to value 2.OtherConfigSourceListTest.php288Drupal\tmgmt_config\Tests\ConfigSourceListTest->testSimpleConfigTranslation()
Found the Save as completed buttonOtherConfigSourceListTest.php291Drupal\tmgmt_config\Tests\ConfigSourceListTest->testSimpleConfigTranslation()
Found the requested form fields at admin/tmgmt/items/1OtherConfigSourceListTest.php291Drupal\tmgmt_config\Tests\ConfigSourceListTest->testSimpleConfigTranslation()
Call to a member function getPluginId() on a non-objectPHP Fatal errorJobForm.php512Unknown
ExpandDrupal\tmgmt_config\Tests\ConfigSourceUiTest1734532
MessageGroupFilenameLineFunctionStatus
Undefined variable: translatorNoticeJobForm.php508Drupal\tmgmt\Form\JobForm->checkoutSettingsForm()
Undefined variable: translatorNoticeJobForm.php512Drupal\tmgmt\Form\JobForm->checkoutSettingsForm()
"One job needs to be checked out." foundOtherConfigSourceUiTest.php69Drupal\tmgmt_config\Tests\ConfigSourceUiTest->testNodeTypeTranslateTabSingleCheckout()
"Article content type (English to German, Unprocessed)" foundOtherConfigSourceUiTest.php70Drupal\tmgmt_config\Tests\ConfigSourceUiTest->testNodeTypeTranslateTabSingleCheckout()
simplexml_import_dom(): Invalid Nodetype to importsimplexml_import_dom(Object) Drupal\simpletest\WebTestBase->parse() Drupal\simpletest\WebTestBase->drupalPostForm(NULL, Array, Object) Drupal\tmgmt_config\Tests\ConfigSourceUiTest->testNodeTypeTranslateTabSingleCheckout() Drupal\simpletest\TestBase->run(Array) simpletest_script_run_one_test('9', 'Drupal\tmgmt_config\Tests\ConfigSourceUiTest') WarningAssertContentTrait.php138Drupal\simpletest\WebTestBase->parse()
Expected 'http://ec2-52-88-182-40.us-west-2.compute.amazonaws.com/checkout/admin/structure/types/manage/article/translate' matches current URL (http://ec2-52-88-182-40.us-west-2.compute.amazonaws.com/checkout/admin/tmgmt/jobs/1). Value 'http://ec2-52-88-182-40.us-west-2.compute.amazonaws.com/checkout/admin/tmgmt/jobs/1' is equal to value 'http://ec2-52-88-182-40.us-west-2.compute.amazonaws.com/checkout/admin/structure/types/manage/article/translate'.OtherConfigSourceUiTest.php76Drupal\tmgmt_config\Tests\ConfigSourceUiTest->testNodeTypeTranslateTabSingleCheckout()
Link Needs review does not exist on http://ec2-52-88-182-40.us-west-2.compute.amazonaws.com/checkout/admin/structure/types/manage/article/translateBrowserConfigSourceUiTest.php90Drupal\tmgmt_config\Tests\ConfigSourceUiTest->testNodeTypeTranslateTabSingleCheckout()
Found the Save as completed buttonOtherConfigSourceUiTest.php91Drupal\tmgmt_config\Tests\ConfigSourceUiTest->testNodeTypeTranslateTabSingleCheckout()
Found the requested form fields at OtherConfigSourceUiTest.php91Drupal\tmgmt_config\Tests\ConfigSourceUiTest->testNodeTypeTranslateTabSingleCheckout()
Undefined variable: translatorNoticeJobForm.php508Drupal\tmgmt\Form\JobForm->checkoutSettingsForm()
Undefined variable: translatorNoticeJobForm.php512Drupal\tmgmt\Form\JobForm->checkoutSettingsForm()
"One job needs to be checked out." foundOtherConfigSourceUiTest.php100Drupal\tmgmt_config\Tests\ConfigSourceUiTest->testNodeTypeTranslateTabSingleCheckout()
"Article content type (English to Spanish, Unprocessed)" foundOtherConfigSourceUiTest.php101Drupal\tmgmt_config\Tests\ConfigSourceUiTest->testNodeTypeTranslateTabSingleCheckout()
simplexml_import_dom(): Invalid Nodetype to importsimplexml_import_dom(Object) Drupal\simpletest\WebTestBase->parse() Drupal\simpletest\WebTestBase->drupalPostForm(NULL, Array, Object) Drupal\tmgmt_config\Tests\ConfigSourceUiTest->testNodeTypeTranslateTabSingleCheckout() Drupal\simpletest\TestBase->run(Array) simpletest_script_run_one_test('9', 'Drupal\tmgmt_config\Tests\ConfigSourceUiTest') WarningAssertContentTrait.php138Drupal\simpletest\WebTestBase->parse()
Expected 'http://ec2-52-88-182-40.us-west-2.compute.amazonaws.com/checkout/admin/structure/types/manage/article/translate' matches current URL (http://ec2-52-88-182-40.us-west-2.compute.amazonaws.com/checkout/admin/tmgmt/jobs/2). Value 'http://ec2-52-88-182-40.us-west-2.compute.amazonaws.com/checkout/admin/tmgmt/jobs/2' is equal to value 'http://ec2-52-88-182-40.us-west-2.compute.amazonaws.com/checkout/admin/structure/types/manage/article/translate'.OtherConfigSourceUiTest.php105Drupal\tmgmt_config\Tests\ConfigSourceUiTest->testNodeTypeTranslateTabSingleCheckout()
simplexml_import_dom(): Invalid Nodetype to importsimplexml_import_dom(Object) Drupal\simpletest\WebTestBase->parse() Drupal\simpletest\WebTestBase->xpath('//tbody/tr') Drupal\tmgmt_config\Tests\ConfigSourceUiTest->testNodeTypeTranslateTabSingleCheckout() Drupal\simpletest\TestBase->run(Array) simpletest_script_run_one_test('9', 'Drupal\tmgmt_config\Tests\ConfigSourceUiTest') WarningAssertContentTrait.php138Drupal\simpletest\WebTestBase->parse()
Invalid argument supplied for foreach()Drupal\tmgmt_config\Tests\ConfigSourceUiTest->testNodeTypeTranslateTabSingleCheckout() Drupal\simpletest\TestBase->run(Array) simpletest_script_run_one_test('9', 'Drupal\tmgmt_config\Tests\ConfigSourceUiTest') WarningConfigSourceUiTest.php110Drupal\tmgmt_config\Tests\ConfigSourceUiTest->testNodeTypeTranslateTabSingleCheckout()
Value 0 is equal to value 2.OtherConfigSourceUiTest.php116Drupal\tmgmt_config\Tests\ConfigSourceUiTest->testNodeTypeTranslateTabSingleCheckout()
Call to a member function getPluginId() on a non-objectPHP Fatal errorJobForm.php512Unknown
Call to a member function getPluginId() on a non-objectPHP Fatal errorJobForm.php512Unknown
Undefined variable: translatorNoticeJobForm.php508Drupal\tmgmt\Form\JobForm->checkoutSettingsForm()
Undefined variable: translatorNoticeJobForm.php512Drupal\tmgmt\Form\JobForm->checkoutSettingsForm()
"2 jobs need to be checked out." foundOtherConfigSourceUiTest.php146Drupal\tmgmt_config\Tests\ConfigSourceUiTest->testNodeTypeTranslateTabMultipeCheckout()
"Article content type (English to German, Unprocessed)" foundOtherConfigSourceUiTest.php149Drupal\tmgmt_config\Tests\ConfigSourceUiTest->testNodeTypeTranslateTabMultipeCheckout()
simplexml_import_dom(): Invalid Nodetype to importsimplexml_import_dom(Object) Drupal\simpletest\WebTestBase->parse() Drupal\simpletest\WebTestBase->drupalPostForm(NULL, Array, Object) Drupal\tmgmt_config\Tests\ConfigSourceUiTest->testNodeTypeTranslateTabMultipeCheckout() Drupal\simpletest\TestBase->run(Array) simpletest_script_run_one_test('9', 'Drupal\tmgmt_config\Tests\ConfigSourceUiTest') WarningAssertContentTrait.php138Drupal\simpletest\WebTestBase->parse()
"Article content type (English to Spanish, Unprocessed)" foundOtherConfigSourceUiTest.php151Drupal\tmgmt_config\Tests\ConfigSourceUiTest->testNodeTypeTranslateTabMultipeCheckout()
simplexml_import_dom(): Invalid Nodetype to importsimplexml_import_dom(Object) Drupal\simpletest\WebTestBase->parse() Drupal\simpletest\WebTestBase->drupalPostForm(NULL, Array, Object) Drupal\tmgmt_config\Tests\ConfigSourceUiTest->testNodeTypeTranslateTabMultipeCheckout() Drupal\simpletest\TestBase->run(Array) simpletest_script_run_one_test('9', 'Drupal\tmgmt_config\Tests\ConfigSourceUiTest') WarningAssertContentTrait.php138Drupal\simpletest\WebTestBase->parse()
Expected 'http://ec2-52-88-182-40.us-west-2.compute.amazonaws.com/checkout/admin/structure/types/manage/article/translate' matches current URL (http://ec2-52-88-182-40.us-west-2.compute.amazonaws.com/checkout/admin/tmgmt/jobs/1). Value 'http://ec2-52-88-182-40.us-west-2.compute.amazonaws.com/checkout/admin/tmgmt/jobs/1' is equal to value 'http://ec2-52-88-182-40.us-west-2.compute.amazonaws.com/checkout/admin/structure/types/manage/article/translate'.OtherConfigSourceUiTest.php155Drupal\tmgmt_config\Tests\ConfigSourceUiTest->testNodeTypeTranslateTabMultipeCheckout()
"Test translation created." foundOtherConfigSourceUiTest.php156Drupal\tmgmt_config\Tests\ConfigSourceUiTest->testNodeTypeTranslateTabMultipeCheckout()
simplexml_import_dom(): Invalid Nodetype to importsimplexml_import_dom(Object) Drupal\simpletest\WebTestBase->parse() Drupal\simpletest\WebTestBase->xpath('//tbody/tr') Drupal\tmgmt_config\Tests\ConfigSourceUiTest->testNodeTypeTranslateTabMultipeCheckout() Drupal\simpletest\TestBase->run(Array) simpletest_script_run_one_test('9', 'Drupal\tmgmt_config\Tests\ConfigSourceUiTest') WarningAssertContentTrait.php138Drupal\simpletest\WebTestBase->parse()
Invalid argument supplied for foreach()Drupal\tmgmt_config\Tests\ConfigSourceUiTest->testNodeTypeTranslateTabMultipeCheckout() Drupal\simpletest\TestBase->run(Array) simpletest_script_run_one_test('9', 'Drupal\tmgmt_config\Tests\ConfigSourceUiTest') WarningConfigSourceUiTest.php165Drupal\tmgmt_config\Tests\ConfigSourceUiTest->testNodeTypeTranslateTabMultipeCheckout()
Value 0 is equal to value 2.OtherConfigSourceUiTest.php171Drupal\tmgmt_config\Tests\ConfigSourceUiTest->testNodeTypeTranslateTabMultipeCheckout()
Call to a member function getPluginId() on a non-objectPHP Fatal errorJobForm.php512Unknown
Undefined variable: translatorNoticeJobForm.php508Drupal\tmgmt\Form\JobForm->checkoutSettingsForm()
Undefined variable: translatorNoticeJobForm.php512Drupal\tmgmt\Form\JobForm->checkoutSettingsForm()
"One job needs to be checked out." foundOtherConfigSourceUiTest.php194Drupal\tmgmt_config\Tests\ConfigSourceUiTest->testViewTranslateTabSingleCheckout()
"Content view (English to German, Unprocessed)" foundOtherConfigSourceUiTest.php195Drupal\tmgmt_config\Tests\ConfigSourceUiTest->testViewTranslateTabSingleCheckout()
simplexml_import_dom(): Invalid Nodetype to importsimplexml_import_dom(Object) Drupal\simpletest\WebTestBase->parse() Drupal\simpletest\WebTestBase->drupalPostForm(NULL, Array, Object) Drupal\tmgmt_config\Tests\ConfigSourceUiTest->testViewTranslateTabSingleCheckout() Drupal\simpletest\TestBase->run(Array) simpletest_script_run_one_test('9', 'Drupal\tmgmt_config\Tests\ConfigSourceUiTest') WarningAssertContentTrait.php138Drupal\simpletest\WebTestBase->parse()
Expected 'http://ec2-52-88-182-40.us-west-2.compute.amazonaws.com/checkout/admin/structure/views/view/content/translate' matches current URL (http://ec2-52-88-182-40.us-west-2.compute.amazonaws.com/checkout/admin/tmgmt/jobs/1). Value 'http://ec2-52-88-182-40.us-west-2.compute.amazonaws.com/checkout/admin/tmgmt/jobs/1' is equal to value 'http://ec2-52-88-182-40.us-west-2.compute.amazonaws.com/checkout/admin/structure/views/view/content/translate'.OtherConfigSourceUiTest.php201Drupal\tmgmt_config\Tests\ConfigSourceUiTest->testViewTranslateTabSingleCheckout()
Link Needs review does not exist on http://ec2-52-88-182-40.us-west-2.compute.amazonaws.com/checkout/admin/structure/views/view/content/translateBrowserConfigSourceUiTest.php215Drupal\tmgmt_config\Tests\ConfigSourceUiTest->testViewTranslateTabSingleCheckout()
Found the Save as completed buttonOtherConfigSourceUiTest.php216Drupal\tmgmt_config\Tests\ConfigSourceUiTest->testViewTranslateTabSingleCheckout()
Found the requested form fields at OtherConfigSourceUiTest.php216Drupal\tmgmt_config\Tests\ConfigSourceUiTest->testViewTranslateTabSingleCheckout()
Undefined variable: translatorNoticeJobForm.php508Drupal\tmgmt\Form\JobForm->checkoutSettingsForm()
Undefined variable: translatorNoticeJobForm.php512Drupal\tmgmt\Form\JobForm->checkoutSettingsForm()
"One job needs to be checked out." foundOtherConfigSourceUiTest.php225Drupal\tmgmt_config\Tests\ConfigSourceUiTest->testViewTranslateTabSingleCheckout()
"Content view (English to Spanish, Unprocessed)" foundOtherConfigSourceUiTest.php226Drupal\tmgmt_config\Tests\ConfigSourceUiTest->testViewTranslateTabSingleCheckout()
simplexml_import_dom(): Invalid Nodetype to importsimplexml_import_dom(Object) Drupal\simpletest\WebTestBase->parse() Drupal\simpletest\WebTestBase->drupalPostForm(NULL, Array, Object) Drupal\tmgmt_config\Tests\ConfigSourceUiTest->testViewTranslateTabSingleCheckout() Drupal\simpletest\TestBase->run(Array) simpletest_script_run_one_test('9', 'Drupal\tmgmt_config\Tests\ConfigSourceUiTest') WarningAssertContentTrait.php138Drupal\simpletest\WebTestBase->parse()
Expected 'http://ec2-52-88-182-40.us-west-2.compute.amazonaws.com/checkout/admin/structure/views/view/content/translate' matches current URL (http://ec2-52-88-182-40.us-west-2.compute.amazonaws.com/checkout/admin/tmgmt/jobs/2). Value 'http://ec2-52-88-182-40.us-west-2.compute.amazonaws.com/checkout/admin/tmgmt/jobs/2' is equal to value 'http://ec2-52-88-182-40.us-west-2.compute.amazonaws.com/checkout/admin/structure/views/view/content/translate'.OtherConfigSourceUiTest.php230Drupal\tmgmt_config\Tests\ConfigSourceUiTest->testViewTranslateTabSingleCheckout()
simplexml_import_dom(): Invalid Nodetype to importsimplexml_import_dom(Object) Drupal\simpletest\WebTestBase->parse() Drupal\simpletest\WebTestBase->xpath('//tbody/tr') Drupal\tmgmt_config\Tests\ConfigSourceUiTest->testViewTranslateTabSingleCheckout() Drupal\simpletest\TestBase->run(Array) simpletest_script_run_one_test('9', 'Drupal\tmgmt_config\Tests\ConfigSourceUiTest') WarningAssertContentTrait.php138Drupal\simpletest\WebTestBase->parse()
Invalid argument supplied for foreach()Drupal\tmgmt_config\Tests\ConfigSourceUiTest->testViewTranslateTabSingleCheckout() Drupal\simpletest\TestBase->run(Array) simpletest_script_run_one_test('9', 'Drupal\tmgmt_config\Tests\ConfigSourceUiTest') WarningConfigSourceUiTest.php235Drupal\tmgmt_config\Tests\ConfigSourceUiTest->testViewTranslateTabSingleCheckout()
Value 0 is equal to value 2.OtherConfigSourceUiTest.php241Drupal\tmgmt_config\Tests\ConfigSourceUiTest->testViewTranslateTabSingleCheckout()
simplexml_import_dom(): Invalid Nodetype to importsimplexml_import_dom(Object) Drupal\simpletest\WebTestBase->parse() Drupal\simpletest\WebTestBase->xpath('//a[normalize-space()=:label]', Array) Drupal\simpletest\WebTestBase->clickLinkHelper(Object, 0, '//a[normalize-space()=:label]') Drupal\simpletest\WebTestBase->clickLink(Object) Drupal\tmgmt_config\Tests\ConfigSourceUiTest->testViewTranslateTabSingleCheckout() Drupal\simpletest\TestBase->run(Array) simpletest_script_run_one_test('9', 'Drupal\tmgmt_config\Tests\ConfigSourceUiTest') WarningAssertContentTrait.php138Drupal\simpletest\WebTestBase->parse()
Link Needs review does not exist on http://ec2-52-88-182-40.us-west-2.compute.amazonaws.com/checkout/admin/tmgmt/jobs/2BrowserConfigSourceUiTest.php244Drupal\tmgmt_config\Tests\ConfigSourceUiTest->testViewTranslateTabSingleCheckout()
simplexml_import_dom(): Invalid Nodetype to importsimplexml_import_dom(Object) Drupal\simpletest\WebTestBase->parse() Drupal\simpletest\WebTestBase->drupalPostForm(NULL, Array, Object) Drupal\tmgmt_config\Tests\ConfigSourceUiTest->testViewTranslateTabSingleCheckout() Drupal\simpletest\TestBase->run(Array) simpletest_script_run_one_test('9', 'Drupal\tmgmt_config\Tests\ConfigSourceUiTest') WarningAssertContentTrait.php138Drupal\simpletest\WebTestBase->parse()
"content of type view does not exist, the job can not be completed." foundOtherConfigSourceUiTest.php251Drupal\tmgmt_config\Tests\ConfigSourceUiTest->testViewTranslateTabSingleCheckout()
Call to a member function getPluginId() on a non-objectPHP Fatal errorJobForm.php512Unknown
Call to a member function getPluginId() on a non-objectPHP Fatal errorJobForm.php512Unknown
Undefined variable: translatorNoticeJobForm.php508Drupal\tmgmt\Form\JobForm->checkoutSettingsForm()
Undefined variable: translatorNoticeJobForm.php512Drupal\tmgmt\Form\JobForm->checkoutSettingsForm()
"One job needs to be checked out." foundOtherConfigSourceUiTest.php294Drupal\tmgmt_config\Tests\ConfigSourceUiTest->testSimpleConfiguration()
"System information (English to German, Unprocessed)" foundOtherConfigSourceUiTest.php295Drupal\tmgmt_config\Tests\ConfigSourceUiTest->testSimpleConfiguration()
simplexml_import_dom(): Invalid Nodetype to importsimplexml_import_dom(Object) Drupal\simpletest\WebTestBase->parse() Drupal\simpletest\WebTestBase->drupalPostForm(NULL, Array, Object) Drupal\tmgmt_config\Tests\ConfigSourceUiTest->testSimpleConfiguration() Drupal\simpletest\TestBase->run(Array) simpletest_script_run_one_test('9', 'Drupal\tmgmt_config\Tests\ConfigSourceUiTest') WarningAssertContentTrait.php138Drupal\simpletest\WebTestBase->parse()
Expected 'http://ec2-52-88-182-40.us-west-2.compute.amazonaws.com/checkout/admin/config/system/site-information/translate' matches current URL (http://ec2-52-88-182-40.us-west-2.compute.amazonaws.com/checkout/admin/tmgmt/jobs/1). Value 'http://ec2-52-88-182-40.us-west-2.compute.amazonaws.com/checkout/admin/tmgmt/jobs/1' is equal to value 'http://ec2-52-88-182-40.us-west-2.compute.amazonaws.com/checkout/admin/config/system/site-information/translate'.OtherConfigSourceUiTest.php301Drupal\tmgmt_config\Tests\ConfigSourceUiTest->testSimpleConfiguration()
Link Needs review does not exist on http://ec2-52-88-182-40.us-west-2.compute.amazonaws.com/checkout/admin/config/system/site-information/translateBrowserConfigSourceUiTest.php315Drupal\tmgmt_config\Tests\ConfigSourceUiTest->testSimpleConfiguration()
Found the Save buttonOtherConfigSourceUiTest.php316Drupal\tmgmt_config\Tests\ConfigSourceUiTest->testSimpleConfiguration()
Found the requested form fields at OtherConfigSourceUiTest.php316Drupal\tmgmt_config\Tests\ConfigSourceUiTest->testSimpleConfiguration()
Undefined variable: translatorNoticeJobForm.php508Drupal\tmgmt\Form\JobForm->checkoutSettingsForm()
Undefined variable: translatorNoticeJobForm.php512Drupal\tmgmt\Form\JobForm->checkoutSettingsForm()
"One job needs to be checked out." foundOtherConfigSourceUiTest.php325Drupal\tmgmt_config\Tests\ConfigSourceUiTest->testSimpleConfiguration()
"System information (English to Spanish, Unprocessed)" foundOtherConfigSourceUiTest.php326Drupal\tmgmt_config\Tests\ConfigSourceUiTest->testSimpleConfiguration()
simplexml_import_dom(): Invalid Nodetype to importsimplexml_import_dom(Object) Drupal\simpletest\WebTestBase->parse() Drupal\simpletest\WebTestBase->drupalPostForm(NULL, Array, Object) Drupal\tmgmt_config\Tests\ConfigSourceUiTest->testSimpleConfiguration() Drupal\simpletest\TestBase->run(Array) simpletest_script_run_one_test('9', 'Drupal\tmgmt_config\Tests\ConfigSourceUiTest') WarningAssertContentTrait.php138Drupal\simpletest\WebTestBase->parse()
Expected 'http://ec2-52-88-182-40.us-west-2.compute.amazonaws.com/checkout/admin/config/system/site-information/translate' matches current URL (http://ec2-52-88-182-40.us-west-2.compute.amazonaws.com/checkout/admin/tmgmt/jobs/2). Value 'http://ec2-52-88-182-40.us-west-2.compute.amazonaws.com/checkout/admin/tmgmt/jobs/2' is equal to value 'http://ec2-52-88-182-40.us-west-2.compute.amazonaws.com/checkout/admin/config/system/site-information/translate'.OtherConfigSourceUiTest.php330Drupal\tmgmt_config\Tests\ConfigSourceUiTest->testSimpleConfiguration()
simplexml_import_dom(): Invalid Nodetype to importsimplexml_import_dom(Object) Drupal\simpletest\WebTestBase->parse() Drupal\simpletest\WebTestBase->xpath('//tbody/tr') Drupal\tmgmt_config\Tests\ConfigSourceUiTest->testSimpleConfiguration() Drupal\simpletest\TestBase->run(Array) simpletest_script_run_one_test('9', 'Drupal\tmgmt_config\Tests\ConfigSourceUiTest') WarningAssertContentTrait.php138Drupal\simpletest\WebTestBase->parse()
Invalid argument supplied for foreach()Drupal\tmgmt_config\Tests\ConfigSourceUiTest->testSimpleConfiguration() Drupal\simpletest\TestBase->run(Array) simpletest_script_run_one_test('9', 'Drupal\tmgmt_config\Tests\ConfigSourceUiTest') WarningConfigSourceUiTest.php335Drupal\tmgmt_config\Tests\ConfigSourceUiTest->testSimpleConfiguration()
Value 0 is equal to value 2.OtherConfigSourceUiTest.php341Drupal\tmgmt_config\Tests\ConfigSourceUiTest->testSimpleConfiguration()
Call to a member function getPluginId() on a non-objectPHP Fatal errorJobForm.php512Unknown
Call to a member function getPluginId() on a non-objectPHP Fatal errorJobForm.php512Unknown
ExpandDrupal\tmgmt_content\Tests\ContentEntitySourceListTest16103
MessageGroupFilenameLineFunctionStatus
Undefined variable: translatorNoticeJobForm.php508Drupal\tmgmt\Form\JobForm->checkoutSettingsForm()
Undefined variable: translatorNoticeJobForm.php508Drupal\tmgmt\Form\JobForm->checkoutSettingsForm()
Undefined variable: translatorNoticeJobForm.php508Drupal\tmgmt\Form\JobForm->checkoutSettingsForm()
ExpandDrupal\tmgmt_content\Tests\ContentEntitySourceUiTest2163921
MessageGroupFilenameLineFunctionStatus
Undefined variable: translatorNoticeJobForm.php508Drupal\tmgmt\Form\JobForm->checkoutSettingsForm()
Undefined variable: translatorNoticeJobForm.php512Drupal\tmgmt\Form\JobForm->checkoutSettingsForm()
"One job needs to be checked out." foundOtherContentEntitySourceUiTest.php83Drupal\tmgmt_content\Tests\ContentEntitySourceUiTest->testNodeTranslateTabSingleCheckout()
"vIvzsTnO" foundOtherContentEntitySourceUiTest.php84Drupal\tmgmt_content\Tests\ContentEntitySourceUiTest->testNodeTranslateTabSingleCheckout()
simplexml_import_dom(): Invalid Nodetype to importsimplexml_import_dom(Object) Drupal\simpletest\WebTestBase->parse() Drupal\simpletest\WebTestBase->drupalPostForm(NULL, Array, Object) Drupal\tmgmt_content\Tests\ContentEntitySourceUiTest->testNodeTranslateTabSingleCheckout() Drupal\simpletest\TestBase->run(Array) simpletest_script_run_one_test('4', 'Drupal\tmgmt_content\Tests\ContentEntitySourceUiTest') WarningAssertContentTrait.php138Drupal\simpletest\WebTestBase->parse()
Value 'http://ec2-52-88-182-40.us-west-2.compute.amazonaws.com/checkout/node/1/translations' is equal to value 'http://ec2-52-88-182-40.us-west-2.compute.amazonaws.com/checkout/admin/tmgmt/jobs/1'.OtherContentEntitySourceUiTest.php90Drupal\tmgmt_content\Tests\ContentEntitySourceUiTest->testNodeTranslateTabSingleCheckout()
"Test translation created." foundOtherContentEntitySourceUiTest.php91Drupal\tmgmt_content\Tests\ContentEntitySourceUiTest->testNodeTranslateTabSingleCheckout()
"The translation of vIvzsTnO to German is finished and can now be reviewed." foundOtherContentEntitySourceUiTest.php95Drupal\tmgmt_content\Tests\ContentEntitySourceUiTest->testNodeTranslateTabSingleCheckout()
simplexml_import_dom(): Invalid Nodetype to importsimplexml_import_dom(Object) Drupal\simpletest\WebTestBase->parse() Drupal\simpletest\WebTestBase->xpath('//a[normalize-space()=:label]', Array) Drupal\simpletest\WebTestBase->clickLinkHelper(Object, 0, '//a[normalize-space()=:label]') Drupal\simpletest\WebTestBase->clickLink(Object) Drupal\tmgmt_content\Tests\ContentEntitySourceUiTest->testNodeTranslateTabSingleCheckout() Drupal\simpletest\TestBase->run(Array) simpletest_script_run_one_test('4', 'Drupal\tmgmt_content\Tests\ContentEntitySourceUiTest') WarningAssertContentTrait.php138Drupal\simpletest\WebTestBase->parse()
Link Needs review does not exist on http://ec2-52-88-182-40.us-west-2.compute.amazonaws.com/checkout/admin/tmgmt/jobs/1BrowserContentEntitySourceUiTest.php98Drupal\tmgmt_content\Tests\ContentEntitySourceUiTest->testNodeTranslateTabSingleCheckout()
simplexml_import_dom(): Invalid Nodetype to importsimplexml_import_dom(Object) Drupal\simpletest\WebTestBase->parse() Drupal\simpletest\WebTestBase->drupalPostForm(NULL, Array, Object) Drupal\tmgmt_content\Tests\ContentEntitySourceUiTest->testNodeTranslateTabSingleCheckout() Drupal\simpletest\TestBase->run(Array) simpletest_script_run_one_test('4', 'Drupal\tmgmt_content\Tests\ContentEntitySourceUiTest') WarningAssertContentTrait.php138Drupal\simpletest\WebTestBase->parse()
"The translation for vIvzsTnO has been accepted." foundOtherContentEntitySourceUiTest.php101Drupal\tmgmt_content\Tests\ContentEntitySourceUiTest->testNodeTranslateTabSingleCheckout()
simplexml_import_dom(): Invalid Nodetype to importsimplexml_import_dom(Object) Drupal\simpletest\WebTestBase->parse() Drupal\simpletest\WebTestBase->xpath('//a[normalize-space()=:label]', Array) Drupal\simpletest\WebTestBase->clickLinkHelper('de_vIvzsTnO', 0, '//a[normalize-space()=:label]') Drupal\simpletest\WebTestBase->clickLink('de_vIvzsTnO') Drupal\tmgmt_content\Tests\ContentEntitySourceUiTest->testNodeTranslateTabSingleCheckout() Drupal\simpletest\TestBase->run(Array) simpletest_script_run_one_test('4', 'Drupal\tmgmt_content\Tests\ContentEntitySourceUiTest') WarningAssertContentTrait.php138Drupal\simpletest\WebTestBase->parse()
Link de_vIvzsTnO does not exist on http://ec2-52-88-182-40.us-west-2.compute.amazonaws.com/checkout/admin/tmgmt/jobs/1BrowserContentEntitySourceUiTest.php104Drupal\tmgmt_content\Tests\ContentEntitySourceUiTest->testNodeTranslateTabSingleCheckout()
"de_vIvzsTnO" foundOtherContentEntitySourceUiTest.php105Drupal\tmgmt_content\Tests\ContentEntitySourceUiTest->testNodeTranslateTabSingleCheckout()
"de_hksDDZOLePSQlK4Sxax4" foundOtherContentEntitySourceUiTest.php106Drupal\tmgmt_content\Tests\ContentEntitySourceUiTest->testNodeTranslateTabSingleCheckout()
Undefined variable: translatorNoticeJobForm.php508Drupal\tmgmt\Form\JobForm->checkoutSettingsForm()
Undefined variable: translatorNoticeJobForm.php508Drupal\tmgmt\Form\JobForm->checkoutSettingsForm()
Undefined variable: translatorNoticeJobForm.php512Drupal\tmgmt\Form\JobForm->checkoutSettingsForm()
"One job needs to be checked out." foundOtherContentEntitySourceUiTest.php139Drupal\tmgmt_content\Tests\ContentEntitySourceUiTest->testNodeTranslateTabSingleCheckout()
"vIvzsTnO" foundOtherContentEntitySourceUiTest.php140Drupal\tmgmt_content\Tests\ContentEntitySourceUiTest->testNodeTranslateTabSingleCheckout()
simplexml_import_dom(): Invalid Nodetype to importsimplexml_import_dom(Object) Drupal\simpletest\WebTestBase->parse() Drupal\simpletest\WebTestBase->drupalPostForm(NULL, Array, Object) Drupal\tmgmt_content\Tests\ContentEntitySourceUiTest->testNodeTranslateTabSingleCheckout() Drupal\simpletest\TestBase->run(Array) simpletest_script_run_one_test('4', 'Drupal\tmgmt_content\Tests\ContentEntitySourceUiTest') WarningAssertContentTrait.php138Drupal\simpletest\WebTestBase->parse()
Value 'http://ec2-52-88-182-40.us-west-2.compute.amazonaws.com/checkout/node/1' is equal to value 'http://ec2-52-88-182-40.us-west-2.compute.amazonaws.com/checkout/admin/tmgmt/jobs/3'.OtherContentEntitySourceUiTest.php144Drupal\tmgmt_content\Tests\ContentEntitySourceUiTest->testNodeTranslateTabSingleCheckout()
"vIvzsTnO" not foundOtherContentEntitySourceUiTest.php154Drupal\tmgmt_content\Tests\ContentEntitySourceUiTest->testNodeTranslateTabSingleCheckout()
Drupal\Core\Entity\EntityStorageException: SQLSTATE[23000]: Integrity constraint violation: 1048 Column 'title' cannot be null: INSERT INTO {node_field_data} (nid, vid, type, langcode, title, uid, status, created, changed, promote, sticky, revision_translation_affected, default_langcode, content_translation_source, content_translation_outdated) VALUES (:db_insert_placeholder_0, :db_insert_placeholder_1, :db_insert_placeholder_2, :db_insert_placeholder_3, :db_insert_placeholder_4, :db_insert_placeholder_5, :db_insert_placeholder_6, :db_insert_placeholder_7, :db_insert_placeholder_8, :db_insert_placeholder_9, :db_insert_placeholder_10, :db_insert_placeholder_11, :db_insert_placeholder_12, :db_insert_placeholder_13, :db_insert_placeholder_14), (:db_insert_placeholder_15, :db_insert_placeholder_16, :db_insert_placeholder_17, :db_insert_placeholder_18, :db_insert_placeholder_19, :db_insert_placeholder_20, :db_insert_placeholder_21, :db_insert_placeholder_22, :db_insert_placeholder_23, :db_insert_placeholder_24, :db_insert_placeholder_25, :db_insert_placeholder_26, :db_insert_placeholder_27, :db_insert_placeholder_28, :db_insert_placeholder_29); Array ( [:db_insert_placeholder_0] => 1 [:db_insert_placeholder_1] => 1 [:db_insert_placeholder_2] => page [:db_insert_placeholder_3] => en [:db_insert_placeholder_4] => vIvzsTnO [:db_insert_placeholder_5] => 3 [:db_insert_placeholder_6] => 1 [:db_insert_placeholder_7] => 1443023831 [:db_insert_placeholder_8] => 1443023831 [:db_insert_placeholder_9] => 1 [:db_insert_placeholder_10] => 0 [:db_insert_placeholder_11] => 1 [:db_insert_placeholder_12] => 1 [:db_insert_placeholder_13] => und [:db_insert_placeholder_14] => 0 [:db_insert_placeholder_15] => 1 [:db_insert_placeholder_16] => 1 [:db_insert_placeholder_17] => page [:db_insert_placeholder_18] => de [:db_insert_placeholder_19] => [:db_insert_placeholder_20] => 3 [:db_insert_placeholder_21] => 1 [:db_insert_placeholder_22] => 1443023831 [:db_insert_placeholder_23] => 1443023831 [:db_insert_placeholder_24] => 1 [:db_insert_placeholder_25] => 0 [:db_insert_placeholder_26] => 1 [:db_insert_placeholder_27] => 0 [:db_insert_placeholder_28] => und [:db_insert_placeholder_29] => 1 ) in Drupal\Core\Entity\Sql\SqlContentEntityStorage->save() (line 757 of /var/lib/drupaltestbot/sites/default/files/checkout/core/lib/Drupal/Core/Entity/Sql/SqlContentEntityStorage.php). Drupal\Core\Entity\Sql\SqlContentEntityStorage->save(Object) Drupal\Core\Entity\Entity->save() Drupal\tmgmt_content\Tests\ContentEntitySourceUiTest->testNodeTranslateTabSingleCheckout() Drupal\simpletest\TestBase->run(Array) simpletest_script_run_one_test('4', 'Drupal\tmgmt_content\Tests\ContentEntitySourceUiTest') Uncaught exceptionSqlContentEntityStorage.php757Drupal\Core\Entity\Sql\SqlContentEntityStorage->save()
Call to a member function getPluginId() on a non-objectPHP Fatal errorJobForm.php512Unknown
Call to a member function getPluginId() on a non-objectPHP Fatal errorJobForm.php512Unknown
Undefined variable: translatorNoticeJobForm.php508Drupal\tmgmt\Form\JobForm->checkoutSettingsForm()
Undefined variable: translatorNoticeJobForm.php512Drupal\tmgmt\Form\JobForm->checkoutSettingsForm()
"2 jobs need to be checked out." foundOtherContentEntitySourceUiTest.php226Drupal\tmgmt_content\Tests\ContentEntitySourceUiTest->testNodeTranslateTabMultipeCheckout()
"adJiNBZt" foundOtherContentEntitySourceUiTest.php229Drupal\tmgmt_content\Tests\ContentEntitySourceUiTest->testNodeTranslateTabMultipeCheckout()
simplexml_import_dom(): Invalid Nodetype to importsimplexml_import_dom(Object) Drupal\simpletest\WebTestBase->parse() Drupal\simpletest\WebTestBase->drupalPostForm(NULL, Array, Object) Drupal\tmgmt_content\Tests\ContentEntitySourceUiTest->testNodeTranslateTabMultipeCheckout() Drupal\simpletest\TestBase->run(Array) simpletest_script_run_one_test('4', 'Drupal\tmgmt_content\Tests\ContentEntitySourceUiTest') WarningAssertContentTrait.php138Drupal\simpletest\WebTestBase->parse()
"adJiNBZt" foundOtherContentEntitySourceUiTest.php231Drupal\tmgmt_content\Tests\ContentEntitySourceUiTest->testNodeTranslateTabMultipeCheckout()
simplexml_import_dom(): Invalid Nodetype to importsimplexml_import_dom(Object) Drupal\simpletest\WebTestBase->parse() Drupal\simpletest\WebTestBase->drupalPostForm(NULL, Array, Object) Drupal\tmgmt_content\Tests\ContentEntitySourceUiTest->testNodeTranslateTabMultipeCheckout() Drupal\simpletest\TestBase->run(Array) simpletest_script_run_one_test('4', 'Drupal\tmgmt_content\Tests\ContentEntitySourceUiTest') WarningAssertContentTrait.php138Drupal\simpletest\WebTestBase->parse()
Value 'http://ec2-52-88-182-40.us-west-2.compute.amazonaws.com/checkout/node/1/translations' is equal to value 'http://ec2-52-88-182-40.us-west-2.compute.amazonaws.com/checkout/admin/tmgmt/jobs/1'.OtherContentEntitySourceUiTest.php235Drupal\tmgmt_content\Tests\ContentEntitySourceUiTest->testNodeTranslateTabMultipeCheckout()
"Test translation created." foundOtherContentEntitySourceUiTest.php236Drupal\tmgmt_content\Tests\ContentEntitySourceUiTest->testNodeTranslateTabMultipeCheckout()
"The translation for adJiNBZt has been accepted." foundOtherContentEntitySourceUiTest.php241Drupal\tmgmt_content\Tests\ContentEntitySourceUiTest->testNodeTranslateTabMultipeCheckout()
simplexml_import_dom(): Invalid Nodetype to importsimplexml_import_dom(Object) Drupal\simpletest\WebTestBase->parse() Drupal\simpletest\WebTestBase->xpath('//a[normalize-space()=:label]', Array) Drupal\simpletest\WebTestBase->clickLinkHelper('adJiNBZt', 0, '//a[normalize-space()=:label]') Drupal\simpletest\WebTestBase->clickLink('adJiNBZt') Drupal\tmgmt_content\Tests\ContentEntitySourceUiTest->testNodeTranslateTabMultipeCheckout() Drupal\simpletest\TestBase->run(Array) simpletest_script_run_one_test('4', 'Drupal\tmgmt_content\Tests\ContentEntitySourceUiTest') WarningAssertContentTrait.php138Drupal\simpletest\WebTestBase->parse()
Link adJiNBZt does not exist on http://ec2-52-88-182-40.us-west-2.compute.amazonaws.com/checkout/admin/tmgmt/jobs/1BrowserContentEntitySourceUiTest.php244Drupal\tmgmt_content\Tests\ContentEntitySourceUiTest->testNodeTranslateTabMultipeCheckout()
"de_adJiNBZt" foundOtherContentEntitySourceUiTest.php249Drupal\tmgmt_content\Tests\ContentEntitySourceUiTest->testNodeTranslateTabMultipeCheckout()
"de_meoceKYX6cyWNY3FscxK" foundOtherContentEntitySourceUiTest.php250Drupal\tmgmt_content\Tests\ContentEntitySourceUiTest->testNodeTranslateTabMultipeCheckout()
"es_adJiNBZt" foundOtherContentEntitySourceUiTest.php253Drupal\tmgmt_content\Tests\ContentEntitySourceUiTest->testNodeTranslateTabMultipeCheckout()
"es_meoceKYX6cyWNY3FscxK" foundOtherContentEntitySourceUiTest.php254Drupal\tmgmt_content\Tests\ContentEntitySourceUiTest->testNodeTranslateTabMultipeCheckout()
Call to a member function getPluginId() on a non-objectPHP Fatal errorJobForm.php512Unknown
Undefined variable: translatorNoticeJobForm.php508Drupal\tmgmt\Form\JobForm->checkoutSettingsForm()
Undefined variable: translatorNoticeJobForm.php512Drupal\tmgmt\Form\JobForm->checkoutSettingsForm()
"2 jobs need to be checked out." foundOtherContentEntitySourceUiTest.php324Drupal\tmgmt_content\Tests\ContentEntitySourceUiTest->testCommentTranslateTab()
"uyMdVC0g" foundOtherContentEntitySourceUiTest.php327Drupal\tmgmt_content\Tests\ContentEntitySourceUiTest->testCommentTranslateTab()
simplexml_import_dom(): Invalid Nodetype to importsimplexml_import_dom(Object) Drupal\simpletest\WebTestBase->parse() Drupal\simpletest\WebTestBase->drupalPostForm(NULL, Array, Object) Drupal\tmgmt_content\Tests\ContentEntitySourceUiTest->testCommentTranslateTab() Drupal\simpletest\TestBase->run(Array) simpletest_script_run_one_test('4', 'Drupal\tmgmt_content\Tests\ContentEntitySourceUiTest') WarningAssertContentTrait.php138Drupal\simpletest\WebTestBase->parse()
"uyMdVC0g" foundOtherContentEntitySourceUiTest.php329Drupal\tmgmt_content\Tests\ContentEntitySourceUiTest->testCommentTranslateTab()
simplexml_import_dom(): Invalid Nodetype to importsimplexml_import_dom(Object) Drupal\simpletest\WebTestBase->parse() Drupal\simpletest\WebTestBase->drupalPostForm(NULL, Array, Object) Drupal\tmgmt_content\Tests\ContentEntitySourceUiTest->testCommentTranslateTab() Drupal\simpletest\TestBase->run(Array) simpletest_script_run_one_test('4', 'Drupal\tmgmt_content\Tests\ContentEntitySourceUiTest') WarningAssertContentTrait.php138Drupal\simpletest\WebTestBase->parse()
Expected 'http://ec2-52-88-182-40.us-west-2.compute.amazonaws.com/checkout/comment/1/translations' matches current URL (http://ec2-52-88-182-40.us-west-2.compute.amazonaws.com/checkout/admin/tmgmt/jobs/1). Value 'http://ec2-52-88-182-40.us-west-2.compute.amazonaws.com/checkout/admin/tmgmt/jobs/1' is equal to value 'http://ec2-52-88-182-40.us-west-2.compute.amazonaws.com/checkout/comment/1/translations'.OtherContentEntitySourceUiTest.php333Drupal\tmgmt_content\Tests\ContentEntitySourceUiTest->testCommentTranslateTab()
"Test translation created." foundOtherContentEntitySourceUiTest.php334Drupal\tmgmt_content\Tests\ContentEntitySourceUiTest->testCommentTranslateTab()
"The translation for uyMdVC0g has been accepted." foundOtherContentEntitySourceUiTest.php339Drupal\tmgmt_content\Tests\ContentEntitySourceUiTest->testCommentTranslateTab()
simplexml_import_dom(): Invalid Nodetype to importsimplexml_import_dom(Object) Drupal\simpletest\WebTestBase->parse() Drupal\simpletest\WebTestBase->xpath('//a[normalize-space()=:label]', Array) Drupal\simpletest\WebTestBase->clickLinkHelper('de_uyMdVC0g', 0, '//a[normalize-space()=:label]') Drupal\simpletest\WebTestBase->clickLink('de_uyMdVC0g') Drupal\tmgmt_content\Tests\ContentEntitySourceUiTest->testCommentTranslateTab() Drupal\simpletest\TestBase->run(Array) simpletest_script_run_one_test('4', 'Drupal\tmgmt_content\Tests\ContentEntitySourceUiTest') WarningAssertContentTrait.php138Drupal\simpletest\WebTestBase->parse()
Link de_uyMdVC0g does not exist on http://ec2-52-88-182-40.us-west-2.compute.amazonaws.com/checkout/admin/tmgmt/jobs/1BrowserContentEntitySourceUiTest.php342Drupal\tmgmt_content\Tests\ContentEntitySourceUiTest->testCommentTranslateTab()
"de_pjbkuPq0" foundOtherContentEntitySourceUiTest.php343Drupal\tmgmt_content\Tests\ContentEntitySourceUiTest->testCommentTranslateTab()
Link es_uyMdVC0g does not exist on http://ec2-52-88-182-40.us-west-2.compute.amazonaws.com/checkout/comment/1/translationsBrowserContentEntitySourceUiTest.php347Drupal\tmgmt_content\Tests\ContentEntitySourceUiTest->testCommentTranslateTab()
"es_pjbkuPq0" foundOtherContentEntitySourceUiTest.php349Drupal\tmgmt_content\Tests\ContentEntitySourceUiTest->testCommentTranslateTab()
Call to a member function getPluginId() on a non-objectPHP Fatal errorJobForm.php512Unknown
ExpandDrupal\tmgmt_demo\Tests\TMGMTDemoTest4444
MessageGroupFilenameLineFunctionStatus
Undefined variable: translatorNoticeJobForm.php508Drupal\tmgmt\Form\JobForm->checkoutSettingsForm()
Undefined variable: translatorNoticeJobForm.php512Drupal\tmgmt\Form\JobForm->checkoutSettingsForm()
"2 jobs need to be checked out." foundOtherTMGMTDemoTest.php53Drupal\tmgmt_demo\Tests\TMGMTDemoTest->testInstalled()
Undefined variable: translatorNoticeJobForm.php508Drupal\tmgmt\Form\JobForm->checkoutSettingsForm()
Undefined variable: translatorNoticeJobForm.php512Drupal\tmgmt\Form\JobForm->checkoutSettingsForm()
"2 jobs need to be checked out." foundOtherTMGMTDemoTest.php59Drupal\tmgmt_demo\Tests\TMGMTDemoTest->testInstalled()
Call to a member function getPluginId() on a non-objectPHP Fatal errorJobForm.php512Unknown
Call to a member function getPluginId() on a non-objectPHP Fatal errorJobForm.php512Unknown
ExpandDrupal\tmgmt_locale\Tests\LocaleSourceUiTest39103
MessageGroupFilenameLineFunctionStatus
Undefined variable: translatorNoticeJobForm.php508Drupal\tmgmt\Form\JobForm->checkoutSettingsForm()
Undefined variable: translatorNoticeJobForm.php512Drupal\tmgmt\Form\JobForm->checkoutSettingsForm()
"Hello World" foundOtherLocaleSourceUiTest.php76Drupal\tmgmt_locale\Tests\LocaleSourceUiTest->testOverview()
"Locale" foundOtherLocaleSourceUiTest.php77Drupal\tmgmt_locale\Tests\LocaleSourceUiTest->testOverview()
"2" foundOtherLocaleSourceUiTest.php78Drupal\tmgmt_locale\Tests\LocaleSourceUiTest->testOverview()
simplexml_import_dom(): Invalid Nodetype to importsimplexml_import_dom(Object) Drupal\simpletest\WebTestBase->parse() Drupal\simpletest\WebTestBase->drupalPostForm(NULL, Array, Object) Drupal\tmgmt_locale\Tests\LocaleSourceUiTest->testOverview() Drupal\simpletest\TestBase->run(Array) simpletest_script_run_one_test('6', 'Drupal\tmgmt_locale\Tests\LocaleSourceUiTest') WarningAssertContentTrait.php138Drupal\simpletest\WebTestBase->parse()
Raw "Active job item: Needs review" foundOtherLocaleSourceUiTest.php83Drupal\tmgmt_locale\Tests\LocaleSourceUiTest->testOverview()
Raw "gsw-berne_Hello World" foundOtherLocaleSourceUiTest.php88Drupal\tmgmt_locale\Tests\LocaleSourceUiTest->testOverview()
Found the Save as completed buttonOtherLocaleSourceUiTest.php89Drupal\tmgmt_locale\Tests\LocaleSourceUiTest->testOverview()
Found the requested form fields at OtherLocaleSourceUiTest.php89Drupal\tmgmt_locale\Tests\LocaleSourceUiTest->testOverview()
Value 'Not translated' is equal to value 'Translation up to date'.OtherLocaleSourceUiTest.php97Drupal\tmgmt_locale\Tests\LocaleSourceUiTest->testOverview()
"Hello World" not foundOtherLocaleSourceUiTest.php113Drupal\tmgmt_locale\Tests\LocaleSourceUiTest->testOverview()
Call to a member function getPluginId() on a non-objectPHP Fatal errorJobForm.php512Unknown

All

Test namePassFailException
LeafDrupal\tmgmt\Tests\CrudTest19900
LeafDrupal\tmgmt\Tests\HelperTest4300
LeafDrupal\tmgmt\Tests\LocalTasksTests3100
LeafDrupal\tmgmt\Tests\PluginsTest5000
ExpandDrupal\tmgmt\Tests\TMGMTCartTest4743
MessageGroupFilenameLineFunctionStatus
Undefined variable: translatorNoticeJobForm.php508Drupal\tmgmt\Form\JobForm->checkoutSettingsForm()
Undefined variable: translatorNoticeJobForm.php512Drupal\tmgmt\Form\JobForm->checkoutSettingsForm()
"One job needs to be checked out." foundOtherTMGMTCartTest.php84Drupal\tmgmt\Tests\TMGMTCartTest->testCartEnforceSourceLanguage()
Raw "One item skipped as for the language English it was not possible to retrieve a translation." foundOtherTMGMTCartTest.php85Drupal\tmgmt\Tests\TMGMTCartTest->testCartEnforceSourceLanguage()
"You have enforced the the job source language which most likely resulted in having a translation of your original content as the job source text. You should review the job translation received from the translator carefully to prevent the content quality loss." foundOtherTMGMTCartTest.php86Drupal\tmgmt\Tests\TMGMTCartTest->testCartEnforceSourceLanguage()
simplexml_import_dom(): Invalid Nodetype to importsimplexml_import_dom(Object) Drupal\simpletest\WebTestBase->parse() Drupal\simpletest\WebTestBase->drupalPostForm(NULL, Array, Object) Drupal\tmgmt\Tests\TMGMTCartTest->testCartEnforceSourceLanguage() Drupal\simpletest\TestBase->run(Array) simpletest_script_run_one_test('14', 'Drupal\tmgmt\Tests\TMGMTCartTest') WarningAssertContentTrait.php138Drupal\simpletest\WebTestBase->parse()
Call to a member function getPluginId() on a non-objectPHP Fatal errorJobForm.php512Unknown
ExpandDrupal\tmgmt\Tests\TMGMTUiTest4725754
MessageGroupFilenameLineFunctionStatus
Undefined variable: translatorNoticeJobForm.php508Drupal\tmgmt\Form\JobForm->checkoutSettingsForm()
Undefined variable: translatorNoticeJobForm.php512Drupal\tmgmt\Form\JobForm->checkoutSettingsForm()
"test_source:test:1" foundOtherTMGMTUiTest.php68Drupal\tmgmt\Tests\TMGMTUiTest->testCheckoutForm()
Undefined variable: translatorNoticeJobForm.php508Drupal\tmgmt\Form\JobForm->checkoutSettingsForm()
Undefined variable: translatorNoticeJobForm.php512Drupal\tmgmt\Form\JobForm->checkoutSettingsForm()
"test_source:test:1" foundOtherTMGMTUiTest.php79Drupal\tmgmt\Tests\TMGMTUiTest->testCheckoutForm()
"test_source:test:2" foundOtherTMGMTUiTest.php80Drupal\tmgmt\Tests\TMGMTUiTest->testCheckoutForm()
"test_source:test:3" foundOtherTMGMTUiTest.php81Drupal\tmgmt\Tests\TMGMTUiTest->testCheckoutForm()
simplexml_import_dom(): Invalid Nodetype to importsimplexml_import_dom(Object) Drupal\simpletest\WebTestBase->parse() Drupal\simpletest\WebTestBase->drupalPostForm(NULL, Array, Object) Drupal\tmgmt\Tests\TMGMTUiTest->testCheckoutForm() Drupal\simpletest\TestBase->run(Array) simpletest_script_run_one_test('11', 'Drupal\tmgmt\Tests\TMGMTUiTest') WarningAssertContentTrait.php138Drupal\simpletest\WebTestBase->parse()
"Test translator (auto created) can not translate from English to Greek." foundOtherTMGMTUiTest.php91Drupal\tmgmt\Tests\TMGMTUiTest->testCheckoutForm()
simplexml_import_dom(): Invalid Nodetype to importsimplexml_import_dom(Object) Drupal\simpletest\WebTestBase->parse() Drupal\simpletest\WebTestBase->drupalPostForm(NULL, Array, Object) Drupal\tmgmt\Tests\TMGMTUiTest->testCheckoutForm() Drupal\simpletest\TestBase->run(Array) simpletest_script_run_one_test('11', 'Drupal\tmgmt\Tests\TMGMTUiTest') WarningAssertContentTrait.php138Drupal\simpletest\WebTestBase->parse()
Value false is TRUE.OtherTMGMTUiTest.php105Drupal\tmgmt\Tests\TMGMTUiTest->testCheckoutForm()
Value false is TRUE.OtherTMGMTUiTest.php108Drupal\tmgmt\Tests\TMGMTUiTest->testCheckoutForm()
Value false is TRUE.OtherTMGMTUiTest.php108Drupal\tmgmt\Tests\TMGMTUiTest->testCheckoutForm()
Value false is TRUE.OtherTMGMTUiTest.php108Drupal\tmgmt\Tests\TMGMTUiTest->testCheckoutForm()
"Test translation created" foundOtherTMGMTUiTest.php110Drupal\tmgmt\Tests\TMGMTUiTest->testCheckoutForm()
"Job overview" foundOtherTMGMTUiTest.php114Drupal\tmgmt\Tests\TMGMTUiTest->testCheckoutForm()
Value '1' is not equal to value '1'.OtherTMGMTUiTest.php120Drupal\tmgmt\Tests\TMGMTUiTest->testCheckoutForm()
Undefined variable: translatorNoticeJobForm.php508Drupal\tmgmt\Form\JobForm->checkoutSettingsForm()
Undefined variable: translatorNoticeJobForm.php512Drupal\tmgmt\Form\JobForm->checkoutSettingsForm()
"You can provide a label for this job in order to identify it easily later on." foundOtherTMGMTUiTest.php127Drupal\tmgmt\Tests\TMGMTUiTest->testCheckoutForm()
"test_source:test:1" foundOtherTMGMTUiTest.php128Drupal\tmgmt\Tests\TMGMTUiTest->testCheckoutForm()
simplexml_import_dom(): Invalid Nodetype to importsimplexml_import_dom(Object) Drupal\simpletest\WebTestBase->parse() Drupal\simpletest\WebTestBase->drupalPostForm(NULL, Array, Object) Drupal\tmgmt\Tests\TMGMTUiTest->testCheckoutForm() Drupal\simpletest\TestBase->run(Array) simpletest_script_run_one_test('11', 'Drupal\tmgmt\Tests\TMGMTUiTest') WarningAssertContentTrait.php138Drupal\simpletest\WebTestBase->parse()
"Test submit" foundOtherTMGMTUiTest.php135Drupal\tmgmt\Tests\TMGMTUiTest->testCheckoutForm()
Value false is TRUE.OtherTMGMTUiTest.php137Drupal\tmgmt\Tests\TMGMTUiTest->testCheckoutForm()
Undefined variable: translatorNoticeJobForm.php508Drupal\tmgmt\Form\JobForm->checkoutSettingsForm()
Undefined variable: translatorNoticeJobForm.php512Drupal\tmgmt\Form\JobForm->checkoutSettingsForm()
"You can provide a label for this job in order to identify it easily later on." foundOtherTMGMTUiTest.php148Drupal\tmgmt\Tests\TMGMTUiTest->testCheckoutForm()
"test_source:test:1" foundOtherTMGMTUiTest.php149Drupal\tmgmt\Tests\TMGMTUiTest->testCheckoutForm()
simplexml_import_dom(): Invalid Nodetype to importsimplexml_import_dom(Object) Drupal\simpletest\WebTestBase->parse() Drupal\simpletest\WebTestBase->drupalPostForm(NULL, Array, Object) Drupal\tmgmt\Tests\TMGMTUiTest->testCheckoutForm() Drupal\simpletest\TestBase->run(Array) simpletest_script_run_one_test('11', 'Drupal\tmgmt\Tests\TMGMTUiTest') WarningAssertContentTrait.php138Drupal\simpletest\WebTestBase->parse()
"This is not supported" foundOtherTMGMTUiTest.php155Drupal\tmgmt\Tests\TMGMTUiTest->testCheckoutForm()
Value false is TRUE.OtherTMGMTUiTest.php157Drupal\tmgmt\Tests\TMGMTUiTest->testCheckoutForm()
simplexml_import_dom(): Invalid Nodetype to importsimplexml_import_dom(Object) Drupal\simpletest\WebTestBase->parse() Drupal\simpletest\WebTestBase->xpath('//div[contains(@class, @view)]//tbody/tr', Array) Drupal\tmgmt\Tests\TMGMTUiTest->testCheckoutForm() Drupal\simpletest\TestBase->run(Array) simpletest_script_run_one_test('11', 'Drupal\tmgmt\Tests\TMGMTUiTest') WarningAssertContentTrait.php138Drupal\simpletest\WebTestBase->parse()
Value 2 is equal to value 1.OtherTMGMTUiTest.php161Drupal\tmgmt\Tests\TMGMTUiTest->testCheckoutForm()
simplexml_import_dom(): Invalid Nodetype to importsimplexml_import_dom(Object) Drupal\simpletest\WebTestBase->parse() Drupal\simpletest\WebTestBase->xpath('////div[contains(@class, @view)]//td[contains(@class, @field)]/span', Array) Drupal\tmgmt\Tests\TMGMTUiTest->testCheckoutForm() Drupal\simpletest\TestBase->run(Array) simpletest_script_run_one_test('11', 'Drupal\tmgmt\Tests\TMGMTUiTest') WarningAssertContentTrait.php138Drupal\simpletest\WebTestBase->parse()
Value 2 is equal to value 1.OtherTMGMTUiTest.php165Drupal\tmgmt\Tests\TMGMTUiTest->testCheckoutForm()
Invalid argument supplied for foreach()Drupal\tmgmt\Tests\TMGMTUiTest->testCheckoutForm() Drupal\simpletest\TestBase->run(Array) simpletest_script_run_one_test('11', 'Drupal\tmgmt\Tests\TMGMTUiTest') WarningTMGMTUiTest.php166Drupal\tmgmt\Tests\TMGMTUiTest->testCheckoutForm()
simplexml_import_dom(): Invalid Nodetype to importsimplexml_import_dom(Object) Drupal\simpletest\WebTestBase->parse() Drupal\simpletest\WebTestBase->drupalPostForm(NULL, Array, Object) Drupal\tmgmt\Tests\TMGMTUiTest->testCheckoutForm() Drupal\simpletest\TestBase->run(Array) simpletest_script_run_one_test('11', 'Drupal\tmgmt\Tests\TMGMTUiTest') WarningAssertContentTrait.php138Drupal\simpletest\WebTestBase->parse()
"Test translation created" foundOtherTMGMTUiTest.php176Drupal\tmgmt\Tests\TMGMTUiTest->testCheckoutForm()
Undefined variable: translatorNoticeJobForm.php508Drupal\tmgmt\Form\JobForm->checkoutSettingsForm()
Undefined variable: translatorNoticeJobForm.php512Drupal\tmgmt\Form\JobForm->checkoutSettingsForm()
"You can provide a label for this job in order to identify it easily later on." foundOtherTMGMTUiTest.php187Drupal\tmgmt\Tests\TMGMTUiTest->testCheckoutForm()
"test_source:test:1" foundOtherTMGMTUiTest.php188Drupal\tmgmt\Tests\TMGMTUiTest->testCheckoutForm()
simplexml_import_dom(): Invalid Nodetype to importsimplexml_import_dom(Object) Drupal\simpletest\WebTestBase->parse() Drupal\simpletest\WebTestBase->drupalPostForm(NULL, Array, Object) Drupal\tmgmt\Tests\TMGMTUiTest->testCheckoutForm() Drupal\simpletest\TestBase->run(Array) simpletest_script_run_one_test('11', 'Drupal\tmgmt\Tests\TMGMTUiTest') WarningAssertContentTrait.php138Drupal\simpletest\WebTestBase->parse()
"Service not reachable" foundOtherTMGMTUiTest.php194Drupal\tmgmt\Tests\TMGMTUiTest->testCheckoutForm()
"You can provide a label for this job in order to identify it easily later on." foundOtherTMGMTUiTest.php199Drupal\tmgmt\Tests\TMGMTUiTest->testCheckoutForm()
Undefined variable: translatorNoticeJobForm.php508Drupal\tmgmt\Form\JobForm->checkoutSettingsForm()
Undefined variable: translatorNoticeJobForm.php512Drupal\tmgmt\Form\JobForm->checkoutSettingsForm()
"You can provide a label for this job in order to identify it easily later on." foundOtherTMGMTUiTest.php210Drupal\tmgmt\Tests\TMGMTUiTest->testCheckoutForm()
"test_source:test:1" foundOtherTMGMTUiTest.php211Drupal\tmgmt\Tests\TMGMTUiTest->testCheckoutForm()
simplexml_import_dom(): Invalid Nodetype to importsimplexml_import_dom(Object) Drupal\simpletest\WebTestBase->parse() Drupal\simpletest\WebTestBase->drupalPostForm(NULL, Array, Object) Drupal\tmgmt\Tests\TMGMTUiTest->testCheckoutForm() Drupal\simpletest\TestBase->run(Array) simpletest_script_run_one_test('11', 'Drupal\tmgmt\Tests\TMGMTUiTest') WarningAssertContentTrait.php138Drupal\simpletest\WebTestBase->parse()
"Fail" foundOtherTMGMTUiTest.php218Drupal\tmgmt\Tests\TMGMTUiTest->testCheckoutForm()
Undefined variable: translatorNoticeJobForm.php508Drupal\tmgmt\Form\JobForm->checkoutSettingsForm()
Undefined variable: translatorNoticeJobForm.php512Drupal\tmgmt\Form\JobForm->checkoutSettingsForm()
"You can provide a label for this job in order to identify it easily later on." foundOtherTMGMTUiTest.php233Drupal\tmgmt\Tests\TMGMTUiTest->testCheckoutForm()
"test_source:test:1" foundOtherTMGMTUiTest.php234Drupal\tmgmt\Tests\TMGMTUiTest->testCheckoutForm()
simplexml_import_dom(): Invalid Nodetype to importsimplexml_import_dom(Object) Drupal\simpletest\WebTestBase->parse() Drupal\simpletest\WebTestBase->drupalPostForm(NULL, Array, Object) Drupal\tmgmt\Tests\TMGMTUiTest->testCheckoutForm() Drupal\simpletest\TestBase->run(Array) simpletest_script_run_one_test('11', 'Drupal\tmgmt\Tests\TMGMTUiTest') WarningAssertContentTrait.php138Drupal\simpletest\WebTestBase->parse()
"This is not supported." foundOtherTMGMTUiTest.php238Drupal\tmgmt\Tests\TMGMTUiTest->testCheckoutForm()
Value false is TRUE.OtherTMGMTUiTest.php240Drupal\tmgmt\Tests\TMGMTUiTest->testCheckoutForm()
Undefined variable: translatorNoticeJobForm.php508Drupal\tmgmt\Form\JobForm->checkoutSettingsForm()
Undefined variable: translatorNoticeJobForm.php512Drupal\tmgmt\Form\JobForm->checkoutSettingsForm()
simplexml_import_dom(): Invalid Nodetype to importsimplexml_import_dom(Object) Drupal\simpletest\WebTestBase->parse() Drupal\simpletest\WebTestBase->xpath('//*[@name="target_language"]') Drupal\simpletest\WebTestBase->drupalPostAjaxForm('admin/tmgmt/jobs/3', Array, 'target_language') Drupal\tmgmt\Tests\TMGMTUiTest->testCheckoutForm() Drupal\simpletest\TestBase->run(Array) simpletest_script_run_one_test('11', 'Drupal\tmgmt\Tests\TMGMTUiTest') WarningAssertContentTrait.php138Drupal\simpletest\WebTestBase->parse()
Undefined index: ajaxDrupal\simpletest\WebTestBase->drupalPostAjaxForm('admin/tmgmt/jobs/3', Array, 'target_language') Drupal\tmgmt\Tests\TMGMTUiTest->testCheckoutForm() Drupal\simpletest\TestBase->run(Array) simpletest_script_run_one_test('11', 'Drupal\tmgmt\Tests\TMGMTUiTest') NoticeWebTestBase.php1869Drupal\simpletest\WebTestBase->drupalPostAjaxForm()
Exception: No #ajax path specified. in Drupal\simpletest\WebTestBase->drupalPostAjaxForm() (line 1905 of /var/lib/drupaltestbot/sites/default/files/checkout/core/modules/simpletest/src/WebTestBase.php). Drupal\simpletest\WebTestBase->drupalPostAjaxForm('admin/tmgmt/jobs/3', Array, 'target_language') Drupal\tmgmt\Tests\TMGMTUiTest->testCheckoutForm() Drupal\simpletest\TestBase->run(Array) simpletest_script_run_one_test('11', 'Drupal\tmgmt\Tests\TMGMTUiTest') Uncaught exceptionWebTestBase.php1905Drupal\simpletest\WebTestBase->drupalPostAjaxForm()
Call to a member function getPluginId() on a non-objectPHP Fatal errorJobForm.php512Unknown
Call to a member function getPluginId() on a non-objectPHP Fatal errorJobForm.php512Unknown
Call to a member function getPluginId() on a non-objectPHP Fatal errorJobForm.php512Unknown
Call to a member function getPluginId() on a non-objectPHP Fatal errorJobForm.php512Unknown
Call to a member function getPluginId() on a non-objectPHP Fatal errorJobForm.php512Unknown
Call to a member function getPluginId() on a non-objectPHP Fatal errorJobForm.php512Unknown
Call to a member function getPluginId() on a non-objectPHP Fatal errorJobForm.php512Unknown
Call to a member function getPluginId() on a non-objectPHP Fatal errorJobForm.php512Unknown
Undefined variable: translatorNoticeJobForm.php508Drupal\tmgmt\Form\JobForm->checkoutSettingsForm()
Undefined variable: translatorNoticeJobForm.php512Drupal\tmgmt\Form\JobForm->checkoutSettingsForm()
"The translation of test_source:test:1 to German is finished and can now be reviewed." foundOtherTMGMTUiTest.php496Drupal\tmgmt\Tests\TMGMTUiTest->testReview()
simplexml_import_dom(): Invalid Nodetype to importsimplexml_import_dom(Object) Drupal\simpletest\WebTestBase->parse() Drupal\simpletest\WebTestBase->drupalPostForm(NULL, Array, Object) Drupal\tmgmt\Tests\TMGMTUiTest->testReview() Drupal\simpletest\TestBase->run(Array) simpletest_script_run_one_test('11', 'Drupal\tmgmt\Tests\TMGMTUiTest') WarningAssertContentTrait.php138Drupal\simpletest\WebTestBase->parse()
Undefined variable: translatorNoticeJobForm.php508Drupal\tmgmt\Form\JobForm->checkoutSettingsForm()
Undefined variable: translatorNoticeJobForm.php512Drupal\tmgmt\Form\JobForm->checkoutSettingsForm()
Call to a member function getPluginId() on a non-objectPHP Fatal errorJobForm.php512Unknown
Call to a member function getPluginId() on a non-objectPHP Fatal errorJobForm.php512Unknown
Undefined variable: translatorNoticeJobForm.php508Drupal\tmgmt\Form\JobForm->checkoutSettingsForm()
Undefined variable: translatorNoticeJobForm.php512Drupal\tmgmt\Form\JobForm->checkoutSettingsForm()
Raw "20" foundOtherTMGMTUiTest.php556Drupal\tmgmt\Tests\TMGMTUiTest->testSuggestions()
simplexml_import_dom(): Invalid Nodetype to importsimplexml_import_dom(Object) Drupal\simpletest\WebTestBase->parse() Drupal\simpletest\WebTestBase->xpath('//*[@name="op" and @value="Load suggestions"]') Drupal\simpletest\WebTestBase->drupalPostAjaxForm(NULL, Array, Array) Drupal\tmgmt\Tests\TMGMTUiTest->testSuggestions() Drupal\simpletest\TestBase->run(Array) simpletest_script_run_one_test('11', 'Drupal\tmgmt\Tests\TMGMTUiTest') WarningAssertContentTrait.php138Drupal\simpletest\WebTestBase->parse()
Undefined index: ajaxDrupal\simpletest\WebTestBase->drupalPostAjaxForm(NULL, Array, Array) Drupal\tmgmt\Tests\TMGMTUiTest->testSuggestions() Drupal\simpletest\TestBase->run(Array) simpletest_script_run_one_test('11', 'Drupal\tmgmt\Tests\TMGMTUiTest') NoticeWebTestBase.php1869Drupal\simpletest\WebTestBase->drupalPostAjaxForm()
Exception: No #ajax path specified. in Drupal\simpletest\WebTestBase->drupalPostAjaxForm() (line 1905 of /var/lib/drupaltestbot/sites/default/files/checkout/core/modules/simpletest/src/WebTestBase.php). Drupal\simpletest\WebTestBase->drupalPostAjaxForm(NULL, Array, Array) Drupal\tmgmt\Tests\TMGMTUiTest->testSuggestions() Drupal\simpletest\TestBase->run(Array) simpletest_script_run_one_test('11', 'Drupal\tmgmt\Tests\TMGMTUiTest') Uncaught exceptionWebTestBase.php1905Drupal\simpletest\WebTestBase->drupalPostAjaxForm()
Call to a member function getPluginId() on a non-objectPHP Fatal errorJobForm.php512Unknown
Undefined variable: translatorNoticeJobForm.php508Drupal\tmgmt\Form\JobForm->checkoutSettingsForm()
Undefined variable: translatorNoticeJobForm.php512Drupal\tmgmt\Form\JobForm->checkoutSettingsForm()
simplexml_import_dom(): Invalid Nodetype to importsimplexml_import_dom(Object) Drupal\simpletest\WebTestBase->parse() Drupal\simpletest\WebTestBase->drupalPostForm('admin/tmgmt/jobs/1', Array, Object) Drupal\tmgmt\Tests\TMGMTUiTest->testAbortJob() Drupal\simpletest\TestBase->run(Array) simpletest_script_run_one_test('11', 'Drupal\tmgmt\Tests\TMGMTUiTest') WarningAssertContentTrait.php138Drupal\simpletest\WebTestBase->parse()
Undefined variable: translatorNoticeJobForm.php508Drupal\tmgmt\Form\JobForm->checkoutSettingsForm()
Undefined variable: translatorNoticeJobForm.php512Drupal\tmgmt\Form\JobForm->checkoutSettingsForm()
simplexml_import_dom(): Invalid Nodetype to importsimplexml_import_dom(Object) Drupal\simpletest\WebTestBase->parse() Drupal\simpletest\WebTestBase->drupalPostForm('admin/tmgmt/jobs/1', Array, Object) Drupal\tmgmt\Tests\TMGMTUiTest->testAbortJob() Drupal\simpletest\TestBase->run(Array) simpletest_script_run_one_test('11', 'Drupal\tmgmt\Tests\TMGMTUiTest') WarningAssertContentTrait.php138Drupal\simpletest\WebTestBase->parse()
simplexml_import_dom(): Invalid Nodetype to importsimplexml_import_dom(Object) Drupal\simpletest\WebTestBase->parse() Drupal\simpletest\WebTestBase->drupalPostForm(NULL, Array, Object) Drupal\tmgmt\Tests\TMGMTUiTest->testAbortJob() Drupal\simpletest\TestBase->run(Array) simpletest_script_run_one_test('11', 'Drupal\tmgmt\Tests\TMGMTUiTest') WarningAssertContentTrait.php138Drupal\simpletest\WebTestBase->parse()
Value false is TRUE.OtherTMGMTUiTest.php632Drupal\tmgmt\Tests\TMGMTUiTest->testAbortJob()
Value false is TRUE.OtherTMGMTUiTest.php634Drupal\tmgmt\Tests\TMGMTUiTest->testAbortJob()
Value false is TRUE.OtherTMGMTUiTest.php634Drupal\tmgmt\Tests\TMGMTUiTest->testAbortJob()
Value false is TRUE.OtherTMGMTUiTest.php634Drupal\tmgmt\Tests\TMGMTUiTest->testAbortJob()
Undefined variable: translatorNoticeJobForm.php508Drupal\tmgmt\Form\JobForm->checkoutSettingsForm()
Undefined variable: translatorNoticeJobForm.php512Drupal\tmgmt\Form\JobForm->checkoutSettingsForm()
simplexml_import_dom(): Invalid Nodetype to importsimplexml_import_dom(Object) Drupal\simpletest\WebTestBase->parse() Drupal\simpletest\WebTestBase->drupalPostForm('admin/tmgmt/jobs/1', Array, Object) Drupal\tmgmt\Tests\TMGMTUiTest->testAbortJob() Drupal\simpletest\TestBase->run(Array) simpletest_script_run_one_test('11', 'Drupal\tmgmt\Tests\TMGMTUiTest') WarningAssertContentTrait.php138Drupal\simpletest\WebTestBase->parse()
simplexml_import_dom(): Invalid Nodetype to importsimplexml_import_dom(Object) Drupal\simpletest\WebTestBase->parse() Drupal\simpletest\WebTestBase->drupalPostForm(NULL, Array, Object) Drupal\tmgmt\Tests\TMGMTUiTest->testAbortJob() Drupal\simpletest\TestBase->run(Array) simpletest_script_run_one_test('11', 'Drupal\tmgmt\Tests\TMGMTUiTest') WarningAssertContentTrait.php138Drupal\simpletest\WebTestBase->parse()
Raw "This job is a duplicate of the previously aborted job <a href="/checkout/admin/tmgmt/jobs/1">#1</a>" foundOtherTMGMTUiTest.php642Drupal\tmgmt\Tests\TMGMTUiTest->testAbortJob()
Drupal\tmgmt\TMGMTException: The job has no translator assigned. in Drupal\tmgmt\Entity\Job->getTranslator() (line 423 of /var/lib/drupaltestbot/sites/default/files/checkout/sites/default/modules/tmgmt/src/Entity/Job.php). Drupal\tmgmt\Entity\Job->getTranslator() Drupal\tmgmt\Tests\TMGMTUiTest->testAbortJob() Drupal\simpletest\TestBase->run(Array) simpletest_script_run_one_test('11', 'Drupal\tmgmt\Tests\TMGMTUiTest') Uncaught exceptionJob.php423Drupal\tmgmt\Entity\Job->getTranslator()
Call to a member function getPluginId() on a non-objectPHP Fatal errorJobForm.php512Unknown
Call to a member function getPluginId() on a non-objectPHP Fatal errorJobForm.php512Unknown
Call to a member function getPluginId() on a non-objectPHP Fatal errorJobForm.php512Unknown
Undefined variable: translatorNoticeJobForm.php508Drupal\tmgmt\Form\JobForm->checkoutSettingsForm()
Undefined variable: translatorNoticeJobForm.php512Drupal\tmgmt\Form\JobForm->checkoutSettingsForm()
"4 jobs need to be checked out." foundOtherTMGMTUiTest.php787Drupal\tmgmt\Tests\TMGMTUiTest->testCart()
Call to a member function getPluginId() on a non-objectPHP Fatal errorJobForm.php512Unknown
LeafDrupal\tmgmt\Tests\TranslatorTest8500
LeafDrupal\tmgmt\Tests\TranslatorUITest3000
ExpandDrupal\tmgmt_config\Tests\ConfigSourceListTest1895019
MessageGroupFilenameLineFunctionStatus
Undefined variable: translatorNoticeJobForm.php508Drupal\tmgmt\Form\JobForm->checkoutSettingsForm()
Undefined variable: translatorNoticeJobForm.php512Drupal\tmgmt\Form\JobForm->checkoutSettingsForm()
"One job needs to be checked out." foundOtherConfigSourceListTest.php65Drupal\tmgmt_config\Tests\ConfigSourceListTest->testNodeTypeSubmissions()
"Article content type (English to ?, Unprocessed)" foundOtherConfigSourceListTest.php66Drupal\tmgmt_config\Tests\ConfigSourceListTest->testNodeTypeSubmissions()
simplexml_import_dom(): Invalid Nodetype to importsimplexml_import_dom(Object) Drupal\simpletest\WebTestBase->parse() Drupal\simpletest\WebTestBase->drupalPostForm(NULL, Array, Object) Drupal\tmgmt_config\Tests\ConfigSourceListTest->testNodeTypeSubmissions() Drupal\simpletest\TestBase->run(Array) simpletest_script_run_one_test('10', 'Drupal\tmgmt_config\Tests\ConfigSourceListTest') WarningAssertContentTrait.php138Drupal\simpletest\WebTestBase->parse()
Expected 'http://ec2-52-88-182-40.us-west-2.compute.amazonaws.com/checkout/admin/tmgmt/sources/config/node_type' matches current URL (http://ec2-52-88-182-40.us-west-2.compute.amazonaws.com/checkout/admin/tmgmt/jobs/1). Value 'http://ec2-52-88-182-40.us-west-2.compute.amazonaws.com/checkout/admin/tmgmt/jobs/1' is equal to value 'http://ec2-52-88-182-40.us-west-2.compute.amazonaws.com/checkout/admin/tmgmt/sources/config/node_type'.OtherConfigSourceListTest.php72Drupal\tmgmt_config\Tests\ConfigSourceListTest->testNodeTypeSubmissions()
"Test translation created." foundOtherConfigSourceListTest.php74Drupal\tmgmt_config\Tests\ConfigSourceListTest->testNodeTypeSubmissions()
"The translation of Article content type to German is finished and can now be reviewed." foundOtherConfigSourceListTest.php75Drupal\tmgmt_config\Tests\ConfigSourceListTest->testNodeTypeSubmissions()
Undefined variable: translatorNoticeJobForm.php508Drupal\tmgmt\Form\JobForm->checkoutSettingsForm()
Undefined variable: translatorNoticeJobForm.php512Drupal\tmgmt\Form\JobForm->checkoutSettingsForm()
"One job needs to be checked out." foundOtherConfigSourceListTest.php86Drupal\tmgmt_config\Tests\ConfigSourceListTest->testNodeTypeSubmissions()
"Article content type and 1 more (English to ?, Unprocessed)" foundOtherConfigSourceListTest.php87Drupal\tmgmt_config\Tests\ConfigSourceListTest->testNodeTypeSubmissions()
simplexml_import_dom(): Invalid Nodetype to importsimplexml_import_dom(Object) Drupal\simpletest\WebTestBase->parse() Drupal\simpletest\WebTestBase->drupalPostForm(NULL, Array, Object) Drupal\tmgmt_config\Tests\ConfigSourceListTest->testNodeTypeSubmissions() Drupal\simpletest\TestBase->run(Array) simpletest_script_run_one_test('10', 'Drupal\tmgmt_config\Tests\ConfigSourceListTest') WarningAssertContentTrait.php138Drupal\simpletest\WebTestBase->parse()
Expected 'http://ec2-52-88-182-40.us-west-2.compute.amazonaws.com/checkout/admin/tmgmt/sources/config/node_type' matches current URL (http://ec2-52-88-182-40.us-west-2.compute.amazonaws.com/checkout/admin/tmgmt/jobs/2). Value 'http://ec2-52-88-182-40.us-west-2.compute.amazonaws.com/checkout/admin/tmgmt/jobs/2' is equal to value 'http://ec2-52-88-182-40.us-west-2.compute.amazonaws.com/checkout/admin/tmgmt/sources/config/node_type'.OtherConfigSourceListTest.php93Drupal\tmgmt_config\Tests\ConfigSourceListTest->testNodeTypeSubmissions()
"Test translation created." foundOtherConfigSourceListTest.php95Drupal\tmgmt_config\Tests\ConfigSourceListTest->testNodeTypeSubmissions()
"The translation of Article content type to German is finished and can now be reviewed." foundOtherConfigSourceListTest.php96Drupal\tmgmt_config\Tests\ConfigSourceListTest->testNodeTypeSubmissions()
"The translation of Page content type to German is finished and can now be reviewed." foundOtherConfigSourceListTest.php97Drupal\tmgmt_config\Tests\ConfigSourceListTest->testNodeTypeSubmissions()
Call to a member function getPluginId() on a non-objectPHP Fatal errorJobForm.php512Unknown
Call to a member function getPluginId() on a non-objectPHP Fatal errorJobForm.php512Unknown
Undefined variable: translatorNoticeJobForm.php508Drupal\tmgmt\Form\JobForm->checkoutSettingsForm()
Undefined variable: translatorNoticeJobForm.php512Drupal\tmgmt\Form\JobForm->checkoutSettingsForm()
"One job needs to be checked out." foundOtherConfigSourceListTest.php114Drupal\tmgmt_config\Tests\ConfigSourceListTest->testViewTranslation()
"Archive view (English to ?, Unprocessed)" foundOtherConfigSourceListTest.php115Drupal\tmgmt_config\Tests\ConfigSourceListTest->testViewTranslation()
simplexml_import_dom(): Invalid Nodetype to importsimplexml_import_dom(Object) Drupal\simpletest\WebTestBase->parse() Drupal\simpletest\WebTestBase->drupalPostForm(NULL, Array, Object) Drupal\tmgmt_config\Tests\ConfigSourceListTest->testViewTranslation() Drupal\simpletest\TestBase->run(Array) simpletest_script_run_one_test('10', 'Drupal\tmgmt_config\Tests\ConfigSourceListTest') WarningAssertContentTrait.php138Drupal\simpletest\WebTestBase->parse()
Expected 'http://ec2-52-88-182-40.us-west-2.compute.amazonaws.com/checkout/admin/tmgmt/sources/config/view' matches current URL (http://ec2-52-88-182-40.us-west-2.compute.amazonaws.com/checkout/admin/tmgmt/jobs/1). Value 'http://ec2-52-88-182-40.us-west-2.compute.amazonaws.com/checkout/admin/tmgmt/jobs/1' is equal to value 'http://ec2-52-88-182-40.us-west-2.compute.amazonaws.com/checkout/admin/tmgmt/sources/config/view'.OtherConfigSourceListTest.php121Drupal\tmgmt_config\Tests\ConfigSourceListTest->testViewTranslation()
"Test translation created." foundOtherConfigSourceListTest.php123Drupal\tmgmt_config\Tests\ConfigSourceListTest->testViewTranslation()
"The translation of Archive view to German is finished and can now be reviewed." foundOtherConfigSourceListTest.php124Drupal\tmgmt_config\Tests\ConfigSourceListTest->testViewTranslation()
simplexml_import_dom(): Invalid Nodetype to importsimplexml_import_dom(Object) Drupal\simpletest\WebTestBase->parse() Drupal\simpletest\WebTestBase->drupalPostForm(NULL, Array, Object) Drupal\tmgmt_config\Tests\ConfigSourceListTest->testViewTranslation() Drupal\simpletest\TestBase->run(Array) simpletest_script_run_one_test('10', 'Drupal\tmgmt_config\Tests\ConfigSourceListTest') WarningAssertContentTrait.php138Drupal\simpletest\WebTestBase->parse()
"One job needs to be checked out." foundOtherConfigSourceListTest.php137Drupal\tmgmt_config\Tests\ConfigSourceListTest->testViewTranslation()
"Archive view and 3 more (English to ?, Unprocessed)" foundOtherConfigSourceListTest.php138Drupal\tmgmt_config\Tests\ConfigSourceListTest->testViewTranslation()
simplexml_import_dom(): Invalid Nodetype to importsimplexml_import_dom(Object) Drupal\simpletest\WebTestBase->parse() Drupal\simpletest\WebTestBase->drupalPostForm(NULL, Array, Object) Drupal\tmgmt_config\Tests\ConfigSourceListTest->testViewTranslation() Drupal\simpletest\TestBase->run(Array) simpletest_script_run_one_test('10', 'Drupal\tmgmt_config\Tests\ConfigSourceListTest') WarningAssertContentTrait.php138Drupal\simpletest\WebTestBase->parse()
Expected 'http://ec2-52-88-182-40.us-west-2.compute.amazonaws.com/checkout/admin/tmgmt/sources/config/view' matches current URL (http://ec2-52-88-182-40.us-west-2.compute.amazonaws.com/checkout/admin/tmgmt/jobs/1). Value 'http://ec2-52-88-182-40.us-west-2.compute.amazonaws.com/checkout/admin/tmgmt/jobs/1' is equal to value 'http://ec2-52-88-182-40.us-west-2.compute.amazonaws.com/checkout/admin/tmgmt/sources/config/view'.OtherConfigSourceListTest.php144Drupal\tmgmt_config\Tests\ConfigSourceListTest->testViewTranslation()
"Test translation created." foundOtherConfigSourceListTest.php146Drupal\tmgmt_config\Tests\ConfigSourceListTest->testViewTranslation()
"The translation of Archive view to German is finished and can now be reviewed." foundOtherConfigSourceListTest.php147Drupal\tmgmt_config\Tests\ConfigSourceListTest->testViewTranslation()
"The translation of Recent content view to German is finished and can now be reviewed." foundOtherConfigSourceListTest.php148Drupal\tmgmt_config\Tests\ConfigSourceListTest->testViewTranslation()
"The translation of Content view to German is finished and can now be reviewed." foundOtherConfigSourceListTest.php149Drupal\tmgmt_config\Tests\ConfigSourceListTest->testViewTranslation()
"The translation of Job overview view to German is finished and can now be reviewed." foundOtherConfigSourceListTest.php150Drupal\tmgmt_config\Tests\ConfigSourceListTest->testViewTranslation()
simplexml_import_dom(): Invalid Nodetype to importsimplexml_import_dom(Object) Drupal\simpletest\WebTestBase->parse() Drupal\simpletest\WebTestBase->drupalPostForm(NULL, Array, Object) Drupal\tmgmt_config\Tests\ConfigSourceListTest->testViewTranslation() Drupal\simpletest\TestBase->run(Array) simpletest_script_run_one_test('10', 'Drupal\tmgmt_config\Tests\ConfigSourceListTest') WarningAssertContentTrait.php138Drupal\simpletest\WebTestBase->parse()
simplexml_import_dom(): Invalid Nodetype to importsimplexml_import_dom(Object) Drupal\simpletest\WebTestBase->parse() Drupal\simpletest\WebTestBase->xpath('//a[normalize-space()=:label]', Array) Drupal\simpletest\WebTestBase->clickLinkHelper('cart', 0, '//a[normalize-space()=:label]') Drupal\simpletest\WebTestBase->clickLink('cart') Drupal\tmgmt_config\Tests\ConfigSourceListTest->testViewTranslation() Drupal\simpletest\TestBase->run(Array) simpletest_script_run_one_test('10', 'Drupal\tmgmt_config\Tests\ConfigSourceListTest') WarningAssertContentTrait.php138Drupal\simpletest\WebTestBase->parse()
Link cart does not exist on http://ec2-52-88-182-40.us-west-2.compute.amazonaws.com/checkout/admin/tmgmt/jobs/1BrowserConfigSourceListTest.php157Drupal\tmgmt_config\Tests\ConfigSourceListTest->testViewTranslation()
simplexml_import_dom(): Invalid Nodetype to importsimplexml_import_dom(Object) Drupal\simpletest\WebTestBase->parse() Drupal\simpletest\WebTestBase->xpath('//ul[@class="tabs primary"]/li[@class="is-active"]') Drupal\tmgmt_config\Tests\ConfigSourceListTest->testViewTranslation() Drupal\simpletest\TestBase->run(Array) simpletest_script_run_one_test('10', 'Drupal\tmgmt_config\Tests\ConfigSourceListTest') WarningAssertContentTrait.php138Drupal\simpletest\WebTestBase->parse()
Trying to get property of non-objectDrupal\tmgmt_config\Tests\ConfigSourceListTest->testViewTranslation() Drupal\simpletest\TestBase->run(Array) simpletest_script_run_one_test('10', 'Drupal\tmgmt_config\Tests\ConfigSourceListTest') NoticeConfigSourceListTest.php160Drupal\tmgmt_config\Tests\ConfigSourceListTest->testViewTranslation()
Value '' is equal to value 'Cart'.OtherConfigSourceListTest.php161Drupal\tmgmt_config\Tests\ConfigSourceListTest->testViewTranslation()
No title element found on the page.OtherConfigSourceListTest.php162Drupal\tmgmt_config\Tests\ConfigSourceListTest->testViewTranslation()
"Request translation" foundOtherConfigSourceListTest.php163Drupal\tmgmt_config\Tests\ConfigSourceListTest->testViewTranslation()
Call to a member function getPluginId() on a non-objectPHP Fatal errorJobForm.php512Unknown
Undefined variable: translatorNoticeJobForm.php508Drupal\tmgmt\Form\JobForm->checkoutSettingsForm()
Undefined variable: translatorNoticeJobForm.php512Drupal\tmgmt\Form\JobForm->checkoutSettingsForm()
"One job needs to be checked out." foundOtherConfigSourceListTest.php244Drupal\tmgmt_config\Tests\ConfigSourceListTest->testSimpleConfigTranslation()
"System information (English to ?, Unprocessed)" foundOtherConfigSourceListTest.php245Drupal\tmgmt_config\Tests\ConfigSourceListTest->testSimpleConfigTranslation()
simplexml_import_dom(): Invalid Nodetype to importsimplexml_import_dom(Object) Drupal\simpletest\WebTestBase->parse() Drupal\simpletest\WebTestBase->drupalPostForm(NULL, Array, Object) Drupal\tmgmt_config\Tests\ConfigSourceListTest->testSimpleConfigTranslation() Drupal\simpletest\TestBase->run(Array) simpletest_script_run_one_test('10', 'Drupal\tmgmt_config\Tests\ConfigSourceListTest') WarningAssertContentTrait.php138Drupal\simpletest\WebTestBase->parse()
Expected 'http://ec2-52-88-182-40.us-west-2.compute.amazonaws.com/checkout/admin/tmgmt/sources/config/_simple_config' matches current URL (http://ec2-52-88-182-40.us-west-2.compute.amazonaws.com/checkout/admin/tmgmt/jobs/1). Value 'http://ec2-52-88-182-40.us-west-2.compute.amazonaws.com/checkout/admin/tmgmt/jobs/1' is equal to value 'http://ec2-52-88-182-40.us-west-2.compute.amazonaws.com/checkout/admin/tmgmt/sources/config/_simple_config'.OtherConfigSourceListTest.php251Drupal\tmgmt_config\Tests\ConfigSourceListTest->testSimpleConfigTranslation()
Raw "href="/checkout/admin/tmgmt/items/1?destination=admin/tmgmt/sources/config/_simple_config" title="Active job item: Needs review"" foundOtherConfigSourceListTest.php257Drupal\tmgmt_config\Tests\ConfigSourceListTest->testSimpleConfigTranslation()
"Test translation created." foundOtherConfigSourceListTest.php259Drupal\tmgmt_config\Tests\ConfigSourceListTest->testSimpleConfigTranslation()
"The translation of System information to German is finished and can now be reviewed." foundOtherConfigSourceListTest.php260Drupal\tmgmt_config\Tests\ConfigSourceListTest->testSimpleConfigTranslation()
simplexml_import_dom(): Invalid Nodetype to importsimplexml_import_dom(Object) Drupal\simpletest\WebTestBase->parse() Drupal\simpletest\WebTestBase->xpath('//table[@id="edit-items"]/tbody/tr[@class="even"][1]/td[@class="langstatus-de"]/a/@href') Drupal\tmgmt_config\Tests\ConfigSourceListTest->testSimpleConfigTranslation() Drupal\simpletest\TestBase->run(Array) simpletest_script_run_one_test('10', 'Drupal\tmgmt_config\Tests\ConfigSourceListTest') WarningAssertContentTrait.php138Drupal\simpletest\WebTestBase->parse()
Found the Save buttonOtherConfigSourceListTest.php266Drupal\tmgmt_config\Tests\ConfigSourceListTest->testSimpleConfigTranslation()
Found the requested form fields at OtherConfigSourceListTest.php266Drupal\tmgmt_config\Tests\ConfigSourceListTest->testSimpleConfigTranslation()
Failed to set field items[entity.user.admin_form] to 1OtherConfigSourceListTest.php272Drupal\tmgmt_config\Tests\ConfigSourceListTest->testSimpleConfigTranslation()
Found the Request translation buttonOtherConfigSourceListTest.php272Drupal\tmgmt_config\Tests\ConfigSourceListTest->testSimpleConfigTranslation()
Found the requested form fields at OtherConfigSourceListTest.php272Drupal\tmgmt_config\Tests\ConfigSourceListTest->testSimpleConfigTranslation()
"Account settings (English to ?, Unprocessed)" foundOtherConfigSourceListTest.php276Drupal\tmgmt_config\Tests\ConfigSourceListTest->testSimpleConfigTranslation()
Found the Submit to translator buttonOtherConfigSourceListTest.php277Drupal\tmgmt_config\Tests\ConfigSourceListTest->testSimpleConfigTranslation()
Found the requested form fields at OtherConfigSourceListTest.php277Drupal\tmgmt_config\Tests\ConfigSourceListTest->testSimpleConfigTranslation()
Expected 'http://ec2-52-88-182-40.us-west-2.compute.amazonaws.com/checkout/admin/tmgmt/sources/config/_simple_config' matches current URL (http://ec2-52-88-182-40.us-west-2.compute.amazonaws.com/checkout/user/4). Value 'http://ec2-52-88-182-40.us-west-2.compute.amazonaws.com/checkout/user/4' is equal to value 'http://ec2-52-88-182-40.us-west-2.compute.amazonaws.com/checkout/admin/tmgmt/sources/config/_simple_config'.OtherConfigSourceListTest.php280Drupal\tmgmt_config\Tests\ConfigSourceListTest->testSimpleConfigTranslation()
Value 0 is equal to value 2.OtherConfigSourceListTest.php288Drupal\tmgmt_config\Tests\ConfigSourceListTest->testSimpleConfigTranslation()
Found the Save as completed buttonOtherConfigSourceListTest.php291Drupal\tmgmt_config\Tests\ConfigSourceListTest->testSimpleConfigTranslation()
Found the requested form fields at admin/tmgmt/items/1OtherConfigSourceListTest.php291Drupal\tmgmt_config\Tests\ConfigSourceListTest->testSimpleConfigTranslation()
Call to a member function getPluginId() on a non-objectPHP Fatal errorJobForm.php512Unknown
ExpandDrupal\tmgmt_config\Tests\ConfigSourceUiTest1734532
MessageGroupFilenameLineFunctionStatus
Undefined variable: translatorNoticeJobForm.php508Drupal\tmgmt\Form\JobForm->checkoutSettingsForm()
Undefined variable: translatorNoticeJobForm.php512Drupal\tmgmt\Form\JobForm->checkoutSettingsForm()
"One job needs to be checked out." foundOtherConfigSourceUiTest.php69Drupal\tmgmt_config\Tests\ConfigSourceUiTest->testNodeTypeTranslateTabSingleCheckout()
"Article content type (English to German, Unprocessed)" foundOtherConfigSourceUiTest.php70Drupal\tmgmt_config\Tests\ConfigSourceUiTest->testNodeTypeTranslateTabSingleCheckout()
simplexml_import_dom(): Invalid Nodetype to importsimplexml_import_dom(Object) Drupal\simpletest\WebTestBase->parse() Drupal\simpletest\WebTestBase->drupalPostForm(NULL, Array, Object) Drupal\tmgmt_config\Tests\ConfigSourceUiTest->testNodeTypeTranslateTabSingleCheckout() Drupal\simpletest\TestBase->run(Array) simpletest_script_run_one_test('9', 'Drupal\tmgmt_config\Tests\ConfigSourceUiTest') WarningAssertContentTrait.php138Drupal\simpletest\WebTestBase->parse()
Expected 'http://ec2-52-88-182-40.us-west-2.compute.amazonaws.com/checkout/admin/structure/types/manage/article/translate' matches current URL (http://ec2-52-88-182-40.us-west-2.compute.amazonaws.com/checkout/admin/tmgmt/jobs/1). Value 'http://ec2-52-88-182-40.us-west-2.compute.amazonaws.com/checkout/admin/tmgmt/jobs/1' is equal to value 'http://ec2-52-88-182-40.us-west-2.compute.amazonaws.com/checkout/admin/structure/types/manage/article/translate'.OtherConfigSourceUiTest.php76Drupal\tmgmt_config\Tests\ConfigSourceUiTest->testNodeTypeTranslateTabSingleCheckout()
Link Needs review does not exist on http://ec2-52-88-182-40.us-west-2.compute.amazonaws.com/checkout/admin/structure/types/manage/article/translateBrowserConfigSourceUiTest.php90Drupal\tmgmt_config\Tests\ConfigSourceUiTest->testNodeTypeTranslateTabSingleCheckout()
Found the Save as completed buttonOtherConfigSourceUiTest.php91Drupal\tmgmt_config\Tests\ConfigSourceUiTest->testNodeTypeTranslateTabSingleCheckout()
Found the requested form fields at OtherConfigSourceUiTest.php91Drupal\tmgmt_config\Tests\ConfigSourceUiTest->testNodeTypeTranslateTabSingleCheckout()
Undefined variable: translatorNoticeJobForm.php508Drupal\tmgmt\Form\JobForm->checkoutSettingsForm()
Undefined variable: translatorNoticeJobForm.php512Drupal\tmgmt\Form\JobForm->checkoutSettingsForm()
"One job needs to be checked out." foundOtherConfigSourceUiTest.php100Drupal\tmgmt_config\Tests\ConfigSourceUiTest->testNodeTypeTranslateTabSingleCheckout()
"Article content type (English to Spanish, Unprocessed)" foundOtherConfigSourceUiTest.php101Drupal\tmgmt_config\Tests\ConfigSourceUiTest->testNodeTypeTranslateTabSingleCheckout()
simplexml_import_dom(): Invalid Nodetype to importsimplexml_import_dom(Object) Drupal\simpletest\WebTestBase->parse() Drupal\simpletest\WebTestBase->drupalPostForm(NULL, Array, Object) Drupal\tmgmt_config\Tests\ConfigSourceUiTest->testNodeTypeTranslateTabSingleCheckout() Drupal\simpletest\TestBase->run(Array) simpletest_script_run_one_test('9', 'Drupal\tmgmt_config\Tests\ConfigSourceUiTest') WarningAssertContentTrait.php138Drupal\simpletest\WebTestBase->parse()
Expected 'http://ec2-52-88-182-40.us-west-2.compute.amazonaws.com/checkout/admin/structure/types/manage/article/translate' matches current URL (http://ec2-52-88-182-40.us-west-2.compute.amazonaws.com/checkout/admin/tmgmt/jobs/2). Value 'http://ec2-52-88-182-40.us-west-2.compute.amazonaws.com/checkout/admin/tmgmt/jobs/2' is equal to value 'http://ec2-52-88-182-40.us-west-2.compute.amazonaws.com/checkout/admin/structure/types/manage/article/translate'.OtherConfigSourceUiTest.php105Drupal\tmgmt_config\Tests\ConfigSourceUiTest->testNodeTypeTranslateTabSingleCheckout()
simplexml_import_dom(): Invalid Nodetype to importsimplexml_import_dom(Object) Drupal\simpletest\WebTestBase->parse() Drupal\simpletest\WebTestBase->xpath('//tbody/tr') Drupal\tmgmt_config\Tests\ConfigSourceUiTest->testNodeTypeTranslateTabSingleCheckout() Drupal\simpletest\TestBase->run(Array) simpletest_script_run_one_test('9', 'Drupal\tmgmt_config\Tests\ConfigSourceUiTest') WarningAssertContentTrait.php138Drupal\simpletest\WebTestBase->parse()
Invalid argument supplied for foreach()Drupal\tmgmt_config\Tests\ConfigSourceUiTest->testNodeTypeTranslateTabSingleCheckout() Drupal\simpletest\TestBase->run(Array) simpletest_script_run_one_test('9', 'Drupal\tmgmt_config\Tests\ConfigSourceUiTest') WarningConfigSourceUiTest.php110Drupal\tmgmt_config\Tests\ConfigSourceUiTest->testNodeTypeTranslateTabSingleCheckout()
Value 0 is equal to value 2.OtherConfigSourceUiTest.php116Drupal\tmgmt_config\Tests\ConfigSourceUiTest->testNodeTypeTranslateTabSingleCheckout()
Call to a member function getPluginId() on a non-objectPHP Fatal errorJobForm.php512Unknown
Call to a member function getPluginId() on a non-objectPHP Fatal errorJobForm.php512Unknown
Undefined variable: translatorNoticeJobForm.php508Drupal\tmgmt\Form\JobForm->checkoutSettingsForm()
Undefined variable: translatorNoticeJobForm.php512Drupal\tmgmt\Form\JobForm->checkoutSettingsForm()
"2 jobs need to be checked out." foundOtherConfigSourceUiTest.php146Drupal\tmgmt_config\Tests\ConfigSourceUiTest->testNodeTypeTranslateTabMultipeCheckout()
"Article content type (English to German, Unprocessed)" foundOtherConfigSourceUiTest.php149Drupal\tmgmt_config\Tests\ConfigSourceUiTest->testNodeTypeTranslateTabMultipeCheckout()
simplexml_import_dom(): Invalid Nodetype to importsimplexml_import_dom(Object) Drupal\simpletest\WebTestBase->parse() Drupal\simpletest\WebTestBase->drupalPostForm(NULL, Array, Object) Drupal\tmgmt_config\Tests\ConfigSourceUiTest->testNodeTypeTranslateTabMultipeCheckout() Drupal\simpletest\TestBase->run(Array) simpletest_script_run_one_test('9', 'Drupal\tmgmt_config\Tests\ConfigSourceUiTest') WarningAssertContentTrait.php138Drupal\simpletest\WebTestBase->parse()
"Article content type (English to Spanish, Unprocessed)" foundOtherConfigSourceUiTest.php151Drupal\tmgmt_config\Tests\ConfigSourceUiTest->testNodeTypeTranslateTabMultipeCheckout()
simplexml_import_dom(): Invalid Nodetype to importsimplexml_import_dom(Object) Drupal\simpletest\WebTestBase->parse() Drupal\simpletest\WebTestBase->drupalPostForm(NULL, Array, Object) Drupal\tmgmt_config\Tests\ConfigSourceUiTest->testNodeTypeTranslateTabMultipeCheckout() Drupal\simpletest\TestBase->run(Array) simpletest_script_run_one_test('9', 'Drupal\tmgmt_config\Tests\ConfigSourceUiTest') WarningAssertContentTrait.php138Drupal\simpletest\WebTestBase->parse()
Expected 'http://ec2-52-88-182-40.us-west-2.compute.amazonaws.com/checkout/admin/structure/types/manage/article/translate' matches current URL (http://ec2-52-88-182-40.us-west-2.compute.amazonaws.com/checkout/admin/tmgmt/jobs/1). Value 'http://ec2-52-88-182-40.us-west-2.compute.amazonaws.com/checkout/admin/tmgmt/jobs/1' is equal to value 'http://ec2-52-88-182-40.us-west-2.compute.amazonaws.com/checkout/admin/structure/types/manage/article/translate'.OtherConfigSourceUiTest.php155Drupal\tmgmt_config\Tests\ConfigSourceUiTest->testNodeTypeTranslateTabMultipeCheckout()
"Test translation created." foundOtherConfigSourceUiTest.php156Drupal\tmgmt_config\Tests\ConfigSourceUiTest->testNodeTypeTranslateTabMultipeCheckout()
simplexml_import_dom(): Invalid Nodetype to importsimplexml_import_dom(Object) Drupal\simpletest\WebTestBase->parse() Drupal\simpletest\WebTestBase->xpath('//tbody/tr') Drupal\tmgmt_config\Tests\ConfigSourceUiTest->testNodeTypeTranslateTabMultipeCheckout() Drupal\simpletest\TestBase->run(Array) simpletest_script_run_one_test('9', 'Drupal\tmgmt_config\Tests\ConfigSourceUiTest') WarningAssertContentTrait.php138Drupal\simpletest\WebTestBase->parse()
Invalid argument supplied for foreach()Drupal\tmgmt_config\Tests\ConfigSourceUiTest->testNodeTypeTranslateTabMultipeCheckout() Drupal\simpletest\TestBase->run(Array) simpletest_script_run_one_test('9', 'Drupal\tmgmt_config\Tests\ConfigSourceUiTest') WarningConfigSourceUiTest.php165Drupal\tmgmt_config\Tests\ConfigSourceUiTest->testNodeTypeTranslateTabMultipeCheckout()
Value 0 is equal to value 2.OtherConfigSourceUiTest.php171Drupal\tmgmt_config\Tests\ConfigSourceUiTest->testNodeTypeTranslateTabMultipeCheckout()
Call to a member function getPluginId() on a non-objectPHP Fatal errorJobForm.php512Unknown
Undefined variable: translatorNoticeJobForm.php508Drupal\tmgmt\Form\JobForm->checkoutSettingsForm()
Undefined variable: translatorNoticeJobForm.php512Drupal\tmgmt\Form\JobForm->checkoutSettingsForm()
"One job needs to be checked out." foundOtherConfigSourceUiTest.php194Drupal\tmgmt_config\Tests\ConfigSourceUiTest->testViewTranslateTabSingleCheckout()
"Content view (English to German, Unprocessed)" foundOtherConfigSourceUiTest.php195Drupal\tmgmt_config\Tests\ConfigSourceUiTest->testViewTranslateTabSingleCheckout()
simplexml_import_dom(): Invalid Nodetype to importsimplexml_import_dom(Object) Drupal\simpletest\WebTestBase->parse() Drupal\simpletest\WebTestBase->drupalPostForm(NULL, Array, Object) Drupal\tmgmt_config\Tests\ConfigSourceUiTest->testViewTranslateTabSingleCheckout() Drupal\simpletest\TestBase->run(Array) simpletest_script_run_one_test('9', 'Drupal\tmgmt_config\Tests\ConfigSourceUiTest') WarningAssertContentTrait.php138Drupal\simpletest\WebTestBase->parse()
Expected 'http://ec2-52-88-182-40.us-west-2.compute.amazonaws.com/checkout/admin/structure/views/view/content/translate' matches current URL (http://ec2-52-88-182-40.us-west-2.compute.amazonaws.com/checkout/admin/tmgmt/jobs/1). Value 'http://ec2-52-88-182-40.us-west-2.compute.amazonaws.com/checkout/admin/tmgmt/jobs/1' is equal to value 'http://ec2-52-88-182-40.us-west-2.compute.amazonaws.com/checkout/admin/structure/views/view/content/translate'.OtherConfigSourceUiTest.php201Drupal\tmgmt_config\Tests\ConfigSourceUiTest->testViewTranslateTabSingleCheckout()
Link Needs review does not exist on http://ec2-52-88-182-40.us-west-2.compute.amazonaws.com/checkout/admin/structure/views/view/content/translateBrowserConfigSourceUiTest.php215Drupal\tmgmt_config\Tests\ConfigSourceUiTest->testViewTranslateTabSingleCheckout()
Found the Save as completed buttonOtherConfigSourceUiTest.php216Drupal\tmgmt_config\Tests\ConfigSourceUiTest->testViewTranslateTabSingleCheckout()
Found the requested form fields at OtherConfigSourceUiTest.php216Drupal\tmgmt_config\Tests\ConfigSourceUiTest->testViewTranslateTabSingleCheckout()
Undefined variable: translatorNoticeJobForm.php508Drupal\tmgmt\Form\JobForm->checkoutSettingsForm()
Undefined variable: translatorNoticeJobForm.php512Drupal\tmgmt\Form\JobForm->checkoutSettingsForm()
"One job needs to be checked out." foundOtherConfigSourceUiTest.php225Drupal\tmgmt_config\Tests\ConfigSourceUiTest->testViewTranslateTabSingleCheckout()
"Content view (English to Spanish, Unprocessed)" foundOtherConfigSourceUiTest.php226Drupal\tmgmt_config\Tests\ConfigSourceUiTest->testViewTranslateTabSingleCheckout()
simplexml_import_dom(): Invalid Nodetype to importsimplexml_import_dom(Object) Drupal\simpletest\WebTestBase->parse() Drupal\simpletest\WebTestBase->drupalPostForm(NULL, Array, Object) Drupal\tmgmt_config\Tests\ConfigSourceUiTest->testViewTranslateTabSingleCheckout() Drupal\simpletest\TestBase->run(Array) simpletest_script_run_one_test('9', 'Drupal\tmgmt_config\Tests\ConfigSourceUiTest') WarningAssertContentTrait.php138Drupal\simpletest\WebTestBase->parse()
Expected 'http://ec2-52-88-182-40.us-west-2.compute.amazonaws.com/checkout/admin/structure/views/view/content/translate' matches current URL (http://ec2-52-88-182-40.us-west-2.compute.amazonaws.com/checkout/admin/tmgmt/jobs/2). Value 'http://ec2-52-88-182-40.us-west-2.compute.amazonaws.com/checkout/admin/tmgmt/jobs/2' is equal to value 'http://ec2-52-88-182-40.us-west-2.compute.amazonaws.com/checkout/admin/structure/views/view/content/translate'.OtherConfigSourceUiTest.php230Drupal\tmgmt_config\Tests\ConfigSourceUiTest->testViewTranslateTabSingleCheckout()
simplexml_import_dom(): Invalid Nodetype to importsimplexml_import_dom(Object) Drupal\simpletest\WebTestBase->parse() Drupal\simpletest\WebTestBase->xpath('//tbody/tr') Drupal\tmgmt_config\Tests\ConfigSourceUiTest->testViewTranslateTabSingleCheckout() Drupal\simpletest\TestBase->run(Array) simpletest_script_run_one_test('9', 'Drupal\tmgmt_config\Tests\ConfigSourceUiTest') WarningAssertContentTrait.php138Drupal\simpletest\WebTestBase->parse()
Invalid argument supplied for foreach()Drupal\tmgmt_config\Tests\ConfigSourceUiTest->testViewTranslateTabSingleCheckout() Drupal\simpletest\TestBase->run(Array) simpletest_script_run_one_test('9', 'Drupal\tmgmt_config\Tests\ConfigSourceUiTest') WarningConfigSourceUiTest.php235Drupal\tmgmt_config\Tests\ConfigSourceUiTest->testViewTranslateTabSingleCheckout()
Value 0 is equal to value 2.OtherConfigSourceUiTest.php241Drupal\tmgmt_config\Tests\ConfigSourceUiTest->testViewTranslateTabSingleCheckout()
simplexml_import_dom(): Invalid Nodetype to importsimplexml_import_dom(Object) Drupal\simpletest\WebTestBase->parse() Drupal\simpletest\WebTestBase->xpath('//a[normalize-space()=:label]', Array) Drupal\simpletest\WebTestBase->clickLinkHelper(Object, 0, '//a[normalize-space()=:label]') Drupal\simpletest\WebTestBase->clickLink(Object) Drupal\tmgmt_config\Tests\ConfigSourceUiTest->testViewTranslateTabSingleCheckout() Drupal\simpletest\TestBase->run(Array) simpletest_script_run_one_test('9', 'Drupal\tmgmt_config\Tests\ConfigSourceUiTest') WarningAssertContentTrait.php138Drupal\simpletest\WebTestBase->parse()
Link Needs review does not exist on http://ec2-52-88-182-40.us-west-2.compute.amazonaws.com/checkout/admin/tmgmt/jobs/2BrowserConfigSourceUiTest.php244Drupal\tmgmt_config\Tests\ConfigSourceUiTest->testViewTranslateTabSingleCheckout()
simplexml_import_dom(): Invalid Nodetype to importsimplexml_import_dom(Object) Drupal\simpletest\WebTestBase->parse() Drupal\simpletest\WebTestBase->drupalPostForm(NULL, Array, Object) Drupal\tmgmt_config\Tests\ConfigSourceUiTest->testViewTranslateTabSingleCheckout() Drupal\simpletest\TestBase->run(Array) simpletest_script_run_one_test('9', 'Drupal\tmgmt_config\Tests\ConfigSourceUiTest') WarningAssertContentTrait.php138Drupal\simpletest\WebTestBase->parse()
"content of type view does not exist, the job can not be completed." foundOtherConfigSourceUiTest.php251Drupal\tmgmt_config\Tests\ConfigSourceUiTest->testViewTranslateTabSingleCheckout()
Call to a member function getPluginId() on a non-objectPHP Fatal errorJobForm.php512Unknown
Call to a member function getPluginId() on a non-objectPHP Fatal errorJobForm.php512Unknown
Undefined variable: translatorNoticeJobForm.php508Drupal\tmgmt\Form\JobForm->checkoutSettingsForm()
Undefined variable: translatorNoticeJobForm.php512Drupal\tmgmt\Form\JobForm->checkoutSettingsForm()
"One job needs to be checked out." foundOtherConfigSourceUiTest.php294Drupal\tmgmt_config\Tests\ConfigSourceUiTest->testSimpleConfiguration()
"System information (English to German, Unprocessed)" foundOtherConfigSourceUiTest.php295Drupal\tmgmt_config\Tests\ConfigSourceUiTest->testSimpleConfiguration()
simplexml_import_dom(): Invalid Nodetype to importsimplexml_import_dom(Object) Drupal\simpletest\WebTestBase->parse() Drupal\simpletest\WebTestBase->drupalPostForm(NULL, Array, Object) Drupal\tmgmt_config\Tests\ConfigSourceUiTest->testSimpleConfiguration() Drupal\simpletest\TestBase->run(Array) simpletest_script_run_one_test('9', 'Drupal\tmgmt_config\Tests\ConfigSourceUiTest') WarningAssertContentTrait.php138Drupal\simpletest\WebTestBase->parse()
Expected 'http://ec2-52-88-182-40.us-west-2.compute.amazonaws.com/checkout/admin/config/system/site-information/translate' matches current URL (http://ec2-52-88-182-40.us-west-2.compute.amazonaws.com/checkout/admin/tmgmt/jobs/1). Value 'http://ec2-52-88-182-40.us-west-2.compute.amazonaws.com/checkout/admin/tmgmt/jobs/1' is equal to value 'http://ec2-52-88-182-40.us-west-2.compute.amazonaws.com/checkout/admin/config/system/site-information/translate'.OtherConfigSourceUiTest.php301Drupal\tmgmt_config\Tests\ConfigSourceUiTest->testSimpleConfiguration()
Link Needs review does not exist on http://ec2-52-88-182-40.us-west-2.compute.amazonaws.com/checkout/admin/config/system/site-information/translateBrowserConfigSourceUiTest.php315Drupal\tmgmt_config\Tests\ConfigSourceUiTest->testSimpleConfiguration()
Found the Save buttonOtherConfigSourceUiTest.php316Drupal\tmgmt_config\Tests\ConfigSourceUiTest->testSimpleConfiguration()
Found the requested form fields at OtherConfigSourceUiTest.php316Drupal\tmgmt_config\Tests\ConfigSourceUiTest->testSimpleConfiguration()
Undefined variable: translatorNoticeJobForm.php508Drupal\tmgmt\Form\JobForm->checkoutSettingsForm()
Undefined variable: translatorNoticeJobForm.php512Drupal\tmgmt\Form\JobForm->checkoutSettingsForm()
"One job needs to be checked out." foundOtherConfigSourceUiTest.php325Drupal\tmgmt_config\Tests\ConfigSourceUiTest->testSimpleConfiguration()
"System information (English to Spanish, Unprocessed)" foundOtherConfigSourceUiTest.php326Drupal\tmgmt_config\Tests\ConfigSourceUiTest->testSimpleConfiguration()
simplexml_import_dom(): Invalid Nodetype to importsimplexml_import_dom(Object) Drupal\simpletest\WebTestBase->parse() Drupal\simpletest\WebTestBase->drupalPostForm(NULL, Array, Object) Drupal\tmgmt_config\Tests\ConfigSourceUiTest->testSimpleConfiguration() Drupal\simpletest\TestBase->run(Array) simpletest_script_run_one_test('9', 'Drupal\tmgmt_config\Tests\ConfigSourceUiTest') WarningAssertContentTrait.php138Drupal\simpletest\WebTestBase->parse()
Expected 'http://ec2-52-88-182-40.us-west-2.compute.amazonaws.com/checkout/admin/config/system/site-information/translate' matches current URL (http://ec2-52-88-182-40.us-west-2.compute.amazonaws.com/checkout/admin/tmgmt/jobs/2). Value 'http://ec2-52-88-182-40.us-west-2.compute.amazonaws.com/checkout/admin/tmgmt/jobs/2' is equal to value 'http://ec2-52-88-182-40.us-west-2.compute.amazonaws.com/checkout/admin/config/system/site-information/translate'.OtherConfigSourceUiTest.php330Drupal\tmgmt_config\Tests\ConfigSourceUiTest->testSimpleConfiguration()
simplexml_import_dom(): Invalid Nodetype to importsimplexml_import_dom(Object) Drupal\simpletest\WebTestBase->parse() Drupal\simpletest\WebTestBase->xpath('//tbody/tr') Drupal\tmgmt_config\Tests\ConfigSourceUiTest->testSimpleConfiguration() Drupal\simpletest\TestBase->run(Array) simpletest_script_run_one_test('9', 'Drupal\tmgmt_config\Tests\ConfigSourceUiTest') WarningAssertContentTrait.php138Drupal\simpletest\WebTestBase->parse()
Invalid argument supplied for foreach()Drupal\tmgmt_config\Tests\ConfigSourceUiTest->testSimpleConfiguration() Drupal\simpletest\TestBase->run(Array) simpletest_script_run_one_test('9', 'Drupal\tmgmt_config\Tests\ConfigSourceUiTest') WarningConfigSourceUiTest.php335Drupal\tmgmt_config\Tests\ConfigSourceUiTest->testSimpleConfiguration()
Value 0 is equal to value 2.OtherConfigSourceUiTest.php341Drupal\tmgmt_config\Tests\ConfigSourceUiTest->testSimpleConfiguration()
Call to a member function getPluginId() on a non-objectPHP Fatal errorJobForm.php512Unknown
Call to a member function getPluginId() on a non-objectPHP Fatal errorJobForm.php512Unknown
LeafDrupal\tmgmt_config\Tests\ConfigSourceUnitTest7100
ExpandDrupal\tmgmt_content\Tests\ContentEntitySourceListTest16103
MessageGroupFilenameLineFunctionStatus
Undefined variable: translatorNoticeJobForm.php508Drupal\tmgmt\Form\JobForm->checkoutSettingsForm()
Undefined variable: translatorNoticeJobForm.php508Drupal\tmgmt\Form\JobForm->checkoutSettingsForm()
Undefined variable: translatorNoticeJobForm.php508Drupal\tmgmt\Form\JobForm->checkoutSettingsForm()
ExpandDrupal\tmgmt_content\Tests\ContentEntitySourceUiTest2163921
MessageGroupFilenameLineFunctionStatus
Undefined variable: translatorNoticeJobForm.php508Drupal\tmgmt\Form\JobForm->checkoutSettingsForm()
Undefined variable: translatorNoticeJobForm.php512Drupal\tmgmt\Form\JobForm->checkoutSettingsForm()
"One job needs to be checked out." foundOtherContentEntitySourceUiTest.php83Drupal\tmgmt_content\Tests\ContentEntitySourceUiTest->testNodeTranslateTabSingleCheckout()
"vIvzsTnO" foundOtherContentEntitySourceUiTest.php84Drupal\tmgmt_content\Tests\ContentEntitySourceUiTest->testNodeTranslateTabSingleCheckout()
simplexml_import_dom(): Invalid Nodetype to importsimplexml_import_dom(Object) Drupal\simpletest\WebTestBase->parse() Drupal\simpletest\WebTestBase->drupalPostForm(NULL, Array, Object) Drupal\tmgmt_content\Tests\ContentEntitySourceUiTest->testNodeTranslateTabSingleCheckout() Drupal\simpletest\TestBase->run(Array) simpletest_script_run_one_test('4', 'Drupal\tmgmt_content\Tests\ContentEntitySourceUiTest') WarningAssertContentTrait.php138Drupal\simpletest\WebTestBase->parse()
Value 'http://ec2-52-88-182-40.us-west-2.compute.amazonaws.com/checkout/node/1/translations' is equal to value 'http://ec2-52-88-182-40.us-west-2.compute.amazonaws.com/checkout/admin/tmgmt/jobs/1'.OtherContentEntitySourceUiTest.php90Drupal\tmgmt_content\Tests\ContentEntitySourceUiTest->testNodeTranslateTabSingleCheckout()
"Test translation created." foundOtherContentEntitySourceUiTest.php91Drupal\tmgmt_content\Tests\ContentEntitySourceUiTest->testNodeTranslateTabSingleCheckout()
"The translation of vIvzsTnO to German is finished and can now be reviewed." foundOtherContentEntitySourceUiTest.php95Drupal\tmgmt_content\Tests\ContentEntitySourceUiTest->testNodeTranslateTabSingleCheckout()
simplexml_import_dom(): Invalid Nodetype to importsimplexml_import_dom(Object) Drupal\simpletest\WebTestBase->parse() Drupal\simpletest\WebTestBase->xpath('//a[normalize-space()=:label]', Array) Drupal\simpletest\WebTestBase->clickLinkHelper(Object, 0, '//a[normalize-space()=:label]') Drupal\simpletest\WebTestBase->clickLink(Object) Drupal\tmgmt_content\Tests\ContentEntitySourceUiTest->testNodeTranslateTabSingleCheckout() Drupal\simpletest\TestBase->run(Array) simpletest_script_run_one_test('4', 'Drupal\tmgmt_content\Tests\ContentEntitySourceUiTest') WarningAssertContentTrait.php138Drupal\simpletest\WebTestBase->parse()
Link Needs review does not exist on http://ec2-52-88-182-40.us-west-2.compute.amazonaws.com/checkout/admin/tmgmt/jobs/1BrowserContentEntitySourceUiTest.php98Drupal\tmgmt_content\Tests\ContentEntitySourceUiTest->testNodeTranslateTabSingleCheckout()
simplexml_import_dom(): Invalid Nodetype to importsimplexml_import_dom(Object) Drupal\simpletest\WebTestBase->parse() Drupal\simpletest\WebTestBase->drupalPostForm(NULL, Array, Object) Drupal\tmgmt_content\Tests\ContentEntitySourceUiTest->testNodeTranslateTabSingleCheckout() Drupal\simpletest\TestBase->run(Array) simpletest_script_run_one_test('4', 'Drupal\tmgmt_content\Tests\ContentEntitySourceUiTest') WarningAssertContentTrait.php138Drupal\simpletest\WebTestBase->parse()
"The translation for vIvzsTnO has been accepted." foundOtherContentEntitySourceUiTest.php101Drupal\tmgmt_content\Tests\ContentEntitySourceUiTest->testNodeTranslateTabSingleCheckout()
simplexml_import_dom(): Invalid Nodetype to importsimplexml_import_dom(Object) Drupal\simpletest\WebTestBase->parse() Drupal\simpletest\WebTestBase->xpath('//a[normalize-space()=:label]', Array) Drupal\simpletest\WebTestBase->clickLinkHelper('de_vIvzsTnO', 0, '//a[normalize-space()=:label]') Drupal\simpletest\WebTestBase->clickLink('de_vIvzsTnO') Drupal\tmgmt_content\Tests\ContentEntitySourceUiTest->testNodeTranslateTabSingleCheckout() Drupal\simpletest\TestBase->run(Array) simpletest_script_run_one_test('4', 'Drupal\tmgmt_content\Tests\ContentEntitySourceUiTest') WarningAssertContentTrait.php138Drupal\simpletest\WebTestBase->parse()
Link de_vIvzsTnO does not exist on http://ec2-52-88-182-40.us-west-2.compute.amazonaws.com/checkout/admin/tmgmt/jobs/1BrowserContentEntitySourceUiTest.php104Drupal\tmgmt_content\Tests\ContentEntitySourceUiTest->testNodeTranslateTabSingleCheckout()
"de_vIvzsTnO" foundOtherContentEntitySourceUiTest.php105Drupal\tmgmt_content\Tests\ContentEntitySourceUiTest->testNodeTranslateTabSingleCheckout()
"de_hksDDZOLePSQlK4Sxax4" foundOtherContentEntitySourceUiTest.php106Drupal\tmgmt_content\Tests\ContentEntitySourceUiTest->testNodeTranslateTabSingleCheckout()
Undefined variable: translatorNoticeJobForm.php508Drupal\tmgmt\Form\JobForm->checkoutSettingsForm()
Undefined variable: translatorNoticeJobForm.php508Drupal\tmgmt\Form\JobForm->checkoutSettingsForm()
Undefined variable: translatorNoticeJobForm.php512Drupal\tmgmt\Form\JobForm->checkoutSettingsForm()
"One job needs to be checked out." foundOtherContentEntitySourceUiTest.php139Drupal\tmgmt_content\Tests\ContentEntitySourceUiTest->testNodeTranslateTabSingleCheckout()
"vIvzsTnO" foundOtherContentEntitySourceUiTest.php140Drupal\tmgmt_content\Tests\ContentEntitySourceUiTest->testNodeTranslateTabSingleCheckout()
simplexml_import_dom(): Invalid Nodetype to importsimplexml_import_dom(Object) Drupal\simpletest\WebTestBase->parse() Drupal\simpletest\WebTestBase->drupalPostForm(NULL, Array, Object) Drupal\tmgmt_content\Tests\ContentEntitySourceUiTest->testNodeTranslateTabSingleCheckout() Drupal\simpletest\TestBase->run(Array) simpletest_script_run_one_test('4', 'Drupal\tmgmt_content\Tests\ContentEntitySourceUiTest') WarningAssertContentTrait.php138Drupal\simpletest\WebTestBase->parse()
Value 'http://ec2-52-88-182-40.us-west-2.compute.amazonaws.com/checkout/node/1' is equal to value 'http://ec2-52-88-182-40.us-west-2.compute.amazonaws.com/checkout/admin/tmgmt/jobs/3'.OtherContentEntitySourceUiTest.php144Drupal\tmgmt_content\Tests\ContentEntitySourceUiTest->testNodeTranslateTabSingleCheckout()
"vIvzsTnO" not foundOtherContentEntitySourceUiTest.php154Drupal\tmgmt_content\Tests\ContentEntitySourceUiTest->testNodeTranslateTabSingleCheckout()
Drupal\Core\Entity\EntityStorageException: SQLSTATE[23000]: Integrity constraint violation: 1048 Column 'title' cannot be null: INSERT INTO {node_field_data} (nid, vid, type, langcode, title, uid, status, created, changed, promote, sticky, revision_translation_affected, default_langcode, content_translation_source, content_translation_outdated) VALUES (:db_insert_placeholder_0, :db_insert_placeholder_1, :db_insert_placeholder_2, :db_insert_placeholder_3, :db_insert_placeholder_4, :db_insert_placeholder_5, :db_insert_placeholder_6, :db_insert_placeholder_7, :db_insert_placeholder_8, :db_insert_placeholder_9, :db_insert_placeholder_10, :db_insert_placeholder_11, :db_insert_placeholder_12, :db_insert_placeholder_13, :db_insert_placeholder_14), (:db_insert_placeholder_15, :db_insert_placeholder_16, :db_insert_placeholder_17, :db_insert_placeholder_18, :db_insert_placeholder_19, :db_insert_placeholder_20, :db_insert_placeholder_21, :db_insert_placeholder_22, :db_insert_placeholder_23, :db_insert_placeholder_24, :db_insert_placeholder_25, :db_insert_placeholder_26, :db_insert_placeholder_27, :db_insert_placeholder_28, :db_insert_placeholder_29); Array ( [:db_insert_placeholder_0] => 1 [:db_insert_placeholder_1] => 1 [:db_insert_placeholder_2] => page [:db_insert_placeholder_3] => en [:db_insert_placeholder_4] => vIvzsTnO [:db_insert_placeholder_5] => 3 [:db_insert_placeholder_6] => 1 [:db_insert_placeholder_7] => 1443023831 [:db_insert_placeholder_8] => 1443023831 [:db_insert_placeholder_9] => 1 [:db_insert_placeholder_10] => 0 [:db_insert_placeholder_11] => 1 [:db_insert_placeholder_12] => 1 [:db_insert_placeholder_13] => und [:db_insert_placeholder_14] => 0 [:db_insert_placeholder_15] => 1 [:db_insert_placeholder_16] => 1 [:db_insert_placeholder_17] => page [:db_insert_placeholder_18] => de [:db_insert_placeholder_19] => [:db_insert_placeholder_20] => 3 [:db_insert_placeholder_21] => 1 [:db_insert_placeholder_22] => 1443023831 [:db_insert_placeholder_23] => 1443023831 [:db_insert_placeholder_24] => 1 [:db_insert_placeholder_25] => 0 [:db_insert_placeholder_26] => 1 [:db_insert_placeholder_27] => 0 [:db_insert_placeholder_28] => und [:db_insert_placeholder_29] => 1 ) in Drupal\Core\Entity\Sql\SqlContentEntityStorage->save() (line 757 of /var/lib/drupaltestbot/sites/default/files/checkout/core/lib/Drupal/Core/Entity/Sql/SqlContentEntityStorage.php). Drupal\Core\Entity\Sql\SqlContentEntityStorage->save(Object) Drupal\Core\Entity\Entity->save() Drupal\tmgmt_content\Tests\ContentEntitySourceUiTest->testNodeTranslateTabSingleCheckout() Drupal\simpletest\TestBase->run(Array) simpletest_script_run_one_test('4', 'Drupal\tmgmt_content\Tests\ContentEntitySourceUiTest') Uncaught exceptionSqlContentEntityStorage.php757Drupal\Core\Entity\Sql\SqlContentEntityStorage->save()
Call to a member function getPluginId() on a non-objectPHP Fatal errorJobForm.php512Unknown
Call to a member function getPluginId() on a non-objectPHP Fatal errorJobForm.php512Unknown
Undefined variable: translatorNoticeJobForm.php508Drupal\tmgmt\Form\JobForm->checkoutSettingsForm()
Undefined variable: translatorNoticeJobForm.php512Drupal\tmgmt\Form\JobForm->checkoutSettingsForm()
"2 jobs need to be checked out." foundOtherContentEntitySourceUiTest.php226Drupal\tmgmt_content\Tests\ContentEntitySourceUiTest->testNodeTranslateTabMultipeCheckout()
"adJiNBZt" foundOtherContentEntitySourceUiTest.php229Drupal\tmgmt_content\Tests\ContentEntitySourceUiTest->testNodeTranslateTabMultipeCheckout()
simplexml_import_dom(): Invalid Nodetype to importsimplexml_import_dom(Object) Drupal\simpletest\WebTestBase->parse() Drupal\simpletest\WebTestBase->drupalPostForm(NULL, Array, Object) Drupal\tmgmt_content\Tests\ContentEntitySourceUiTest->testNodeTranslateTabMultipeCheckout() Drupal\simpletest\TestBase->run(Array) simpletest_script_run_one_test('4', 'Drupal\tmgmt_content\Tests\ContentEntitySourceUiTest') WarningAssertContentTrait.php138Drupal\simpletest\WebTestBase->parse()
"adJiNBZt" foundOtherContentEntitySourceUiTest.php231Drupal\tmgmt_content\Tests\ContentEntitySourceUiTest->testNodeTranslateTabMultipeCheckout()
simplexml_import_dom(): Invalid Nodetype to importsimplexml_import_dom(Object) Drupal\simpletest\WebTestBase->parse() Drupal\simpletest\WebTestBase->drupalPostForm(NULL, Array, Object) Drupal\tmgmt_content\Tests\ContentEntitySourceUiTest->testNodeTranslateTabMultipeCheckout() Drupal\simpletest\TestBase->run(Array) simpletest_script_run_one_test('4', 'Drupal\tmgmt_content\Tests\ContentEntitySourceUiTest') WarningAssertContentTrait.php138Drupal\simpletest\WebTestBase->parse()
Value 'http://ec2-52-88-182-40.us-west-2.compute.amazonaws.com/checkout/node/1/translations' is equal to value 'http://ec2-52-88-182-40.us-west-2.compute.amazonaws.com/checkout/admin/tmgmt/jobs/1'.OtherContentEntitySourceUiTest.php235Drupal\tmgmt_content\Tests\ContentEntitySourceUiTest->testNodeTranslateTabMultipeCheckout()
"Test translation created." foundOtherContentEntitySourceUiTest.php236Drupal\tmgmt_content\Tests\ContentEntitySourceUiTest->testNodeTranslateTabMultipeCheckout()
"The translation for adJiNBZt has been accepted." foundOtherContentEntitySourceUiTest.php241Drupal\tmgmt_content\Tests\ContentEntitySourceUiTest->testNodeTranslateTabMultipeCheckout()
simplexml_import_dom(): Invalid Nodetype to importsimplexml_import_dom(Object) Drupal\simpletest\WebTestBase->parse() Drupal\simpletest\WebTestBase->xpath('//a[normalize-space()=:label]', Array) Drupal\simpletest\WebTestBase->clickLinkHelper('adJiNBZt', 0, '//a[normalize-space()=:label]') Drupal\simpletest\WebTestBase->clickLink('adJiNBZt') Drupal\tmgmt_content\Tests\ContentEntitySourceUiTest->testNodeTranslateTabMultipeCheckout() Drupal\simpletest\TestBase->run(Array) simpletest_script_run_one_test('4', 'Drupal\tmgmt_content\Tests\ContentEntitySourceUiTest') WarningAssertContentTrait.php138Drupal\simpletest\WebTestBase->parse()
Link adJiNBZt does not exist on http://ec2-52-88-182-40.us-west-2.compute.amazonaws.com/checkout/admin/tmgmt/jobs/1BrowserContentEntitySourceUiTest.php244Drupal\tmgmt_content\Tests\ContentEntitySourceUiTest->testNodeTranslateTabMultipeCheckout()
"de_adJiNBZt" foundOtherContentEntitySourceUiTest.php249Drupal\tmgmt_content\Tests\ContentEntitySourceUiTest->testNodeTranslateTabMultipeCheckout()
"de_meoceKYX6cyWNY3FscxK" foundOtherContentEntitySourceUiTest.php250Drupal\tmgmt_content\Tests\ContentEntitySourceUiTest->testNodeTranslateTabMultipeCheckout()
"es_adJiNBZt" foundOtherContentEntitySourceUiTest.php253Drupal\tmgmt_content\Tests\ContentEntitySourceUiTest->testNodeTranslateTabMultipeCheckout()
"es_meoceKYX6cyWNY3FscxK" foundOtherContentEntitySourceUiTest.php254Drupal\tmgmt_content\Tests\ContentEntitySourceUiTest->testNodeTranslateTabMultipeCheckout()
Call to a member function getPluginId() on a non-objectPHP Fatal errorJobForm.php512Unknown
Undefined variable: translatorNoticeJobForm.php508Drupal\tmgmt\Form\JobForm->checkoutSettingsForm()
Undefined variable: translatorNoticeJobForm.php512Drupal\tmgmt\Form\JobForm->checkoutSettingsForm()
"2 jobs need to be checked out." foundOtherContentEntitySourceUiTest.php324Drupal\tmgmt_content\Tests\ContentEntitySourceUiTest->testCommentTranslateTab()
"uyMdVC0g" foundOtherContentEntitySourceUiTest.php327Drupal\tmgmt_content\Tests\ContentEntitySourceUiTest->testCommentTranslateTab()
simplexml_import_dom(): Invalid Nodetype to importsimplexml_import_dom(Object) Drupal\simpletest\WebTestBase->parse() Drupal\simpletest\WebTestBase->drupalPostForm(NULL, Array, Object) Drupal\tmgmt_content\Tests\ContentEntitySourceUiTest->testCommentTranslateTab() Drupal\simpletest\TestBase->run(Array) simpletest_script_run_one_test('4', 'Drupal\tmgmt_content\Tests\ContentEntitySourceUiTest') WarningAssertContentTrait.php138Drupal\simpletest\WebTestBase->parse()
"uyMdVC0g" foundOtherContentEntitySourceUiTest.php329Drupal\tmgmt_content\Tests\ContentEntitySourceUiTest->testCommentTranslateTab()
simplexml_import_dom(): Invalid Nodetype to importsimplexml_import_dom(Object) Drupal\simpletest\WebTestBase->parse() Drupal\simpletest\WebTestBase->drupalPostForm(NULL, Array, Object) Drupal\tmgmt_content\Tests\ContentEntitySourceUiTest->testCommentTranslateTab() Drupal\simpletest\TestBase->run(Array) simpletest_script_run_one_test('4', 'Drupal\tmgmt_content\Tests\ContentEntitySourceUiTest') WarningAssertContentTrait.php138Drupal\simpletest\WebTestBase->parse()
Expected 'http://ec2-52-88-182-40.us-west-2.compute.amazonaws.com/checkout/comment/1/translations' matches current URL (http://ec2-52-88-182-40.us-west-2.compute.amazonaws.com/checkout/admin/tmgmt/jobs/1). Value 'http://ec2-52-88-182-40.us-west-2.compute.amazonaws.com/checkout/admin/tmgmt/jobs/1' is equal to value 'http://ec2-52-88-182-40.us-west-2.compute.amazonaws.com/checkout/comment/1/translations'.OtherContentEntitySourceUiTest.php333Drupal\tmgmt_content\Tests\ContentEntitySourceUiTest->testCommentTranslateTab()
"Test translation created." foundOtherContentEntitySourceUiTest.php334Drupal\tmgmt_content\Tests\ContentEntitySourceUiTest->testCommentTranslateTab()
"The translation for uyMdVC0g has been accepted." foundOtherContentEntitySourceUiTest.php339Drupal\tmgmt_content\Tests\ContentEntitySourceUiTest->testCommentTranslateTab()
simplexml_import_dom(): Invalid Nodetype to importsimplexml_import_dom(Object) Drupal\simpletest\WebTestBase->parse() Drupal\simpletest\WebTestBase->xpath('//a[normalize-space()=:label]', Array) Drupal\simpletest\WebTestBase->clickLinkHelper('de_uyMdVC0g', 0, '//a[normalize-space()=:label]') Drupal\simpletest\WebTestBase->clickLink('de_uyMdVC0g') Drupal\tmgmt_content\Tests\ContentEntitySourceUiTest->testCommentTranslateTab() Drupal\simpletest\TestBase->run(Array) simpletest_script_run_one_test('4', 'Drupal\tmgmt_content\Tests\ContentEntitySourceUiTest') WarningAssertContentTrait.php138Drupal\simpletest\WebTestBase->parse()
Link de_uyMdVC0g does not exist on http://ec2-52-88-182-40.us-west-2.compute.amazonaws.com/checkout/admin/tmgmt/jobs/1BrowserContentEntitySourceUiTest.php342Drupal\tmgmt_content\Tests\ContentEntitySourceUiTest->testCommentTranslateTab()
"de_pjbkuPq0" foundOtherContentEntitySourceUiTest.php343Drupal\tmgmt_content\Tests\ContentEntitySourceUiTest->testCommentTranslateTab()
Link es_uyMdVC0g does not exist on http://ec2-52-88-182-40.us-west-2.compute.amazonaws.com/checkout/comment/1/translationsBrowserContentEntitySourceUiTest.php347Drupal\tmgmt_content\Tests\ContentEntitySourceUiTest->testCommentTranslateTab()
"es_pjbkuPq0" foundOtherContentEntitySourceUiTest.php349Drupal\tmgmt_content\Tests\ContentEntitySourceUiTest->testCommentTranslateTab()
Call to a member function getPluginId() on a non-objectPHP Fatal errorJobForm.php512Unknown
LeafDrupal\tmgmt_content\Tests\ContentEntitySourceUnitTest14600
LeafDrupal\tmgmt_content\Tests\ContentEntitySuggestionsTest2400
ExpandDrupal\tmgmt_demo\Tests\TMGMTDemoTest4444
MessageGroupFilenameLineFunctionStatus
Undefined variable: translatorNoticeJobForm.php508Drupal\tmgmt\Form\JobForm->checkoutSettingsForm()
Undefined variable: translatorNoticeJobForm.php512Drupal\tmgmt\Form\JobForm->checkoutSettingsForm()
"2 jobs need to be checked out." foundOtherTMGMTDemoTest.php53Drupal\tmgmt_demo\Tests\TMGMTDemoTest->testInstalled()
Undefined variable: translatorNoticeJobForm.php508Drupal\tmgmt\Form\JobForm->checkoutSettingsForm()
Undefined variable: translatorNoticeJobForm.php512Drupal\tmgmt\Form\JobForm->checkoutSettingsForm()
"2 jobs need to be checked out." foundOtherTMGMTDemoTest.php59Drupal\tmgmt_demo\Tests\TMGMTDemoTest->testInstalled()
Call to a member function getPluginId() on a non-objectPHP Fatal errorJobForm.php512Unknown
Call to a member function getPluginId() on a non-objectPHP Fatal errorJobForm.php512Unknown
LeafDrupal\tmgmt_file\Tests\FileTranslatorTest17200
LeafDrupal\tmgmt_locale\Tests\LocaleSourceTest6300
ExpandDrupal\tmgmt_locale\Tests\LocaleSourceUiTest39103
MessageGroupFilenameLineFunctionStatus
Undefined variable: translatorNoticeJobForm.php508Drupal\tmgmt\Form\JobForm->checkoutSettingsForm()
Undefined variable: translatorNoticeJobForm.php512Drupal\tmgmt\Form\JobForm->checkoutSettingsForm()
"Hello World" foundOtherLocaleSourceUiTest.php76Drupal\tmgmt_locale\Tests\LocaleSourceUiTest->testOverview()
"Locale" foundOtherLocaleSourceUiTest.php77Drupal\tmgmt_locale\Tests\LocaleSourceUiTest->testOverview()
"2" foundOtherLocaleSourceUiTest.php78Drupal\tmgmt_locale\Tests\LocaleSourceUiTest->testOverview()
simplexml_import_dom(): Invalid Nodetype to importsimplexml_import_dom(Object) Drupal\simpletest\WebTestBase->parse() Drupal\simpletest\WebTestBase->drupalPostForm(NULL, Array, Object) Drupal\tmgmt_locale\Tests\LocaleSourceUiTest->testOverview() Drupal\simpletest\TestBase->run(Array) simpletest_script_run_one_test('6', 'Drupal\tmgmt_locale\Tests\LocaleSourceUiTest') WarningAssertContentTrait.php138Drupal\simpletest\WebTestBase->parse()
Raw "Active job item: Needs review" foundOtherLocaleSourceUiTest.php83Drupal\tmgmt_locale\Tests\LocaleSourceUiTest->testOverview()
Raw "gsw-berne_Hello World" foundOtherLocaleSourceUiTest.php88Drupal\tmgmt_locale\Tests\LocaleSourceUiTest->testOverview()
Found the Save as completed buttonOtherLocaleSourceUiTest.php89Drupal\tmgmt_locale\Tests\LocaleSourceUiTest->testOverview()
Found the requested form fields at OtherLocaleSourceUiTest.php89Drupal\tmgmt_locale\Tests\LocaleSourceUiTest->testOverview()
Value 'Not translated' is equal to value 'Translation up to date'.OtherLocaleSourceUiTest.php97Drupal\tmgmt_locale\Tests\LocaleSourceUiTest->testOverview()
"Hello World" not foundOtherLocaleSourceUiTest.php113Drupal\tmgmt_locale\Tests\LocaleSourceUiTest->testOverview()
Call to a member function getPluginId() on a non-objectPHP Fatal errorJobForm.php512Unknown