search_api-move-database-backend-tables-info-to-state-2564847-2.patch

Test status
StatusResult
Last receivedTue, 09/22/2015 - 15:36:00
Last requestedTue, 09/22/2015 - 20:46:43
Last testedTue, 09/22/2015 - 20:47:41
Test count1
Environment status
PHP 5.5 MySQLfail
File information
Filesearch_api-move-database-backend-tables-info-to-state-2564847-2.patch
BranchSearch API - 8.x-1.x
LinkIssue Link
SummaryFAILED: [[SimpleTest]]: [PHP 5.5 MySQL] 1,026 pass(es), 1 fail(s), and 1 exception(s).
Details

PHP 5.5 MySQL

  1. Setup environment
  2. Detect an invalid patch URL
  3. Detect invalid repository information
  4. Detect invalid patch format
  5. Detect a non-applicable patch
  6. Detect invalid PHP syntax
  7. Detect a Drupal installation failure
  8. Detect a test run failure
  9. Detect a failing test
    Review the test failures below then if necessary run them locally until the problem has been fixed.
  10. Complete test suite with all tests passing
1,026 pass(es), 1 fail(s), and 1 exception(s)

Non-pass

Test namePassFailException
ExpandDrupal\search_api_db_defaults\Tests\IntegrationTest411
MessageGroupFilenameLineFunctionStatus
The test did not complete due to a fatal error.Completion checkIntegrationTest.php176Drupal\search_api_db_defaults\Tests\IntegrationTest->testDefaultSetupWorking()
Drupal\Core\Config\Schema\SchemaIncompleteException: Schema errors for search_api.server.default_server with the following errors: search_api.server.default_server:backend_config.field_tables missing schema, search_api.server.default_server:backend_config.index_tables missing schema in Drupal\Core\Config\Testing\ConfigSchemaChecker->onConfigSave() (line 98 of /var/lib/drupaltestbot/sites/default/files/checkout/core/lib/Drupal/Core/Config/Testing/ConfigSchemaChecker.php). Drupal\Core\Config\Testing\ConfigSchemaChecker->onConfigSave(Object, 'config.save', Object) Drupal\Component\EventDispatcher\ContainerAwareEventDispatcher->dispatch('config.save', Object) Drupal\Core\Config\Config->save(1) Drupal\Core\Config\Entity\ConfigEntityStorage->doSave('default_server', Object) Drupal\Core\Entity\EntityStorageBase->save(Object) Drupal\Core\Config\Entity\ConfigEntityStorage->save(Object) Drupal\Core\Entity\Entity->save() Drupal\Core\Config\Entity\ConfigEntityBase->save() Drupal\Core\Config\ConfigInstaller->createConfiguration('', Array) Drupal\Core\Config\ConfigInstaller->installDefaultConfig('module', 'search_api_db_defaults') Drupal\Core\ProxyClass\Config\ConfigInstaller->installDefaultConfig('module', 'search_api_db_defaults') Drupal\Core\Extension\ModuleInstaller->install(Array, 1) Drupal\Core\ProxyClass\Extension\ModuleInstaller->install(Array, 1) Drupal\search_api_db_defaults\Tests\IntegrationTest->setUp() Drupal\simpletest\TestBase->run(Array) simpletest_script_run_one_test('1', 'Drupal\search_api_db_defaults\Tests\IntegrationTest') Uncaught exceptionConfigSchemaChecker.php98Drupal\Core\Config\Testing\ConfigSchemaChecker->onConfigSave()

All

Test namePassFailException
LeafDrupal\search_api\Tests\CustomDataTypesUnitTest1800
LeafDrupal\search_api\Tests\IndexStorageUnitTest500
LeafDrupal\search_api\Tests\IntegrationTest23300
LeafDrupal\search_api\Tests\LanguageIntegrationUnitTest3500
LeafDrupal\search_api\Tests\LocalActionsWebTest1500
LeafDrupal\search_api\Tests\OverviewPageTest12100
LeafDrupal\search_api\Tests\Processor\ContentAccessTest7200
LeafDrupal\search_api\Tests\Processor\ProcessorIntegrationTest7300
LeafDrupal\search_api\Tests\Processor\RenderedItemTest4600
LeafDrupal\search_api\Tests\ServerStorageUnitTest600
LeafDrupal\search_api\Tests\ServerTaskUnitTest5900
LeafDrupal\search_api\Tests\ViewsTest2800
LeafDrupal\search_api_db\Tests\BackendTest16600
ExpandDrupal\search_api_db_defaults\Tests\IntegrationTest411
MessageGroupFilenameLineFunctionStatus
The test did not complete due to a fatal error.Completion checkIntegrationTest.php176Drupal\search_api_db_defaults\Tests\IntegrationTest->testDefaultSetupWorking()
Drupal\Core\Config\Schema\SchemaIncompleteException: Schema errors for search_api.server.default_server with the following errors: search_api.server.default_server:backend_config.field_tables missing schema, search_api.server.default_server:backend_config.index_tables missing schema in Drupal\Core\Config\Testing\ConfigSchemaChecker->onConfigSave() (line 98 of /var/lib/drupaltestbot/sites/default/files/checkout/core/lib/Drupal/Core/Config/Testing/ConfigSchemaChecker.php). Drupal\Core\Config\Testing\ConfigSchemaChecker->onConfigSave(Object, 'config.save', Object) Drupal\Component\EventDispatcher\ContainerAwareEventDispatcher->dispatch('config.save', Object) Drupal\Core\Config\Config->save(1) Drupal\Core\Config\Entity\ConfigEntityStorage->doSave('default_server', Object) Drupal\Core\Entity\EntityStorageBase->save(Object) Drupal\Core\Config\Entity\ConfigEntityStorage->save(Object) Drupal\Core\Entity\Entity->save() Drupal\Core\Config\Entity\ConfigEntityBase->save() Drupal\Core\Config\ConfigInstaller->createConfiguration('', Array) Drupal\Core\Config\ConfigInstaller->installDefaultConfig('module', 'search_api_db_defaults') Drupal\Core\ProxyClass\Config\ConfigInstaller->installDefaultConfig('module', 'search_api_db_defaults') Drupal\Core\Extension\ModuleInstaller->install(Array, 1) Drupal\Core\ProxyClass\Extension\ModuleInstaller->install(Array, 1) Drupal\search_api_db_defaults\Tests\IntegrationTest->setUp() Drupal\simpletest\TestBase->run(Array) simpletest_script_run_one_test('1', 'Drupal\search_api_db_defaults\Tests\IntegrationTest') Uncaught exceptionConfigSchemaChecker.php98Drupal\Core\Config\Testing\ConfigSchemaChecker->onConfigSave()
LeafDrupal\Tests\search_api\Unit\Plugin\Processor\AddURLTest200
LeafDrupal\Tests\search_api\Unit\Plugin\Processor\AggregatedFieldTest900
LeafDrupal\Tests\search_api\Unit\Plugin\Processor\FieldsProcessorPluginBaseTest1300
LeafDrupal\Tests\search_api\Unit\Plugin\Processor\HighlightTest1300
LeafDrupal\Tests\search_api\Unit\Plugin\Processor\HtmlFilterTest2500
LeafDrupal\Tests\search_api\Unit\Plugin\Processor\IgnoreCaseTest400
LeafDrupal\Tests\search_api\Unit\Plugin\Processor\IgnoreCharacterTest3900
LeafDrupal\Tests\search_api\Unit\Plugin\Processor\LanguageTest200
LeafDrupal\Tests\search_api\Unit\Plugin\Processor\NodeStatusTest300
LeafDrupal\Tests\search_api\Unit\Plugin\Processor\RoleFilterTest200
LeafDrupal\Tests\search_api\Unit\Plugin\Processor\StopwordsTest800
LeafDrupal\Tests\search_api\Unit\Plugin\Processor\TokenizerTest2200
LeafDrupal\Tests\search_api\Unit\Plugin\Processor\TransliterationTest300