field_tokens-sanitize-1713164-3.patch

Test status
StatusResult
Last receivedTue, 09/22/2015 - 11:58:00
Last requestedTue, 09/22/2015 - 11:58:01
Last testedTue, 09/22/2015 - 11:58:29
Test count1
Environment status
MySQLfail
File information
Filefield_tokens-sanitize-1713164-3.patch
BranchToken - 7.x-1.x
LinkIssue Link
SummaryFAILED: [[SimpleTest]]: [MySQL] 63 pass(es), 180 fail(s), and 7 exception(s).
Details

MySQL

  1. Setup environment
  2. Detect an invalid patch URL
  3. Detect invalid repository information
  4. Detect invalid patch format
  5. Detect a non-applicable patch
  6. Detect invalid PHP syntax
  7. Detect a Drupal installation failure
  8. Detect a test run failure
  9. Detect a failing test
    Review the test failures below then if necessary run them locally until the problem has been fixed.
  10. Complete test suite with all tests passing
63 pass(es), 180 fail(s), and 7 exception(s)

Non-pass

Test namePassFailException
ExpandArray token tests (TokenArrayTestCase) [Token]0290
MessageGroupFilenameLineFunctionStatus
Enabled modules: path, token, token_testOthertoken.test18TokenTestHelper->setUp()
Token value for [array:first] was not generated.Othertoken.test943TokenArrayTestCase->testArrayTokens()
Token value for [array:last] was not generated.Othertoken.test943TokenArrayTestCase->testArrayTokens()
Token value for [array:value:0] was not generated.Othertoken.test943TokenArrayTestCase->testArrayTokens()
Token value for [array:value:2] was not generated.Othertoken.test943TokenArrayTestCase->testArrayTokens()
Token value for [array:count] was not generated.Othertoken.test943TokenArrayTestCase->testArrayTokens()
Token value for [array:keys] was not generated.Othertoken.test943TokenArrayTestCase->testArrayTokens()
Token value for [array:keys:value:3] was not generated.Othertoken.test943TokenArrayTestCase->testArrayTokens()
Token value for [array:keys:join] was not generated.Othertoken.test943TokenArrayTestCase->testArrayTokens()
Token value for [array:reversed] was not generated.Othertoken.test943TokenArrayTestCase->testArrayTokens()
Token value for [array:reversed:keys] was not generated.Othertoken.test943TokenArrayTestCase->testArrayTokens()
Token value for [array:join:/] was not generated.Othertoken.test943TokenArrayTestCase->testArrayTokens()
Token value for [array:join] was not generated.Othertoken.test943TokenArrayTestCase->testArrayTokens()
Token value for [array:join:, ] was not generated.Othertoken.test943TokenArrayTestCase->testArrayTokens()
Token value for [array:join: ] was not generated.Othertoken.test943TokenArrayTestCase->testArrayTokens()
Token value for [array:first] was not generated.Othertoken.test970TokenArrayTestCase->testArrayTokens()
Token value for [array:last] was not generated.Othertoken.test970TokenArrayTestCase->testArrayTokens()
Token value for [array:value:0] was not generated.Othertoken.test970TokenArrayTestCase->testArrayTokens()
Token value for [array:value:2] was not generated.Othertoken.test970TokenArrayTestCase->testArrayTokens()
Token value for [array:count] was not generated.Othertoken.test970TokenArrayTestCase->testArrayTokens()
Token value for [array:keys] was not generated.Othertoken.test970TokenArrayTestCase->testArrayTokens()
Token value for [array:keys:value:3] was not generated.Othertoken.test970TokenArrayTestCase->testArrayTokens()
Token value for [array:keys:join] was not generated.Othertoken.test970TokenArrayTestCase->testArrayTokens()
Token value for [array:reversed] was not generated.Othertoken.test970TokenArrayTestCase->testArrayTokens()
Token value for [array:reversed:keys] was not generated.Othertoken.test970TokenArrayTestCase->testArrayTokens()
Token value for [array:join:/] was not generated.Othertoken.test970TokenArrayTestCase->testArrayTokens()
Token value for [array:join] was not generated.Othertoken.test970TokenArrayTestCase->testArrayTokens()
Token value for [array:join:, ] was not generated.Othertoken.test970TokenArrayTestCase->testArrayTokens()
Token value for [array:join: ] was not generated.Othertoken.test970TokenArrayTestCase->testArrayTokens()
ExpandBlock token tests (TokenBlockTestCase) [Token]9204
MessageGroupFilenameLineFunctionStatus
Enabled modules: block, path, token, token_testOthertoken.test18TokenTestHelper->setUp()
Invalid permission administer blocks.Roletoken.test1073TokenBlockTestCase->setUp()
Argument 1 passed to DrupalWebTestCase::drupalLogin() must be an instance of stdClass, boolean given, called in /var/lib/drupaltestbot/sites/default/files/checkout/sites/default/modules/token/token.test on line 1074 and definedRecoverable errordrupal_web_test_case.php1252DrupalWebTestCase->drupalLogin()
Trying to get property of non-objectNoticedrupal_web_test_case.php1258DrupalWebTestCase->drupalLogin()
Trying to get property of non-objectNoticedrupal_web_test_case.php1259DrupalWebTestCase->drupalLogin()
Failed to set field name to Othertoken.test1074TokenBlockTestCase->setUp()
Failed to set field pass to Othertoken.test1074TokenBlockTestCase->setUp()
Found the requested form fields at userOthertoken.test1074TokenBlockTestCase->setUp()
Trying to get property of non-objectNoticedrupal_web_test_case.php1265DrupalWebTestCase->drupalLogin()
User successfully logged in.User logintoken.test1074TokenBlockTestCase->setUp()
Failed to set field title to [user:name]Othertoken.test1081TokenBlockTestCase->testBlockTitleTokens()
Failed to set field info to Test token title blockOthertoken.test1081TokenBlockTestCase->testBlockTitleTokens()
Failed to set field body[value] to This is the test token title block.Othertoken.test1081TokenBlockTestCase->testBlockTitleTokens()
Found the Save block buttonOthertoken.test1081TokenBlockTestCase->testBlockTitleTokens()
Found the requested form fields at admin/structure/block/addOthertoken.test1081TokenBlockTestCase->testBlockTitleTokens()
"The Block title is using the following invalid tokens: [user:name]." foundOthertoken.test1083TokenBlockTestCase->testBlockTitleTokens()
Failed to set field title to [current-page:title] block titleOthertoken.test1088TokenBlockTestCase->testBlockTitleTokens()
Failed to set field info to Test token title blockOthertoken.test1088TokenBlockTestCase->testBlockTitleTokens()
Failed to set field body[value] to This is the test token title block.Othertoken.test1088TokenBlockTestCase->testBlockTitleTokens()
Failed to set field regions[bartik] to sidebar_firstOthertoken.test1088TokenBlockTestCase->testBlockTitleTokens()
Found the Save block buttonOthertoken.test1088TokenBlockTestCase->testBlockTitleTokens()
Found the requested form fields at Othertoken.test1088TokenBlockTestCase->testBlockTitleTokens()
"Welcome to Drupal block title" foundOthertoken.test1091TokenBlockTestCase->testBlockTitleTokens()
Raw "Site's first node block title" foundOthertoken.test1097TokenBlockTestCase->testBlockTitleTokens()
ExpandComment token tests (TokenCommentTestCase) [Token]011
MessageGroupFilenameLineFunctionStatus
Enabled modules: comment, path, token, token_testOthertoken.test18TokenTestHelper->setUp()
PDOException: SQLSTATE[42S02]: Base table or view not found: 1146 Table 'drupaltestbotmysql.simpletest513534comment' doesn't exist: SELECT MAX(thread) FROM {comment} WHERE nid = :nid; Array ( [:nid] => 1 ) in comment_save() (line 1516 of /var/lib/drupaltestbot/sites/default/files/checkout/modules/comment/comment.module).Uncaught exceptiondatabase.inc2171PDOStatement->execute()
ExpandCurrent page token tests (TokenCurrentPageTestCase) [Token]430
MessageGroupFilenameLineFunctionStatus
Enabled modules: path, token, token_testOthertoken.test18TokenTestHelper->setUp()
Failed to generate tokens.Othertoken.test887TokenCurrentPageTestCase->testCurrentPageTokens()
Failed to generate tokens.Othertoken.test911TokenCurrentPageTestCase->testCurrentPageTokens()
ExpandDate token tests (TokenDateTestCase) [Token]120
MessageGroupFilenameLineFunctionStatus
Enabled modules: path, token, token_testOthertoken.test18TokenTestHelper->setUp()
Token value for [date:token_test] was not generated.Othertoken.test1018TokenDateTestCase->testDateTokens()
ExpandEntity token tests (TokenEntityTestCase) [Token]020
MessageGroupFilenameLineFunctionStatus
The test did not complete due to a fatal error.Completion checktoken.test678TokenEntityTestCase->testEntityMapping()
Enabled modules: taxonomy, path, token, token_testOthertoken.test18TokenTestHelper->setUp()
ExpandFile token tests (TokenFileTestCase) [Token]070
MessageGroupFilenameLineFunctionStatus
Enabled modules: path, token, token_testOthertoken.test18TokenTestHelper->setUp()
Token value for [file:basename] was not generated.Othertoken.test1045TokenFileTestCase->testFileTokens()
Token value for [file:extension] was not generated.Othertoken.test1045TokenFileTestCase->testFileTokens()
Token value for [file:size-raw] was not generated.Othertoken.test1045TokenFileTestCase->testFileTokens()
Token value for [file:basename] was not generated.Othertoken.test1056TokenFileTestCase->testFileTokens()
Token value for [file:extension] was not generated.Othertoken.test1056TokenFileTestCase->testFileTokens()
Token value for [file:size-raw] was not generated.Othertoken.test1056TokenFileTestCase->testFileTokens()
ExpandMenu link and menu token tests (TokenMenuTestCase) [Token]6502
MessageGroupFilenameLineFunctionStatus
Enabled modules: menu, path, token, token_testOthertoken.test18TokenTestHelper->setUp()
Token value for [menu-link:mlid] was not generated.Othertoken.test427TokenMenuTestCase->testMenuTokens()
Token value for [menu-link:title] was not generated.Othertoken.test427TokenMenuTestCase->testMenuTokens()
Token value for [menu-link:menu] was not generated.Othertoken.test427TokenMenuTestCase->testMenuTokens()
Token value for [menu-link:menu:name] was not generated.Othertoken.test427TokenMenuTestCase->testMenuTokens()
Token value for [menu-link:menu:machine-name] was not generated.Othertoken.test427TokenMenuTestCase->testMenuTokens()
Token value for [menu-link:menu:description] was not generated.Othertoken.test427TokenMenuTestCase->testMenuTokens()
Token value for [menu-link:menu:menu-link-count] was not generated.Othertoken.test427TokenMenuTestCase->testMenuTokens()
Token value for [menu-link:menu:edit-url] was not generated.Othertoken.test427TokenMenuTestCase->testMenuTokens()
Token value for [menu-link:url] was not generated.Othertoken.test427TokenMenuTestCase->testMenuTokens()
Token value for [menu-link:url:absolute] was not generated.Othertoken.test427TokenMenuTestCase->testMenuTokens()
Token value for [menu-link:url:relative] was not generated.Othertoken.test427TokenMenuTestCase->testMenuTokens()
Token value for [menu-link:url:path] was not generated.Othertoken.test427TokenMenuTestCase->testMenuTokens()
Token value for [menu-link:url:alias] was not generated.Othertoken.test427TokenMenuTestCase->testMenuTokens()
Token value for [menu-link:edit-url] was not generated.Othertoken.test427TokenMenuTestCase->testMenuTokens()
Token value for [menu-link:parent] was not generated.Othertoken.test427TokenMenuTestCase->testMenuTokens()
Token value for [menu-link:parent:mlid] was not generated.Othertoken.test427TokenMenuTestCase->testMenuTokens()
Token value for [menu-link:parent:title] was not generated.Othertoken.test427TokenMenuTestCase->testMenuTokens()
Token value for [menu-link:parent:menu] was not generated.Othertoken.test427TokenMenuTestCase->testMenuTokens()
Token value for [menu-link:parents] was not generated.Othertoken.test427TokenMenuTestCase->testMenuTokens()
Token value for [menu-link:parents:count] was not generated.Othertoken.test427TokenMenuTestCase->testMenuTokens()
Token value for [menu-link:parents:keys] was not generated.Othertoken.test427TokenMenuTestCase->testMenuTokens()
Token value for [menu-link:root] was not generated.Othertoken.test427TokenMenuTestCase->testMenuTokens()
Token value for [menu-link:root:mlid] was not generated.Othertoken.test427TokenMenuTestCase->testMenuTokens()
Undefined index: mlidNoticetoken.test442TokenMenuTestCase->testMenuTokens()
Undefined index: mlidNoticetoken.test447TokenMenuTestCase->testMenuTokens()
Token value for [node:menu-link] was not generated.Othertoken.test457TokenMenuTestCase->testMenuTokens()
Token value for [node:menu-link:title] was not generated.Othertoken.test457TokenMenuTestCase->testMenuTokens()
Token value for [node:menu-link:menu] was not generated.Othertoken.test457TokenMenuTestCase->testMenuTokens()
Token value for [node:menu-link:url] was not generated.Othertoken.test457TokenMenuTestCase->testMenuTokens()
Token value for [node:menu-link:url:path] was not generated.Othertoken.test457TokenMenuTestCase->testMenuTokens()
Token value for [node:menu-link:edit-url] was not generated.Othertoken.test457TokenMenuTestCase->testMenuTokens()
Token value for [node:menu-link:parent] was not generated.Othertoken.test457TokenMenuTestCase->testMenuTokens()
Token value for [node:menu-link:parent:mlid] was not generated.Othertoken.test457TokenMenuTestCase->testMenuTokens()
Token value for [node:menu-link:parents] was not generated.Othertoken.test457TokenMenuTestCase->testMenuTokens()
Token value for [node:menu-link:parents:count] was not generated.Othertoken.test457TokenMenuTestCase->testMenuTokens()
Token value for [node:menu-link:parents:keys] was not generated.Othertoken.test457TokenMenuTestCase->testMenuTokens()
Token value for [node:menu-link:root] was not generated.Othertoken.test457TokenMenuTestCase->testMenuTokens()
Token value for [node:menu-link:root:mlid] was not generated.Othertoken.test457TokenMenuTestCase->testMenuTokens()
Token value for [node:menu-link] was not generated.Othertoken.test461TokenMenuTestCase->testMenuTokens()
Token value for [node:menu-link:title] was not generated.Othertoken.test461TokenMenuTestCase->testMenuTokens()
Token value for [node:menu-link:menu] was not generated.Othertoken.test461TokenMenuTestCase->testMenuTokens()
Token value for [node:menu-link:url] was not generated.Othertoken.test461TokenMenuTestCase->testMenuTokens()
Token value for [node:menu-link:url:path] was not generated.Othertoken.test461TokenMenuTestCase->testMenuTokens()
Token value for [node:menu-link:edit-url] was not generated.Othertoken.test461TokenMenuTestCase->testMenuTokens()
Token value for [node:menu-link:parent] was not generated.Othertoken.test461TokenMenuTestCase->testMenuTokens()
Token value for [node:menu-link:parent:mlid] was not generated.Othertoken.test461TokenMenuTestCase->testMenuTokens()
Token value for [node:menu-link:parents] was not generated.Othertoken.test461TokenMenuTestCase->testMenuTokens()
Token value for [node:menu-link:parents:count] was not generated.Othertoken.test461TokenMenuTestCase->testMenuTokens()
Token value for [node:menu-link:parents:keys] was not generated.Othertoken.test461TokenMenuTestCase->testMenuTokens()
Token value for [node:menu-link:root] was not generated.Othertoken.test461TokenMenuTestCase->testMenuTokens()
Token value for [node:menu-link:root:mlid] was not generated.Othertoken.test461TokenMenuTestCase->testMenuTokens()
ExpandNode and content type token tests (TokenNodeTestCase) [Token]8270
MessageGroupFilenameLineFunctionStatus
Enabled modules: path, token, token_testOthertoken.test18TokenTestHelper->setUp()
Token value for [node:log] was not generated.Othertoken.test339TokenNodeTestCase->testNodeTokens()
Token value for [node:url:path] was not generated.Othertoken.test339TokenNodeTestCase->testNodeTokens()
Token value for [node:url:absolute] was not generated.Othertoken.test339TokenNodeTestCase->testNodeTokens()
Token value for [node:url:relative] was not generated.Othertoken.test339TokenNodeTestCase->testNodeTokens()
Token value for [node:url:unaliased:path] was not generated.Othertoken.test339TokenNodeTestCase->testNodeTokens()
Token value for [node:content-type] was not generated.Othertoken.test339TokenNodeTestCase->testNodeTokens()
Token value for [node:content-type:name] was not generated.Othertoken.test339TokenNodeTestCase->testNodeTokens()
Token value for [node:content-type:machine-name] was not generated.Othertoken.test339TokenNodeTestCase->testNodeTokens()
Token value for [node:content-type:description] was not generated.Othertoken.test339TokenNodeTestCase->testNodeTokens()
Token value for [node:content-type:node-count] was not generated.Othertoken.test339TokenNodeTestCase->testNodeTokens()
Token value for [node:content-type:edit-url] was not generated.Othertoken.test339TokenNodeTestCase->testNodeTokens()
Token value for [node:url:alias] was not generated.Othertoken.test339TokenNodeTestCase->testNodeTokens()
Token value for [node:source] was not generated.Othertoken.test362TokenNodeTestCase->testNodeTokens()
Token value for [node:source:nid] was not generated.Othertoken.test362TokenNodeTestCase->testNodeTokens()
Token value for [node:log] was not generated.Othertoken.test362TokenNodeTestCase->testNodeTokens()
Token value for [node:url:path] was not generated.Othertoken.test362TokenNodeTestCase->testNodeTokens()
Token value for [node:url:absolute] was not generated.Othertoken.test362TokenNodeTestCase->testNodeTokens()
Token value for [node:url:relative] was not generated.Othertoken.test362TokenNodeTestCase->testNodeTokens()
Token value for [node:url:unaliased:path] was not generated.Othertoken.test362TokenNodeTestCase->testNodeTokens()
Token value for [node:content-type] was not generated.Othertoken.test362TokenNodeTestCase->testNodeTokens()
Token value for [node:content-type:name] was not generated.Othertoken.test362TokenNodeTestCase->testNodeTokens()
Token value for [node:content-type:machine-name] was not generated.Othertoken.test362TokenNodeTestCase->testNodeTokens()
Token value for [node:content-type:description] was not generated.Othertoken.test362TokenNodeTestCase->testNodeTokens()
Token value for [node:content-type:node-count] was not generated.Othertoken.test362TokenNodeTestCase->testNodeTokens()
Token value for [node:content-type:edit-url] was not generated.Othertoken.test362TokenNodeTestCase->testNodeTokens()
Token value for [node:url:alias] was not generated.Othertoken.test362TokenNodeTestCase->testNodeTokens()
ExpandProfile token tests (TokenProfileTestCase) [Token]820
MessageGroupFilenameLineFunctionStatus
The test did not complete due to a fatal error.Completion checktoken.test761TokenProfileTestCase->testProfileTokens()
Enabled modules: profile, path, token, token_testOthertoken.test18TokenTestHelper->setUp()
ExpandRandom token tests (TokenRandomTestCase) [Token]290
MessageGroupFilenameLineFunctionStatus
Enabled modules: path, token, token_testOthertoken.test18TokenTestHelper->setUp()
Token value for [random:number] was not generated.Othertoken.test992TokenRandomTestCase->testRandomTokens()
Token value for [random:hash:md5] was not generated.Othertoken.test992TokenRandomTestCase->testRandomTokens()
Token value for [random:hash:sha1] was not generated.Othertoken.test992TokenRandomTestCase->testRandomTokens()
Token value for [random:hash:sha256] was not generated.Othertoken.test992TokenRandomTestCase->testRandomTokens()
Token value for [random:number] was not generated.Othertoken.test993TokenRandomTestCase->testRandomTokens()
Token value for [random:hash:md5] was not generated.Othertoken.test993TokenRandomTestCase->testRandomTokens()
Token value for [random:hash:sha1] was not generated.Othertoken.test993TokenRandomTestCase->testRandomTokens()
Token value for [random:hash:sha256] was not generated.Othertoken.test993TokenRandomTestCase->testRandomTokens()
ExpandTaxonomy and vocabulary token tests (TokenTaxonomyTestCase) [Token]020
MessageGroupFilenameLineFunctionStatus
The test did not complete due to a fatal error.Completion checktoken.test496TokenTaxonomyTestCase->testTaxonomyTokens()
Enabled modules: taxonomy, path, token, token_testOthertoken.test18TokenTestHelper->setUp()
ExpandToken unit tests (TokenUnitTestCase) [Token]020
MessageGroupFilenameLineFunctionStatus
The test did not complete due to a fatal error.Completion checktoken.test132TokenUnitTestCase->testGetInvalidTokens()
Enabled modules: path, token, token_testOthertoken.test18TokenTestHelper->setUp()
ExpandURL token tests (TokenURLTestCase) [Token]3130
MessageGroupFilenameLineFunctionStatus
Enabled modules: path, token, token_testOthertoken.test18TokenTestHelper->setUp()
Token value for [url:absolute] was not generated.Othertoken.test241TokenURLTestCase->testURLTokens()
Token value for [url:relative] was not generated.Othertoken.test241TokenURLTestCase->testURLTokens()
Token value for [url:path] was not generated.Othertoken.test241TokenURLTestCase->testURLTokens()
Token value for [url:brief] was not generated.Othertoken.test241TokenURLTestCase->testURLTokens()
Token value for [url:args:value:0] was not generated.Othertoken.test241TokenURLTestCase->testURLTokens()
Token value for [url:unaliased] was not generated.Othertoken.test241TokenURLTestCase->testURLTokens()
Token value for [url:unaliased:relative] was not generated.Othertoken.test241TokenURLTestCase->testURLTokens()
Token value for [url:unaliased:path] was not generated.Othertoken.test241TokenURLTestCase->testURLTokens()
Token value for [url:unaliased:brief] was not generated.Othertoken.test241TokenURLTestCase->testURLTokens()
Token value for [url:unaliased:args:value:0] was not generated.Othertoken.test241TokenURLTestCase->testURLTokens()
Token value for [url:unaliased:args:value:1] was not generated.Othertoken.test241TokenURLTestCase->testURLTokens()
Token value for [url:alias] was not generated.Othertoken.test241TokenURLTestCase->testURLTokens()
ExpandUser token tests (TokenUserTestCase) [Token]22110
MessageGroupFilenameLineFunctionStatus
Enabled modules: path, token, token_testOthertoken.test18TokenTestHelper->setUp()
Token value for [user:picture] was not generated.Othertoken.test620TokenUserTestCase->testUserTokens()
Token value for [user:picture:fid] was not generated.Othertoken.test620TokenUserTestCase->testUserTokens()
Token value for [user:picture:size-raw] was not generated.Othertoken.test620TokenUserTestCase->testUserTokens()
Token value for [user:roles] was not generated.Othertoken.test620TokenUserTestCase->testUserTokens()
Token value for [user:roles:keys] was not generated.Othertoken.test620TokenUserTestCase->testUserTokens()
Token value for [user:roles] was not generated.Othertoken.test637TokenUserTestCase->testUserTokens()
Token value for [user:roles:keys] was not generated.Othertoken.test637TokenUserTestCase->testUserTokens()
Token value for [current-user:ip-address] was not generated.Othertoken.test643TokenUserTestCase->testUserTokens()
Token value for [user:roles] was not generated.Othertoken.test652TokenUserTestCase->testUserTokens()
Token value for [user:roles:keys] was not generated.Othertoken.test652TokenUserTestCase->testUserTokens()

All

Test namePassFailException
ExpandArray token tests (TokenArrayTestCase) [Token]0290
MessageGroupFilenameLineFunctionStatus
Enabled modules: path, token, token_testOthertoken.test18TokenTestHelper->setUp()
Token value for [array:first] was not generated.Othertoken.test943TokenArrayTestCase->testArrayTokens()
Token value for [array:last] was not generated.Othertoken.test943TokenArrayTestCase->testArrayTokens()
Token value for [array:value:0] was not generated.Othertoken.test943TokenArrayTestCase->testArrayTokens()
Token value for [array:value:2] was not generated.Othertoken.test943TokenArrayTestCase->testArrayTokens()
Token value for [array:count] was not generated.Othertoken.test943TokenArrayTestCase->testArrayTokens()
Token value for [array:keys] was not generated.Othertoken.test943TokenArrayTestCase->testArrayTokens()
Token value for [array:keys:value:3] was not generated.Othertoken.test943TokenArrayTestCase->testArrayTokens()
Token value for [array:keys:join] was not generated.Othertoken.test943TokenArrayTestCase->testArrayTokens()
Token value for [array:reversed] was not generated.Othertoken.test943TokenArrayTestCase->testArrayTokens()
Token value for [array:reversed:keys] was not generated.Othertoken.test943TokenArrayTestCase->testArrayTokens()
Token value for [array:join:/] was not generated.Othertoken.test943TokenArrayTestCase->testArrayTokens()
Token value for [array:join] was not generated.Othertoken.test943TokenArrayTestCase->testArrayTokens()
Token value for [array:join:, ] was not generated.Othertoken.test943TokenArrayTestCase->testArrayTokens()
Token value for [array:join: ] was not generated.Othertoken.test943TokenArrayTestCase->testArrayTokens()
Token value for [array:first] was not generated.Othertoken.test970TokenArrayTestCase->testArrayTokens()
Token value for [array:last] was not generated.Othertoken.test970TokenArrayTestCase->testArrayTokens()
Token value for [array:value:0] was not generated.Othertoken.test970TokenArrayTestCase->testArrayTokens()
Token value for [array:value:2] was not generated.Othertoken.test970TokenArrayTestCase->testArrayTokens()
Token value for [array:count] was not generated.Othertoken.test970TokenArrayTestCase->testArrayTokens()
Token value for [array:keys] was not generated.Othertoken.test970TokenArrayTestCase->testArrayTokens()
Token value for [array:keys:value:3] was not generated.Othertoken.test970TokenArrayTestCase->testArrayTokens()
Token value for [array:keys:join] was not generated.Othertoken.test970TokenArrayTestCase->testArrayTokens()
Token value for [array:reversed] was not generated.Othertoken.test970TokenArrayTestCase->testArrayTokens()
Token value for [array:reversed:keys] was not generated.Othertoken.test970TokenArrayTestCase->testArrayTokens()
Token value for [array:join:/] was not generated.Othertoken.test970TokenArrayTestCase->testArrayTokens()
Token value for [array:join] was not generated.Othertoken.test970TokenArrayTestCase->testArrayTokens()
Token value for [array:join:, ] was not generated.Othertoken.test970TokenArrayTestCase->testArrayTokens()
Token value for [array:join: ] was not generated.Othertoken.test970TokenArrayTestCase->testArrayTokens()
ExpandBlock token tests (TokenBlockTestCase) [Token]9204
MessageGroupFilenameLineFunctionStatus
Enabled modules: block, path, token, token_testOthertoken.test18TokenTestHelper->setUp()
Invalid permission administer blocks.Roletoken.test1073TokenBlockTestCase->setUp()
Argument 1 passed to DrupalWebTestCase::drupalLogin() must be an instance of stdClass, boolean given, called in /var/lib/drupaltestbot/sites/default/files/checkout/sites/default/modules/token/token.test on line 1074 and definedRecoverable errordrupal_web_test_case.php1252DrupalWebTestCase->drupalLogin()
Trying to get property of non-objectNoticedrupal_web_test_case.php1258DrupalWebTestCase->drupalLogin()
Trying to get property of non-objectNoticedrupal_web_test_case.php1259DrupalWebTestCase->drupalLogin()
Failed to set field name to Othertoken.test1074TokenBlockTestCase->setUp()
Failed to set field pass to Othertoken.test1074TokenBlockTestCase->setUp()
Found the requested form fields at userOthertoken.test1074TokenBlockTestCase->setUp()
Trying to get property of non-objectNoticedrupal_web_test_case.php1265DrupalWebTestCase->drupalLogin()
User successfully logged in.User logintoken.test1074TokenBlockTestCase->setUp()
Failed to set field title to [user:name]Othertoken.test1081TokenBlockTestCase->testBlockTitleTokens()
Failed to set field info to Test token title blockOthertoken.test1081TokenBlockTestCase->testBlockTitleTokens()
Failed to set field body[value] to This is the test token title block.Othertoken.test1081TokenBlockTestCase->testBlockTitleTokens()
Found the Save block buttonOthertoken.test1081TokenBlockTestCase->testBlockTitleTokens()
Found the requested form fields at admin/structure/block/addOthertoken.test1081TokenBlockTestCase->testBlockTitleTokens()
"The Block title is using the following invalid tokens: [user:name]." foundOthertoken.test1083TokenBlockTestCase->testBlockTitleTokens()
Failed to set field title to [current-page:title] block titleOthertoken.test1088TokenBlockTestCase->testBlockTitleTokens()
Failed to set field info to Test token title blockOthertoken.test1088TokenBlockTestCase->testBlockTitleTokens()
Failed to set field body[value] to This is the test token title block.Othertoken.test1088TokenBlockTestCase->testBlockTitleTokens()
Failed to set field regions[bartik] to sidebar_firstOthertoken.test1088TokenBlockTestCase->testBlockTitleTokens()
Found the Save block buttonOthertoken.test1088TokenBlockTestCase->testBlockTitleTokens()
Found the requested form fields at Othertoken.test1088TokenBlockTestCase->testBlockTitleTokens()
"Welcome to Drupal block title" foundOthertoken.test1091TokenBlockTestCase->testBlockTitleTokens()
Raw "Site's first node block title" foundOthertoken.test1097TokenBlockTestCase->testBlockTitleTokens()
ExpandComment token tests (TokenCommentTestCase) [Token]011
MessageGroupFilenameLineFunctionStatus
Enabled modules: comment, path, token, token_testOthertoken.test18TokenTestHelper->setUp()
PDOException: SQLSTATE[42S02]: Base table or view not found: 1146 Table 'drupaltestbotmysql.simpletest513534comment' doesn't exist: SELECT MAX(thread) FROM {comment} WHERE nid = :nid; Array ( [:nid] => 1 ) in comment_save() (line 1516 of /var/lib/drupaltestbot/sites/default/files/checkout/modules/comment/comment.module).Uncaught exceptiondatabase.inc2171PDOStatement->execute()
ExpandCurrent page token tests (TokenCurrentPageTestCase) [Token]430
MessageGroupFilenameLineFunctionStatus
Enabled modules: path, token, token_testOthertoken.test18TokenTestHelper->setUp()
Failed to generate tokens.Othertoken.test887TokenCurrentPageTestCase->testCurrentPageTokens()
Failed to generate tokens.Othertoken.test911TokenCurrentPageTestCase->testCurrentPageTokens()
ExpandDate token tests (TokenDateTestCase) [Token]120
MessageGroupFilenameLineFunctionStatus
Enabled modules: path, token, token_testOthertoken.test18TokenTestHelper->setUp()
Token value for [date:token_test] was not generated.Othertoken.test1018TokenDateTestCase->testDateTokens()
ExpandEntity token tests (TokenEntityTestCase) [Token]020
MessageGroupFilenameLineFunctionStatus
The test did not complete due to a fatal error.Completion checktoken.test678TokenEntityTestCase->testEntityMapping()
Enabled modules: taxonomy, path, token, token_testOthertoken.test18TokenTestHelper->setUp()
ExpandFile token tests (TokenFileTestCase) [Token]070
MessageGroupFilenameLineFunctionStatus
Enabled modules: path, token, token_testOthertoken.test18TokenTestHelper->setUp()
Token value for [file:basename] was not generated.Othertoken.test1045TokenFileTestCase->testFileTokens()
Token value for [file:extension] was not generated.Othertoken.test1045TokenFileTestCase->testFileTokens()
Token value for [file:size-raw] was not generated.Othertoken.test1045TokenFileTestCase->testFileTokens()
Token value for [file:basename] was not generated.Othertoken.test1056TokenFileTestCase->testFileTokens()
Token value for [file:extension] was not generated.Othertoken.test1056TokenFileTestCase->testFileTokens()
Token value for [file:size-raw] was not generated.Othertoken.test1056TokenFileTestCase->testFileTokens()
ExpandMenu link and menu token tests (TokenMenuTestCase) [Token]6502
MessageGroupFilenameLineFunctionStatus
Enabled modules: menu, path, token, token_testOthertoken.test18TokenTestHelper->setUp()
Token value for [menu-link:mlid] was not generated.Othertoken.test427TokenMenuTestCase->testMenuTokens()
Token value for [menu-link:title] was not generated.Othertoken.test427TokenMenuTestCase->testMenuTokens()
Token value for [menu-link:menu] was not generated.Othertoken.test427TokenMenuTestCase->testMenuTokens()
Token value for [menu-link:menu:name] was not generated.Othertoken.test427TokenMenuTestCase->testMenuTokens()
Token value for [menu-link:menu:machine-name] was not generated.Othertoken.test427TokenMenuTestCase->testMenuTokens()
Token value for [menu-link:menu:description] was not generated.Othertoken.test427TokenMenuTestCase->testMenuTokens()
Token value for [menu-link:menu:menu-link-count] was not generated.Othertoken.test427TokenMenuTestCase->testMenuTokens()
Token value for [menu-link:menu:edit-url] was not generated.Othertoken.test427TokenMenuTestCase->testMenuTokens()
Token value for [menu-link:url] was not generated.Othertoken.test427TokenMenuTestCase->testMenuTokens()
Token value for [menu-link:url:absolute] was not generated.Othertoken.test427TokenMenuTestCase->testMenuTokens()
Token value for [menu-link:url:relative] was not generated.Othertoken.test427TokenMenuTestCase->testMenuTokens()
Token value for [menu-link:url:path] was not generated.Othertoken.test427TokenMenuTestCase->testMenuTokens()
Token value for [menu-link:url:alias] was not generated.Othertoken.test427TokenMenuTestCase->testMenuTokens()
Token value for [menu-link:edit-url] was not generated.Othertoken.test427TokenMenuTestCase->testMenuTokens()
Token value for [menu-link:parent] was not generated.Othertoken.test427TokenMenuTestCase->testMenuTokens()
Token value for [menu-link:parent:mlid] was not generated.Othertoken.test427TokenMenuTestCase->testMenuTokens()
Token value for [menu-link:parent:title] was not generated.Othertoken.test427TokenMenuTestCase->testMenuTokens()
Token value for [menu-link:parent:menu] was not generated.Othertoken.test427TokenMenuTestCase->testMenuTokens()
Token value for [menu-link:parents] was not generated.Othertoken.test427TokenMenuTestCase->testMenuTokens()
Token value for [menu-link:parents:count] was not generated.Othertoken.test427TokenMenuTestCase->testMenuTokens()
Token value for [menu-link:parents:keys] was not generated.Othertoken.test427TokenMenuTestCase->testMenuTokens()
Token value for [menu-link:root] was not generated.Othertoken.test427TokenMenuTestCase->testMenuTokens()
Token value for [menu-link:root:mlid] was not generated.Othertoken.test427TokenMenuTestCase->testMenuTokens()
Undefined index: mlidNoticetoken.test442TokenMenuTestCase->testMenuTokens()
Undefined index: mlidNoticetoken.test447TokenMenuTestCase->testMenuTokens()
Token value for [node:menu-link] was not generated.Othertoken.test457TokenMenuTestCase->testMenuTokens()
Token value for [node:menu-link:title] was not generated.Othertoken.test457TokenMenuTestCase->testMenuTokens()
Token value for [node:menu-link:menu] was not generated.Othertoken.test457TokenMenuTestCase->testMenuTokens()
Token value for [node:menu-link:url] was not generated.Othertoken.test457TokenMenuTestCase->testMenuTokens()
Token value for [node:menu-link:url:path] was not generated.Othertoken.test457TokenMenuTestCase->testMenuTokens()
Token value for [node:menu-link:edit-url] was not generated.Othertoken.test457TokenMenuTestCase->testMenuTokens()
Token value for [node:menu-link:parent] was not generated.Othertoken.test457TokenMenuTestCase->testMenuTokens()
Token value for [node:menu-link:parent:mlid] was not generated.Othertoken.test457TokenMenuTestCase->testMenuTokens()
Token value for [node:menu-link:parents] was not generated.Othertoken.test457TokenMenuTestCase->testMenuTokens()
Token value for [node:menu-link:parents:count] was not generated.Othertoken.test457TokenMenuTestCase->testMenuTokens()
Token value for [node:menu-link:parents:keys] was not generated.Othertoken.test457TokenMenuTestCase->testMenuTokens()
Token value for [node:menu-link:root] was not generated.Othertoken.test457TokenMenuTestCase->testMenuTokens()
Token value for [node:menu-link:root:mlid] was not generated.Othertoken.test457TokenMenuTestCase->testMenuTokens()
Token value for [node:menu-link] was not generated.Othertoken.test461TokenMenuTestCase->testMenuTokens()
Token value for [node:menu-link:title] was not generated.Othertoken.test461TokenMenuTestCase->testMenuTokens()
Token value for [node:menu-link:menu] was not generated.Othertoken.test461TokenMenuTestCase->testMenuTokens()
Token value for [node:menu-link:url] was not generated.Othertoken.test461TokenMenuTestCase->testMenuTokens()
Token value for [node:menu-link:url:path] was not generated.Othertoken.test461TokenMenuTestCase->testMenuTokens()
Token value for [node:menu-link:edit-url] was not generated.Othertoken.test461TokenMenuTestCase->testMenuTokens()
Token value for [node:menu-link:parent] was not generated.Othertoken.test461TokenMenuTestCase->testMenuTokens()
Token value for [node:menu-link:parent:mlid] was not generated.Othertoken.test461TokenMenuTestCase->testMenuTokens()
Token value for [node:menu-link:parents] was not generated.Othertoken.test461TokenMenuTestCase->testMenuTokens()
Token value for [node:menu-link:parents:count] was not generated.Othertoken.test461TokenMenuTestCase->testMenuTokens()
Token value for [node:menu-link:parents:keys] was not generated.Othertoken.test461TokenMenuTestCase->testMenuTokens()
Token value for [node:menu-link:root] was not generated.Othertoken.test461TokenMenuTestCase->testMenuTokens()
Token value for [node:menu-link:root:mlid] was not generated.Othertoken.test461TokenMenuTestCase->testMenuTokens()
ExpandNode and content type token tests (TokenNodeTestCase) [Token]8270
MessageGroupFilenameLineFunctionStatus
Enabled modules: path, token, token_testOthertoken.test18TokenTestHelper->setUp()
Token value for [node:log] was not generated.Othertoken.test339TokenNodeTestCase->testNodeTokens()
Token value for [node:url:path] was not generated.Othertoken.test339TokenNodeTestCase->testNodeTokens()
Token value for [node:url:absolute] was not generated.Othertoken.test339TokenNodeTestCase->testNodeTokens()
Token value for [node:url:relative] was not generated.Othertoken.test339TokenNodeTestCase->testNodeTokens()
Token value for [node:url:unaliased:path] was not generated.Othertoken.test339TokenNodeTestCase->testNodeTokens()
Token value for [node:content-type] was not generated.Othertoken.test339TokenNodeTestCase->testNodeTokens()
Token value for [node:content-type:name] was not generated.Othertoken.test339TokenNodeTestCase->testNodeTokens()
Token value for [node:content-type:machine-name] was not generated.Othertoken.test339TokenNodeTestCase->testNodeTokens()
Token value for [node:content-type:description] was not generated.Othertoken.test339TokenNodeTestCase->testNodeTokens()
Token value for [node:content-type:node-count] was not generated.Othertoken.test339TokenNodeTestCase->testNodeTokens()
Token value for [node:content-type:edit-url] was not generated.Othertoken.test339TokenNodeTestCase->testNodeTokens()
Token value for [node:url:alias] was not generated.Othertoken.test339TokenNodeTestCase->testNodeTokens()
Token value for [node:source] was not generated.Othertoken.test362TokenNodeTestCase->testNodeTokens()
Token value for [node:source:nid] was not generated.Othertoken.test362TokenNodeTestCase->testNodeTokens()
Token value for [node:log] was not generated.Othertoken.test362TokenNodeTestCase->testNodeTokens()
Token value for [node:url:path] was not generated.Othertoken.test362TokenNodeTestCase->testNodeTokens()
Token value for [node:url:absolute] was not generated.Othertoken.test362TokenNodeTestCase->testNodeTokens()
Token value for [node:url:relative] was not generated.Othertoken.test362TokenNodeTestCase->testNodeTokens()
Token value for [node:url:unaliased:path] was not generated.Othertoken.test362TokenNodeTestCase->testNodeTokens()
Token value for [node:content-type] was not generated.Othertoken.test362TokenNodeTestCase->testNodeTokens()
Token value for [node:content-type:name] was not generated.Othertoken.test362TokenNodeTestCase->testNodeTokens()
Token value for [node:content-type:machine-name] was not generated.Othertoken.test362TokenNodeTestCase->testNodeTokens()
Token value for [node:content-type:description] was not generated.Othertoken.test362TokenNodeTestCase->testNodeTokens()
Token value for [node:content-type:node-count] was not generated.Othertoken.test362TokenNodeTestCase->testNodeTokens()
Token value for [node:content-type:edit-url] was not generated.Othertoken.test362TokenNodeTestCase->testNodeTokens()
Token value for [node:url:alias] was not generated.Othertoken.test362TokenNodeTestCase->testNodeTokens()
ExpandProfile token tests (TokenProfileTestCase) [Token]820
MessageGroupFilenameLineFunctionStatus
The test did not complete due to a fatal error.Completion checktoken.test761TokenProfileTestCase->testProfileTokens()
Enabled modules: profile, path, token, token_testOthertoken.test18TokenTestHelper->setUp()
ExpandRandom token tests (TokenRandomTestCase) [Token]290
MessageGroupFilenameLineFunctionStatus
Enabled modules: path, token, token_testOthertoken.test18TokenTestHelper->setUp()
Token value for [random:number] was not generated.Othertoken.test992TokenRandomTestCase->testRandomTokens()
Token value for [random:hash:md5] was not generated.Othertoken.test992TokenRandomTestCase->testRandomTokens()
Token value for [random:hash:sha1] was not generated.Othertoken.test992TokenRandomTestCase->testRandomTokens()
Token value for [random:hash:sha256] was not generated.Othertoken.test992TokenRandomTestCase->testRandomTokens()
Token value for [random:number] was not generated.Othertoken.test993TokenRandomTestCase->testRandomTokens()
Token value for [random:hash:md5] was not generated.Othertoken.test993TokenRandomTestCase->testRandomTokens()
Token value for [random:hash:sha1] was not generated.Othertoken.test993TokenRandomTestCase->testRandomTokens()
Token value for [random:hash:sha256] was not generated.Othertoken.test993TokenRandomTestCase->testRandomTokens()
ExpandTaxonomy and vocabulary token tests (TokenTaxonomyTestCase) [Token]020
MessageGroupFilenameLineFunctionStatus
The test did not complete due to a fatal error.Completion checktoken.test496TokenTaxonomyTestCase->testTaxonomyTokens()
Enabled modules: taxonomy, path, token, token_testOthertoken.test18TokenTestHelper->setUp()
ExpandToken unit tests (TokenUnitTestCase) [Token]020
MessageGroupFilenameLineFunctionStatus
The test did not complete due to a fatal error.Completion checktoken.test132TokenUnitTestCase->testGetInvalidTokens()
Enabled modules: path, token, token_testOthertoken.test18TokenTestHelper->setUp()
ExpandURL token tests (TokenURLTestCase) [Token]3130
MessageGroupFilenameLineFunctionStatus
Enabled modules: path, token, token_testOthertoken.test18TokenTestHelper->setUp()
Token value for [url:absolute] was not generated.Othertoken.test241TokenURLTestCase->testURLTokens()
Token value for [url:relative] was not generated.Othertoken.test241TokenURLTestCase->testURLTokens()
Token value for [url:path] was not generated.Othertoken.test241TokenURLTestCase->testURLTokens()
Token value for [url:brief] was not generated.Othertoken.test241TokenURLTestCase->testURLTokens()
Token value for [url:args:value:0] was not generated.Othertoken.test241TokenURLTestCase->testURLTokens()
Token value for [url:unaliased] was not generated.Othertoken.test241TokenURLTestCase->testURLTokens()
Token value for [url:unaliased:relative] was not generated.Othertoken.test241TokenURLTestCase->testURLTokens()
Token value for [url:unaliased:path] was not generated.Othertoken.test241TokenURLTestCase->testURLTokens()
Token value for [url:unaliased:brief] was not generated.Othertoken.test241TokenURLTestCase->testURLTokens()
Token value for [url:unaliased:args:value:0] was not generated.Othertoken.test241TokenURLTestCase->testURLTokens()
Token value for [url:unaliased:args:value:1] was not generated.Othertoken.test241TokenURLTestCase->testURLTokens()
Token value for [url:alias] was not generated.Othertoken.test241TokenURLTestCase->testURLTokens()
ExpandUser token tests (TokenUserTestCase) [Token]22110
MessageGroupFilenameLineFunctionStatus
Enabled modules: path, token, token_testOthertoken.test18TokenTestHelper->setUp()
Token value for [user:picture] was not generated.Othertoken.test620TokenUserTestCase->testUserTokens()
Token value for [user:picture:fid] was not generated.Othertoken.test620TokenUserTestCase->testUserTokens()
Token value for [user:picture:size-raw] was not generated.Othertoken.test620TokenUserTestCase->testUserTokens()
Token value for [user:roles] was not generated.Othertoken.test620TokenUserTestCase->testUserTokens()
Token value for [user:roles:keys] was not generated.Othertoken.test620TokenUserTestCase->testUserTokens()
Token value for [user:roles] was not generated.Othertoken.test637TokenUserTestCase->testUserTokens()
Token value for [user:roles:keys] was not generated.Othertoken.test637TokenUserTestCase->testUserTokens()
Token value for [current-user:ip-address] was not generated.Othertoken.test643TokenUserTestCase->testUserTokens()
Token value for [user:roles] was not generated.Othertoken.test652TokenUserTestCase->testUserTokens()
Token value for [user:roles:keys] was not generated.Othertoken.test652TokenUserTestCase->testUserTokens()